FailedConsole Output

Skipping 34,268 KB.. Full Log
S: lldb-unit :: Utility/./UtilityTests/ScalarTest.SetValueFromData (19 of 2110)
PASS: lldb-api :: functionalities/data-formatter/data-formatter-objc/TestDataFormatterObjCExpr.py (20 of 2110)
PASS: lldb-shell :: SymbolFile/DWARF/dir-separator-posix.s (21 of 2110)
PASS: lldb-unit :: UnwindAssembly/x86/./UnwindAssemblyx86Tests/Testx86AssemblyInspectionEngine.TestPushExtended (22 of 2110)
PASS: lldb-unit :: Utility/./UtilityTests/StreamTeeTest.Constructor1Stream (23 of 2110)
PASS: lldb-unit :: Process/minidump/./LLDBMinidumpTests/MinidumpParserTest.GetFilteredModuleList (24 of 2110)
PASS: lldb-api :: functionalities/data-formatter/nsarraysynth/TestNSArraySynthetic.py (25 of 2110)
PASS: lldb-api :: functionalities/load_using_paths/TestLoadUsingPaths.py (26 of 2110)
PASS: lldb-unit :: Process/gdb-remote/./ProcessGdbRemoteTests/GDBRemoteCommunicationServerTest.SendErrorResponse_ErrorList (27 of 2110)
PASS: lldb-unit :: Utility/./UtilityTests/RangeTest.Constructor (28 of 2110)
PASS: lldb-unit :: ScriptInterpreter/Python/./ScriptInterpreterPythonTests/PythonDataObjectsTest.TestDictionaryResolutionWithDot (29 of 2110)
PASS: lldb-api :: functionalities/archives/TestBSDArchives.py (30 of 2110)
PASS: lldb-api :: functionalities/tail_call_frames/sbapi_support/TestTailCallFrameSBAPI.py (31 of 2110)
PASS: lldb-api :: commands/expression/call-throws/TestCallThatThrows.py (32 of 2110)
PASS: lldb-shell :: Reproducer/TestProcessList.test (33 of 2110)
PASS: lldb-api :: lang/objc/objc-runtime-ivars/TestRuntimeIvars.py (34 of 2110)
PASS: lldb-unit :: SymbolFile/DWARF/./SymbolFileDWARFTests/SymbolFileDWARFTests.TestAbbrevOrder1Start1 (35 of 2110)
PASS: lldb-unit :: Utility/./UtilityTests/TimeoutTest.Construction (36 of 2110)
PASS: lldb-unit :: Utility/./UtilityTests/CompletionRequest.Constructor (37 of 2110)
PASS: lldb-unit :: Process/minidump/./LLDBMinidumpTests/RegisterContextMinidump.ConvertMinidumpContext_x86_32 (38 of 2110)
PASS: lldb-api :: functionalities/target_var/TestTargetVar.py (39 of 2110)
PASS: lldb-api :: commands/gui/invalid-args/TestInvalidArgsGui.py (40 of 2110)
PASS: lldb-unit :: Core/./LLDBCoreTests/RichManglingContextTest.FromCxxMethodName (41 of 2110)
PASS: lldb-unit :: ScriptInterpreter/Python/./ScriptInterpreterPythonTests/PythonDataObjectsTest.TestBorrowedReferences (42 of 2110)
PASS: lldb-unit :: Utility/./UtilityTests/StringExtractorTest.GetU32BigEndian (43 of 2110)
PASS: lldb-unit :: Expression/./ExpressionTests/CppModuleConfigurationTest.UnrelatedLibrary (44 of 2110)
PASS: lldb-unit :: Utility/./UtilityTests/VMRange.Reset (45 of 2110)
PASS: lldb-shell :: Quit/TestQuitExitCode0.test (46 of 2110)
PASS: lldb-api :: lang/c/global_variables/TestGlobalVariables.py (47 of 2110)
UNSUPPORTED: lldb-api :: lang/c/typedef/Testtypedef.py (48 of 2110)
PASS: lldb-unit :: Utility/./UtilityTests/FileSpecTest.EqualDotsPosix (49 of 2110)
PASS: lldb-api :: functionalities/gdb_remote_client/TestJLink6Armv7RegisterDefinition.py (50 of 2110)
PASS: lldb-unit :: Expression/./ExpressionTests/DiagnosticManagerTest.AppendMessageSubsequentDiags (51 of 2110)
PASS: lldb-shell :: SymbolFile/DWARF/inline-function-address-shared.test (52 of 2110)
PASS: lldb-unit :: Language/Highlighting/./HighlighterTests/HighlighterTest.ClangPPDirectives (53 of 2110)
PASS: lldb-shell :: Driver/TestFile.test (54 of 2110)
PASS: lldb-unit :: Process/minidump/./LLDBMinidumpTests/MinidumpParserTest.GetArchitectureWindows (55 of 2110)
PASS: lldb-shell :: SymbolFile/DWARF/parallel-indexing-stress.s (56 of 2110)
PASS: lldb-shell :: SymbolFile/DWARF/inline-function-address.ll (57 of 2110)
PASS: lldb-unit :: Utility/./UtilityTests/StreamTest.PutCharWhitespace (58 of 2110)
PASS: lldb-api :: api/check_public_api_headers/TestPublicAPIHeaders.py (59 of 2110)
PASS: lldb-unit :: Utility/./UtilityTests/ArgsTest.TestTrailingBackslash (60 of 2110)
PASS: lldb-api :: functionalities/thread/concurrent_events/TestConcurrentDelaySignalWatch.py (61 of 2110)
PASS: lldb-shell :: SymbolFile/DWARF/clang-ast-from-dwarf-objc-property.m (62 of 2110)
PASS: lldb-api :: commands/expression/ir-interpreter/TestIRInterpreter.py (63 of 2110)
PASS: lldb-unit :: Expression/./ExpressionTests/DWARFExpression.DW_OP_stack_value (64 of 2110)
PASS: lldb-unit :: Utility/./UtilityTests/DeserializerTest.HasData (65 of 2110)
PASS: lldb-unit :: Process/minidump/./LLDBMinidumpTests/MinidumpParserTest.GetThreadsAndGetThreadContext (66 of 2110)
PASS: lldb-api :: lang/c/blocks/TestBlocks.py (67 of 2110)
PASS: lldb-unit :: Language/CPlusPlus/./LanguageCPlusPlusTests/CPlusPlusLanguage.ExtractContextAndIdentifier (68 of 2110)
PASS: lldb-api :: tools/lldb-server/TestGdbRemoteKill.py (69 of 2110)
PASS: lldb-unit :: Utility/./UtilityTests/ProcessInstanceInfo.DumpTable_invalidUID (70 of 2110)
PASS: lldb-api :: functionalities/multidebugger_commands/TestMultipleDebuggersCommands.py (71 of 2110)
PASS: lldb-api :: lang/cpp/dynamic-value/TestCppValueCast.py (72 of 2110)
PASS: lldb-api :: lang/objc/foundation/TestObjCMethods.py (73 of 2110)
PASS: lldb-unit :: ScriptInterpreter/Python/./ScriptInterpreterPythonTests/PythonDataObjectsTest.TestPythonCallableCheck (74 of 2110)
PASS: lldb-unit :: Utility/./UtilityTests/VASprintfTest.BufferResize (75 of 2110)
PASS: lldb-unit :: Target/./TargetTests/RemoteAwarePlatformTest.TestResolveExecutabelOnClientByPlatform (76 of 2110)
PASS: lldb-shell :: SymbolFile/symbol-binding.test (77 of 2110)
PASS: lldb-unit :: Utility/./UtilityTests/TimerTest.CategoryTimes2 (78 of 2110)
PASS: lldb-unit :: Symbol/./SymbolTests/TestTypeSystemClang.TestGetTypeClassTypeOf (79 of 2110)
PASS: lldb-unit :: Utility/./UtilityTests/BinaryStreamTest.PutSLEB128FourBytes (80 of 2110)
PASS: lldb-api :: functionalities/data-formatter/data-formatter-proper-plurals/TestFormattersOneIsSingular.py (81 of 2110)
PASS: lldb-unit :: Host/./HostTests/SocketAddressTest.GetAddressInfo (82 of 2110)
PASS: lldb-api :: macosx/queues/TestQueues.py (83 of 2110)
PASS: lldb-unit :: Language/Highlighting/./HighlighterTests/HighlighterTest.HighlighterSelectionPath (84 of 2110)
PASS: lldb-api :: functionalities/source-map/TestTargetSourceMap.py (85 of 2110)
PASS: lldb-unit :: SymbolFile/NativePDB/./SymbolFileNativePDBTests/PDBFPOProgramToDWARFExpressionTests.UnresolvedRegisterAssignmentReference (86 of 2110)
PASS: lldb-unit :: Utility/./UtilityTests/RecordReplayTest.InstrumentedBarPtr (87 of 2110)
PASS: lldb-unit :: Host/./HostTests/MainLoopTest.Signal (88 of 2110)
PASS: lldb-unit :: Utility/./UtilityTests/StringLexerTest.GetUnlexed (89 of 2110)
PASS: lldb-api :: lang/objc/bitfield_ivars/TestBitfieldIvars.py (90 of 2110)
PASS: lldb-unit :: Utility/./UtilityTests/FileSpecTest.RemoveLastPathComponent (91 of 2110)
PASS: lldb-api :: python_api/exprpath_synthetic/TestExprPathSynthetic.py (92 of 2110)
PASS: lldb-api :: python_api/sbplatform/TestSBPlatform.py (93 of 2110)
PASS: lldb-shell :: SymbolFile/Breakpad/line-table-discontinuous-file-ids.test (94 of 2110)
PASS: lldb-unit :: Symbol/./SymbolTests/TestTypeSystemClang.TestUnifyAccessSpecifiers (95 of 2110)
PASS: lldb-shell :: SymbolFile/NativePDB/source-list.cpp (96 of 2110)
PASS: lldb-unit :: Utility/./UtilityTests/GeneratorTest.Create (97 of 2110)
PASS: lldb-unit :: Expression/./ExpressionTests/ClangExpressionDeclMapTest.TestPersistentDeclLookup (98 of 2110)
PASS: lldb-api :: commands/expression/fixits/TestFixIts.py (99 of 2110)
PASS: lldb-api :: lang/cpp/overloaded-functions/TestOverloadedFunctions.py (100 of 2110)
PASS: lldb-unit :: SymbolFile/NativePDB/./SymbolFileNativePDBTests/PDBFPOProgramToDWARFExpressionTests.SingleAssignmentRegisterRef (101 of 2110)
PASS: lldb-shell :: ObjectFile/ELF/many-sections.s (102 of 2110)
PASS: lldb-unit :: Utility/./UtilityTests/StringListTest.GetMaxStringLengthDecreasingSize (103 of 2110)
PASS: lldb-unit :: Utility/./UtilityTests/Flags.GetBitSize (104 of 2110)
PASS: lldb-api :: api/multiple-targets/TestMultipleTargets.py (105 of 2110)
PASS: lldb-api :: lang/objc/single-entry-dictionary/TestObjCSingleEntryDictionary.py (106 of 2110)
PASS: lldb-shell :: SymbolFile/DWARF/clang-ast-from-dwarf-unamed-and-anon-structs.cpp (107 of 2110)
PASS: lldb-unit :: Utility/./UtilityTests/LogChannelTest.EnableOptions (108 of 2110)
PASS: lldb-api :: python_api/frame/get-variables/TestGetVariables.py (109 of 2110)
PASS: lldb-api :: commands/frame/recognizer/TestFrameRecognizer.py (110 of 2110)
PASS: lldb-api :: lang/cpp/class_types/TestClassTypesDisassembly.py (111 of 2110)
PASS: lldb-api :: api/log/TestAPILog.py (112 of 2110)
PASS: lldb-api :: functionalities/deleted-executable/TestDeletedExecutable.py (113 of 2110)
PASS: lldb-unit :: Symbol/./SymbolTests/TestTypeSystemClang.TestGetTypeClassNested (114 of 2110)
PASS: lldb-api :: commands/log/basic/TestLogging.py (115 of 2110)
PASS: lldb-unit :: Process/gdb-remote/./ProcessGdbRemoteTests/GDBRemoteClientBaseTest.SendContinueAndWait (116 of 2110)
PASS: lldb-shell :: Settings/TestStopCommandSourceOnError.test (117 of 2110)
PASS: lldb-unit :: Process/minidump/./LLDBMinidumpTests/MinidumpParserTest.GetPidWindows (118 of 2110)
UNSUPPORTED: lldb-api :: functionalities/longjmp/TestLongjmp.py (119 of 2110)
PASS: lldb-unit :: Utility/./UtilityTests/SubsystemRAIITest.SubsystemWithErrorSuccess (120 of 2110)
PASS: lldb-api :: commands/expression/import-std-module/empty-module/TestEmptyStdModule.py (121 of 2110)
PASS: lldb-api :: commands/frame/var/TestFrameVar.py (122 of 2110)
PASS: lldb-unit :: Utility/./UtilityTests/AnsiTerminal.Twice (123 of 2110)
UNSUPPORTED: lldb-shell :: Register/x86-64-ymm16-write.test (124 of 2110)
PASS: lldb-unit :: ScriptInterpreter/Python/./ScriptInterpreterPythonTests/PythonDataObjectsTest.TestObjectAttributes (125 of 2110)
UNSUPPORTED: lldb-shell :: Register/x86-64-xmm16-write.test (126 of 2110)
PASS: lldb-unit :: Language/Highlighting/./HighlighterTests/HighlighterTest.ClangCursorPosBeforeOtherToken (127 of 2110)
PASS: lldb-unit :: Process/minidump/./LLDBMinidumpTests/RegisterContextMinidump.CheckRegisterContextMinidump_ARM (128 of 2110)
UNSUPPORTED: lldb-shell :: SymbolFile/Breakpad/stack-cfi-arm.yaml (129 of 2110)
PASS: lldb-unit :: Utility/./UtilityTests/XcodeSDKTest.FindXcodeContentsDirectoryInPath (130 of 2110)
PASS: lldb-shell :: SymbolFile/DWARF/DW_TAG_variable-invalid_location.s (131 of 2110)
PASS: lldb-api :: functionalities/float-display/TestFloatDisplay.py (132 of 2110)
PASS: lldb-unit :: Utility/./UtilityTests/StringListTest.Clear (133 of 2110)
PASS: lldb-api :: lang/cpp/trivial_abi/TestTrivialABI.py (134 of 2110)
PASS: lldb-shell :: ObjectFile/PECOFF/sections.yaml (135 of 2110)
UNSUPPORTED: lldb-api :: benchmarks/libcxxlist/TestBenchmarkLibcxxList.py (136 of 2110)
PASS: lldb-unit :: Process/gdb-remote/./ProcessGdbRemoteTests/GDBRemoteCommunicationClientTest.GetModulesInfo_UUID20 (137 of 2110)
PASS: lldb-api :: tools/lldb-server/TestGdbRemoteSingleStep.py (138 of 2110)
PASS: lldb-api :: functionalities/data-formatter/data-formatter-stl/libcxx/iterator/TestDataFormatterLibccIterator.py (139 of 2110)
PASS: lldb-unit :: Target/./TargetTests/PathMappingListTest.AbsoluteTests (140 of 2110)
PASS: lldb-unit :: Utility/./UtilityTests/RangeDataVector.FindEntryIndexesThatContain_Overlap (141 of 2110)
PASS: lldb-unit :: Utility/./UtilityTests/VMRange.ContainsAddr (142 of 2110)
PASS: lldb-unit :: Utility/./UtilityTests/ProcessInstanceInfo.Dump (143 of 2110)
PASS: lldb-shell :: Commands/command-disassemble-process.yaml (144 of 2110)
PASS: lldb-api :: commands/session/history/TestSessionHistory.py (145 of 2110)
PASS: lldb-unit :: Utility/./UtilityTests/RegularExpression.Invalid (146 of 2110)
PASS: lldb-unit :: Utility/./UtilityTests/VASprintfTest.EncodingError (147 of 2110)
PASS: lldb-shell :: SymbolFile/NativePDB/globals-fundamental.cpp (148 of 2110)
PASS: lldb-unit :: Host/./HostTests/NativeProcessProtocolTest.ReadMemoryWithoutTrap (149 of 2110)
PASS: lldb-api :: commands/expression/class_template_specialization_empty_pack/TestClassTemplateSpecializationParametersHandling.py (150 of 2110)
PASS: lldb-shell :: ObjectFile/ELF/section-permissions.yaml (151 of 2110)
PASS: lldb-shell :: ObjectFile/PECOFF/basic-info-arm64.yaml (152 of 2110)
PASS: lldb-unit :: SymbolFile/DWARF/./SymbolFileDWARFTests/SymbolFileDWARFTests.TestAbbrevOrder1Start5 (153 of 2110)
PASS: lldb-unit :: Utility/./UtilityTests/StringExtractorTest.DecodeHexU8_Extra (154 of 2110)
PASS: lldb-unit :: API/./APITests/SBCommandInterpreterTest.SingleWordCommand (155 of 2110)
PASS: lldb-unit :: Symbol/./SymbolTests/TestTypeSystemClang.TestBuiltinTypeForEncodingAndBitSize (156 of 2110)
PASS: lldb-shell :: SymbolFile/DWARF/childless-compile-unit.s (157 of 2110)
PASS: lldb-api :: functionalities/breakpoint/address_breakpoints/TestBadAddressBreakpoints.py (158 of 2110)
PASS: lldb-unit :: Utility/./UtilityTests/StringListTest.AppendStringMove (159 of 2110)
PASS: lldb-unit :: Utility/./UtilityTests/FileSpecTest.FormatFileSpec (160 of 2110)
UNSUPPORTED: lldb-api :: lang/objc/ptr_refs/TestPtrRefsObjC.py (161 of 2110)
PASS: lldb-unit :: debugserver/./debugserverTests/RNBSocket.LoopBackConnectIPv6 (162 of 2110)
PASS: lldb-unit :: Utility/./UtilityTests/StreamTest.PutHex32ByteOrderBig (163 of 2110)
PASS: lldb-api :: functionalities/postmortem/minidump/TestMiniDump.py (164 of 2110)
PASS: lldb-api :: functionalities/thread/concurrent_events/TestConcurrentBreakpointDelayBreakpointOneSignal.py (165 of 2110)
PASS: lldb-unit :: Utility/./UtilityTests/ArchSpecTest.TestSetTriple (166 of 2110)
PASS: lldb-api :: python_api/value_var_update/TestValueVarUpdate.py (167 of 2110)
PASS: lldb-unit :: Utility/./UtilityTests/FileSpecTest.FileAndDirectoryComponents (168 of 2110)
PASS: lldb-shell :: Driver/TestCommands.test (169 of 2110)
PASS: lldb-api :: macosx/safe-to-func-call/TestSafeFuncCalls.py (170 of 2110)
PASS: lldb-api :: functionalities/signal/raise/TestRaise.py (171 of 2110)
PASS: lldb-unit :: Symbol/./SymbolTests/TestTypeSystemClang.AddMethodToObjCObjectType (172 of 2110)
PASS: lldb-api :: commands/target/stop-hook/disable/TestTargetStopHookDisable.py (173 of 2110)
PASS: lldb-api :: lang/c/array_types/TestArrayTypes.py (174 of 2110)
UNSUPPORTED: lldb-api :: functionalities/data-formatter/data-formatter-stl/libstdcpp/vector/TestDataFormatterStdVector.py (175 of 2110)
PASS: lldb-shell :: Commands/CommandScriptImmediateOutput/CommandScriptImmediateOutputConsole.test (176 of 2110)
PASS: lldb-shell :: ScriptInterpreter/Python/crashlog.test (177 of 2110)
PASS: lldb-unit :: SymbolFile/DWARF/./SymbolFileDWARFTests/DWARFASTParserClangTests.EnsureAllDIEsInDeclContextHaveBeenParsedParsesOnlyMatchingEntries (178 of 2110)
UNSUPPORTED: lldb-api :: iohandler/resize/TestIOHandlerResize.py (179 of 2110)
PASS: lldb-unit :: DataFormatter/./LLDBFormatterTests/TypeMatcherTests.CreatedBySameMatchString (180 of 2110)
PASS: lldb-unit :: Process/minidump/./LLDBMinidumpTests/MinidumpParserTest.GetMiscInfo_no_stream (181 of 2110)
PASS: lldb-api :: functionalities/data-formatter/typedef_array/TestTypedefArray.py (182 of 2110)
PASS: lldb-api :: commands/expression/radar_8638051/Test8638051.py (183 of 2110)
PASS: lldb-unit :: Process/gdb-remote/./ProcessGdbRemoteTests/GDBRemoteClientBaseTest.SendContinueDelegateStructuredDataReceipt (184 of 2110)
PASS: lldb-shell :: SymbolFile/DWARF/gnu-style-compression.cpp (185 of 2110)
PASS: lldb-unit :: Language/Highlighting/./HighlighterTests/HighlighterTest.ClangCursorOutOfBounds (186 of 2110)
UNSUPPORTED: lldb-api :: tools/lldb-server/TestGdbRemoteModuleInfo.py (187 of 2110)
PASS: lldb-unit :: Utility/./UtilityTests/UriParserTest.SchemeHostSeparator2 (188 of 2110)
PASS: lldb-api :: functionalities/data-formatter/data-formatter-stl/libcxx/vector/TestDataFormatterLibcxxVector.py (189 of 2110)
PASS: lldb-unit :: Utility/./UtilityTests/ScalarTest.Division (190 of 2110)
UNSUPPORTED: lldb-api :: tools/lldb-server/libraries-svr4/TestGdbRemoteLibrariesSvr4Support.py (191 of 2110)
PASS: lldb-unit :: Utility/./UtilityTests/UriParserTest.BracketedHostnamePort (192 of 2110)
PASS: lldb-unit :: UnwindAssembly/x86/./UnwindAssemblyx86Tests/Testx86AssemblyInspectionEngine.TestStackRealign32BitDisp_x86_64 (193 of 2110)
PASS: lldb-unit :: Utility/./UtilityTests/SerializationRountripTest.SerializeDeserializeCStringArrayNullptr (194 of 2110)
PASS: lldb-api :: macosx/find-dsym/bundle-with-dot-in-filename/TestBundleWithDotInFilename.py (195 of 2110)
PASS: lldb-api :: commands/watchpoints/watchpoint_on_vectors/TestValueOfVectorVariable.py (196 of 2110)
PASS: lldb-unit :: Process/./ProcessEventDataTests/ProcessEventDataTest.ShouldStop (197 of 2110)
PASS: lldb-unit :: Utility/./UtilityTests/StreamTeeTest.Write (198 of 2110)
PASS: lldb-api :: python_api/interpreter/TestRunCommandInterpreterAPI.py (199 of 2110)
PASS: lldb-api :: lang/objc/global_ptrs/TestGlobalObjects.py (200 of 2110)
PASS: lldb-unit :: Utility/./UtilityTests/SharedCluster.ClusterManager (201 of 2110)
PASS: lldb-unit :: Host/./HostTests/MainLoopTest.UnmonitoredSignal (202 of 2110)
PASS: lldb-api :: functionalities/dead-strip/TestDeadStrip.py (203 of 2110)
XFAIL: lldb-shell :: Register/x86-64-ymm-write.test (204 of 2110)
PASS: lldb-unit :: Signals/./SignalsTests/UnixSignalsTest.GetFilteredSignals (205 of 2110)
PASS: lldb-api :: functionalities/inferior-crashing/recursive-inferior/TestRecursiveInferior.py (206 of 2110)
PASS: lldb-shell :: SymbolFile/DWARF/debug_ranges-missing-section.s (207 of 2110)
PASS: lldb-unit :: Utility/./UtilityTests/StatusTest.ErrorCodeConstructor (208 of 2110)
PASS: lldb-unit :: Utility/./UtilityTests/UriParserTest.BracketedHostname (209 of 2110)
PASS: lldb-unit :: Host/./HostTests/FileSystemTest.OpenErrno (210 of 2110)
PASS: lldb-unit :: ObjectFile/Breakpad/./ObjectFileBreakpadTests/StackWinRecord.parse (211 of 2110)
PASS: lldb-api :: tools/lldb-vscode/breakpoint/TestVSCode_setExceptionBreakpoints.py (212 of 2110)
PASS: lldb-api :: functionalities/process_group/TestChangeProcessGroup.py (213 of 2110)
PASS: lldb-unit :: Core/./LLDBCoreTests/RichManglingContextTest.SwitchProvider (214 of 2110)
PASS: lldb-api :: types/TestShortType.py (215 of 2110)
PASS: lldb-api :: functionalities/param_entry_vals/basic_entry_values/TestBasicEntryValues.py (216 of 2110)
PASS: lldb-unit :: Host/./HostTests/FileSystemTest.Readable (217 of 2110)
UNSUPPORTED: lldb-api :: benchmarks/turnaround/TestCompileRunToBreakpointTurnaround.py (218 of 2110)
PASS: lldb-shell :: SymbolFile/DWARF/debug-types-dwo-cross-reference.cpp (219 of 2110)
PASS: lldb-unit :: Language/Highlighting/./HighlighterTests/HighlighterTest.ClangCursorPosInOtherToken (220 of 2110)
PASS: lldb-unit :: Utility/./UtilityTests/StringLexerTest.Peek (221 of 2110)
PASS: lldb-shell :: Settings/TestDisableColor.test (222 of 2110)
PASS: lldb-shell :: SymbolFile/DWARF/debug_loc_and_loclists.s (223 of 2110)
PASS: lldb-unit :: Host/./HostTests/FileSystemTest.Resolve (224 of 2110)
PASS: lldb-unit :: Utility/./UtilityTests/ScalarTest.Comparison (225 of 2110)
PASS: lldb-api :: functionalities/inferior-changed/TestInferiorChanged.py (226 of 2110)
PASS: lldb-api :: lang/cpp/namespace/TestNamespace.py (227 of 2110)
PASS: lldb-unit :: ObjectFile/Breakpad/./ObjectFileBreakpadTests/FuncRecord.parse (228 of 2110)
PASS: lldb-shell :: ObjectFile/PECOFF/symbol.yaml (229 of 2110)
PASS: lldb-api :: commands/expression/persist_objc_pointeetype/TestPersistObjCPointeeType.py (230 of 2110)
PASS: lldb-unit :: Utility/./UtilityTests/StringListTest.DefaultConstructor (231 of 2110)
PASS: lldb-unit :: Utility/./UtilityTests/AnsiTerminal.Incomplete (232 of 2110)
UNSUPPORTED: lldb-shell :: SymbolFile/target-symbols-add-unwind.test (233 of 2110)
PASS: lldb-api :: functionalities/wrong_commands/TestWrongCommands.py (234 of 2110)
PASS: lldb-api :: commands/expression/import-std-module/sysroot/TestStdModuleSysroot.py (235 of 2110)
PASS: lldb-unit :: Utility/./UtilityTests/SerializationRountripTest.SerializeDeserializeCStringArrayNullptrElem (236 of 2110)
UNSUPPORTED: lldb-shell :: Register/aarch64-gp-read.test (237 of 2110)
PASS: lldb-api :: functionalities/thread/create_after_attach/TestCreateAfterAttach.py (238 of 2110)
PASS: lldb-shell :: BuildScript/script-args.test (239 of 2110)
PASS: lldb-shell :: SymbolFile/DWARF/DW_OP_piece-smaller-than-struct.s (240 of 2110)
PASS: lldb-unit :: UnwindAssembly/x86/./UnwindAssemblyx86Tests/Testx86AssemblyInspectionEngine.TestPushRBX (241 of 2110)
PASS: lldb-shell :: SymbolFile/DWARF/debug-types-line-tables.s (242 of 2110)
UNSUPPORTED: lldb-api :: tools/lldb-server/TestGdbRemoteAuxvSupport.py (243 of 2110)
PASS: lldb-api :: functionalities/gdb_remote_client/TestqOffsets.py (244 of 2110)
UNSUPPORTED: lldb-shell :: SymbolFile/DWARF/DW_TAG_GNU_call_site-DW_AT_low_pc.s (245 of 2110)
PASS: lldb-shell :: Quit/TestQuitExitCode30.test (246 of 2110)
PASS: lldb-api :: functionalities/thread/thread_specific_break/TestThreadSpecificBreakpoint.py (247 of 2110)
PASS: lldb-api :: commands/reproducer/invalid-args/TestInvalidArgsReproducer.py (248 of 2110)
PASS: lldb-api :: functionalities/target-new-solib-notifications/TestModuleLoadedNotifys.py (249 of 2110)
PASS: lldb-unit :: Process/gdb-remote/./ProcessGdbRemoteTests/GDBRemoteClientBaseTest.SendContinueDelegateInterface (250 of 2110)
PASS: lldb-unit :: ScriptInterpreter/Python/./ScriptInterpreterPythonTests/PythonDataObjectsTest.TestPythonTupleInitializerList (251 of 2110)
PASS: lldb-unit :: Utility/./UtilityTests/UriParserTest.Empty (252 of 2110)
PASS: lldb-api :: commands/expression/weak_symbols/TestWeakSymbols.py (253 of 2110)
UNSUPPORTED: lldb-api :: linux/mix-dwo-and-regular-objects/TestMixedDwarfBinary.py (254 of 2110)
UNSUPPORTED: lldb-api :: functionalities/darwin_log/source/info/TestDarwinLogSourceInfo.py (255 of 2110)
PASS: lldb-unit :: Utility/./UtilityTests/PassiveReplayTest.InstrumentedFooInvalid (256 of 2110)
UNSUPPORTED: lldb-api :: functionalities/darwin_log/filter/exact_match/activity-chain/TestDarwinLogFilterMatchActivityChain.py (257 of 2110)
PASS: lldb-unit :: Host/./HostTests/Host.WaitStatusFormat (258 of 2110)
PASS: lldb-shell :: ObjectFile/ELF/basic-info.yaml (259 of 2110)
PASS: lldb-api :: commands/apropos/with-process/TestAproposWithProcess.py (260 of 2110)
PASS: lldb-api :: functionalities/mtc/simple/TestMTCSimple.py (261 of 2110)
PASS: lldb-unit :: ObjectFile/PECOFF/./ObjectFilePECOFFTests/PECallFrameInfoTest.Basic_eh (262 of 2110)
PASS: lldb-unit :: UnwindAssembly/x86/./UnwindAssemblyx86Tests/Testx86AssemblyInspectionEngine.TestPushEBP (263 of 2110)
PASS: lldb-api :: tools/lldb-server/TestGdbRemoteHostInfo.py (264 of 2110)
PASS: lldb-unit :: Utility/./UtilityTests/StreamTest.PutMaxHex64ByteOrderBig (265 of 2110)
PASS: lldb-api :: lang/c/stepping/TestThreadStepping.py (266 of 2110)
PASS: lldb-api :: api/command-return-object/TestSBCommandReturnObject.py (267 of 2110)
PASS: lldb-unit :: Process/gdb-remote/./ProcessGdbRemoteTests/GDBRemoteClientBaseTest.SendContinueAndAsyncPacket (268 of 2110)
PASS: lldb-api :: lang/objc/modules-auto-import/TestModulesAutoImport.py (269 of 2110)
PASS: lldb-unit :: Utility/./UtilityTests/ArgsTest.TestAppendArg (270 of 2110)
UNSUPPORTED: lldb-api :: commands/expression/completion-crash-invalid-iterator/TestInvalidIteratorCompletionCrash.py (271 of 2110)
PASS: lldb-shell :: Commands/command-disassemble.s (272 of 2110)
PASS: lldb-unit :: Utility/./UtilityTests/StringListTest.JoinMultiCharSeparator (273 of 2110)
PASS: lldb-shell :: Minidump/Windows/Sigsegv/sigsegv.test (274 of 2110)
UNSUPPORTED: lldb-api :: functionalities/tty/TestTerminal.py (275 of 2110)
PASS: lldb-api :: functionalities/object-file/TestImageListMultiArchitecture.py (276 of 2110)
PASS: lldb-api :: lang/objc/print-obj/TestPrintObj.py (277 of 2110)
PASS: lldb-api :: commands/expression/char/TestExprsChar.py (278 of 2110)
PASS: lldb-unit :: UnwindAssembly/x86/./UnwindAssemblyx86Tests/Testx86AssemblyInspectionEngine.TestSimplei386ugmented (279 of 2110)
PASS: lldb-unit :: Host/./HostTests/HostInfoTest.GetAugmentedArchSpec (280 of 2110)
PASS: lldb-api :: lang/cpp/this_class_type_mixing/TestThisClassTypeMixing.py (281 of 2110)
PASS: lldb-api :: lang/objc/modules-cache/TestClangModulesCache.py (282 of 2110)
PASS: lldb-api :: lang/objc/foundation/TestSymbolTable.py (283 of 2110)
PASS: lldb-shell :: ObjectFile/ELF/compressed-sections.yaml (284 of 2110)
PASS: lldb-api :: lang/c/bitfields/TestBitfields.py (285 of 2110)
PASS: lldb-unit :: DataFormatter/./LLDBFormatterTests/TypeMatcherTests.GetMatchStringRegex (286 of 2110)
PASS: lldb-unit :: Core/./LLDBCoreTests/SourceFileCache.FindSourceFileNotFound (287 of 2110)
PASS: lldb-api :: functionalities/data-formatter/nssetsynth/TestNSSetSynthetic.py (288 of 2110)
PASS: lldb-unit :: SymbolFile/NativePDB/./SymbolFileNativePDBTests/PDBFPOProgramToDWARFExpressionTests.InvalidOpBinary (289 of 2110)
PASS: lldb-unit :: Utility/./UtilityTests/ArgsTest.TestMultipleArgs (290 of 2110)
UNSUPPORTED: lldb-shell :: SymbolFile/PDB/func-symbols.test (291 of 2110)
UNSUPPORTED: lldb-api :: functionalities/signal/handle-segv/TestHandleSegv.py (292 of 2110)
PASS: lldb-api :: functionalities/non-overlapping-index-variable-i/TestIndexVariable.py (293 of 2110)
PASS: lldb-api :: functionalities/thread/exit_during_step/TestExitDuringStep.py (294 of 2110)
PASS: lldb-api :: functionalities/inferior-crashing/TestInferiorCrashing.py (295 of 2110)
PASS: lldb-unit :: Host/./HostTests/File.GetStreamFromDescriptor (296 of 2110)
PASS: lldb-shell :: SymbolFile/DWARF/DW_TAG_variable-DW_AT_const_value.s (297 of 2110)
PASS: lldb-api :: functionalities/data-formatter/data-formatter-ptr-to-array/TestPtrToArrayFormatting.py (298 of 2110)
PASS: lldb-unit :: Utility/./UtilityTests/OptionsWithRawTest.ArgsButNoLeadingDash (299 of 2110)
PASS: lldb-api :: lang/objc/variadic_methods/TestVariadicMethods.py (300 of 2110)
UNSUPPORTED: lldb-api :: api/multiple-debuggers/TestMultipleDebuggers.py (301 of 2110)
PASS: lldb-shell :: SymbolFile/DWARF/find-basic-function.cpp (302 of 2110)
PASS: lldb-unit :: Utility/./UtilityTests/RangeTest.DoesIntersect (303 of 2110)
PASS: lldb-unit :: Language/Highlighting/./HighlighterTests/HighlighterTest.ClangBraces (304 of 2110)
PASS: lldb-unit :: ScriptInterpreter/Python/./ScriptInterpreterPythonTests/PythonDataObjectsTest.TestCallable (305 of 2110)
PASS: lldb-unit :: Utility/./UtilityTests/StatusTest.Formatv (306 of 2110)
PASS: lldb-unit :: Utility/./UtilityTests/StringListTest.SplitIntoLinesSingleTrailingCR (307 of 2110)
PASS: lldb-unit :: SymbolFile/DWARF/./SymbolFileDWARFTests/SymbolFileDWARFTests.TestAbbrevOutOfOrder (308 of 2110)
PASS: lldb-api :: functionalities/step-avoids-no-debug/TestStepNoDebug.py (309 of 2110)
PASS: lldb-unit :: Utility/./UtilityTests/SerializationRountripTest.SerializeDeserializeObjectReference (310 of 2110)
PASS: lldb-unit :: Process/gdb-remote/./ProcessGdbRemoteTests/GDBRemoteCommunicationClientTest.GetModulesInfo (311 of 2110)
UNSUPPORTED: lldb-shell :: ObjectFile/PECOFF/disassemble-thumb.yaml (312 of 2110)
PASS: lldb-shell :: SymbolFile/Breakpad/line-table-mixed-path-styles.test (313 of 2110)
PASS: lldb-unit :: Core/./LLDBCoreTests/MangledTest.ResultForBlockInvocation (314 of 2110)
PASS: lldb-shell :: Commands/command-thread-select.test (315 of 2110)
PASS: lldb-unit :: tools/lldb-server/tests/./LLDBServerTests/TestBase.DebugserverEnv (316 of 2110)
PASS: lldb-unit :: Utility/./UtilityTests/AnsiTerminal.Unknown (317 of 2110)
UNSUPPORTED: lldb-shell :: BuildScript/toolchain-msvc.test (318 of 2110)
PASS: lldb-shell :: Reproducer/TestCrash.test (319 of 2110)
PASS: lldb-api :: functionalities/gdb_remote_client/TestRegDefinitionInParts.py (320 of 2110)
PASS: lldb-shell :: ScriptInterpreter/Python/sb_address_exception.test (321 of 2110)
PASS: lldb-unit :: Process/minidump/./LLDBMinidumpTests/MinidumpParserTest.GetPid (322 of 2110)
PASS: lldb-api :: functionalities/data-formatter/cstring-utf8-summary/TestCstringUnicode.py (323 of 2110)
PASS: lldb-shell :: ObjectFile/ELF/section-addresses.yaml (324 of 2110)
PASS: lldb-unit :: Utility/./UtilityTests/NameMatchesTest.RegularExpression (325 of 2110)
PASS: lldb-api :: commands/frame/diagnose/complicated-expression/TestComplicatedExpression.py (326 of 2110)
PASS: lldb-unit :: UnwindAssembly/x86/./UnwindAssemblyx86Tests/Testx86AssemblyInspectionEngine.TestAddESP (327 of 2110)
PASS: lldb-api :: functionalities/recursion/TestValueObjectRecursion.py (328 of 2110)
PASS: lldb-shell :: SymbolFile/DWARF/debug_loclists-dwo.s (329 of 2110)
PASS: lldb-unit :: UnwindAssembly/x86/./UnwindAssemblyx86Tests/Testx86AssemblyInspectionEngine.TestPushR12 (330 of 2110)
PASS: lldb-api :: commands/expression/vector_of_enums/TestVectorOfEnums.py (331 of 2110)
PASS: lldb-unit :: UnwindAssembly/x86/./UnwindAssemblyx86Tests/Testx86AssemblyInspectionEngine.TestPopR13 (332 of 2110)
PASS: lldb-unit :: Host/./HostTests/FileSystemTest.GetByteSize (333 of 2110)
UNSUPPORTED: lldb-shell :: Breakpoint/case-insensitive.test (334 of 2110)
PASS: lldb-api :: functionalities/pre_run_dylibs/TestPreRunDylibs.py (335 of 2110)
PASS: lldb-unit :: UnwindAssembly/x86/./UnwindAssemblyx86Tests/Testx86AssemblyInspectionEngine.TestPushRBP (336 of 2110)
PASS: lldb-unit :: Symbol/./SymbolTests/TestClangASTImporter.DeportDeclTagDecl (337 of 2110)
PASS: lldb-shell :: SymbolFile/DWARF/dwp-debug-types.s (338 of 2110)
PASS: lldb-api :: functionalities/thread/backtrace_all/TestBacktraceAll.py (339 of 2110)
PASS: lldb-unit :: ObjectFile/ELF/./ObjectFileELFTests/ObjectFileELFTest.GetSymtab_NoSymEntryPointArmThumbAddressClass (340 of 2110)
PASS: lldb-api :: python_api/lldbutil/iter/TestRegistersIterator.py (341 of 2110)
PASS: lldb-unit :: Breakpoint/./LLDBBreakpointTests/BreakpointIDTest.StringIsBreakpointName (342 of 2110)
PASS: lldb-shell :: Reproducer/Modules/TestModuleCXX.test (343 of 2110)
PASS: lldb-shell :: Watchpoint/SetErrorCases.test (344 of 2110)
PASS: lldb-api :: macosx/thread-names/TestInterruptThreadNames.py (345 of 2110)
PASS: lldb-api :: functionalities/data-formatter/data-formatter-stl/libcxx/vbool/TestDataFormatterLibcxxVBool.py (346 of 2110)
PASS: lldb-api :: functionalities/step_scripted/TestStepScripted.py (347 of 2110)
PASS: lldb-shell :: SymbolFile/DWARF/deterministic-build.cpp (348 of 2110)
PASS: lldb-shell :: Reproducer/TestMultipleTargets.test (349 of 2110)
PASS: lldb-unit :: SymbolFile/NativePDB/./SymbolFileNativePDBTests/PDBFPOProgramToDWARFExpressionTests.MissingTargetRegister (350 of 2110)
PASS: lldb-api :: lang/cpp/subst_template_type_param/TestSubstTemplateTypeParam.py (351 of 2110)
PASS: lldb-unit :: Utility/./UtilityTests/ArgsTest.ReplaceArgumentAtIndexShort (352 of 2110)
PASS: lldb-shell :: Settings/TestSettingsWrite.test (353 of 2110)
PASS: lldb-unit :: Core/./LLDBCoreTests/ModuleSpecTest.InvalidInMemoryBuffer (354 of 2110)
PASS: lldb-unit :: Utility/./UtilityTests/XcodeSDKTest.SDKSupportsSwift (355 of 2110)
PASS: lldb-unit :: Utility/./UtilityTests/ArchSpecTest.Compatibility (356 of 2110)
PASS: lldb-api :: functionalities/thread/concurrent_events/TestConcurrentBreakpointOneDelayBreakpointThreads.py (357 of 2110)
PASS: lldb-api :: functionalities/abbreviation/TestCommonShortSpellings.py (358 of 2110)
PASS: lldb-unit :: Signals/./SignalsTests/UnixSignalsTest.GetInfo (359 of 2110)
UNSUPPORTED: lldb-api :: tools/lldb-server/registers-target-xml-reading/TestGdbRemoteTargetXmlPacket.py (360 of 2110)
PASS: lldb-unit :: Utility/./UtilityTests/RangeTest.ContainsAddr (361 of 2110)
PASS: lldb-unit :: Symbol/./SymbolTests/Type.GetTypeScopeAndBasename (362 of 2110)
PASS: lldb-unit :: Utility/./UtilityTests/LogChannelEnabledTest.log_options (363 of 2110)
PASS: lldb-unit :: Utility/./UtilityTests/StringListTest.InsertStringAtIndexMove (364 of 2110)
PASS: lldb-shell :: Register/x86-64-ymm-read.test (365 of 2110)
PASS: lldb-unit :: Expression/./ExpressionTests/DiagnosticManagerTest.GetStringMultipleDiags (366 of 2110)
PASS: lldb-unit :: Utility/./UtilityTests/Flags.Reset (367 of 2110)
UNSUPPORTED: lldb-api :: functionalities/exec/TestExec.py (368 of 2110)
UNSUPPORTED: lldb-api :: tools/lldb-server/signal-filtering/TestGdbRemote_QPassSignals.py (369 of 2110)
PASS: lldb-unit :: Utility/./UtilityTests/LogChannelTest.Disable (370 of 2110)
UNSUPPORTED: lldb-shell :: BuildScript/toolchain-clang-cl.test (371 of 2110)
PASS: lldb-api :: lang/cpp/typedef/TestCppTypedef.py (372 of 2110)
PASS: lldb-api :: lang/cpp/offsetof/TestOffsetofCpp.py (373 of 2110)
PASS: lldb-unit :: Utility/./UtilityTests/FileSpecTest.Yaml (374 of 2110)
PASS: lldb-api :: functionalities/data-formatter/data-formatter-objc/TestDataFormatterObjCNSURL.py (375 of 2110)
PASS: lldb-shell :: SymbolFile/DWARF/compilercontext.ll (376 of 2110)
PASS: lldb-unit :: Utility/./UtilityTests/RangeTest.SlideZero (377 of 2110)
PASS: lldb-api :: commands/platform/file/close/TestPlatformFileClose.py (378 of 2110)
PASS: lldb-api :: commands/expression/call-function/TestCallStdStringFunction.py (379 of 2110)
UNSUPPORTED: lldb-shell :: Register/x86-zmm-write.test (380 of 2110)
PASS: lldb-unit :: Utility/./UtilityTests/ConstStringTest.UpdateMangledCounterpart (381 of 2110)
PASS: lldb-unit :: Utility/./UtilityTests/RangeTest.LessThanInvalid (382 of 2110)
PASS: lldb-api :: commands/command/script/import/TestImport.py (383 of 2110)
PASS: lldb-unit :: Utility/./UtilityTests/StringListTest.SplitIntoLinesEmpty (384 of 2110)
PASS: lldb-unit :: Utility/./UtilityTests/DataExtractorTest.UncommonAddressSize (385 of 2110)
PASS: lldb-api :: lang/c/function_types/TestFunctionTypes.py (386 of 2110)
PASS: lldb-api :: functionalities/breakpoint/breakpoint_by_file_colon_line/TestBreakpointByFileColonLine.py (387 of 2110)
PASS: lldb-api :: tools/lldb-server/TestAppleSimulatorOSType.py (388 of 2110)
PASS: lldb-unit :: Utility/./UtilityTests/CompletionRequest.TryCompleteCurrentArgMode (389 of 2110)
PASS: lldb-unit :: Language/CLanguages/./LanguageCLanguagesTests/CLanguages.LookupCLanguagesByLanguageType (390 of 2110)
PASS: lldb-unit :: Process/minidump/./LLDBMinidumpTests/MinidumpParserTest.MinidumpModuleOrder (391 of 2110)
PASS: lldb-api :: lang/cpp/exceptions/TestCPPExceptionBreakpoints.py (392 of 2110)
PASS: lldb-api :: functionalities/data-formatter/data-formatter-objc/TestDataFormatterObjCNSContainer.py (393 of 2110)
PASS: lldb-api :: lang/objc/modules-update/TestClangModulesUpdate.py (394 of 2110)
UNSUPPORTED: lldb-shell :: Register/x86-64-xmm16-read.test (395 of 2110)
PASS: lldb-api :: lang/cpp/namespace/TestNamespaceLookup.py (396 of 2110)
PASS: lldb-api :: lang/cpp/char1632_t/TestChar1632T.py (397 of 2110)
PASS: lldb-api :: functionalities/data-formatter/var-in-aggregate-misuse/TestVarInAggregateMisuse.py (398 of 2110)
PASS: lldb-api :: lang/objc/modules-incomplete/TestIncompleteModules.py (399 of 2110)
PASS: lldb-unit :: Process/minidump/./LLDBMinidumpTests/MinidumpParserTest.GetMemoryRegionInfo (400 of 2110)
PASS: lldb-unit :: Platform/Android/./AdbClientTests/AdbClientTest.CreateByDeviceId_ByEnvVar (401 of 2110)
PASS: lldb-shell :: SymbolFile/Breakpad/unwind-via-stack-win.test (402 of 2110)
PASS: lldb-api :: lang/objc/modules/TestObjCModules.py (403 of 2110)
PASS: lldb-shell :: ObjectFile/ELF/PT_LOAD-overlap-PT_TLS.yaml (404 of 2110)
PASS: lldb-unit :: Utility/./UtilityTests/UserIDResolver.GetGroupName (405 of 2110)
PASS: lldb-api :: functionalities/data-formatter/user-format-vs-summary/TestUserFormatVsSummary.py (406 of 2110)
PASS: lldb-api :: functionalities/inline-stepping/TestInlineStepping.py (407 of 2110)
PASS: lldb-api :: lang/c/forward/TestForwardDeclaration.py (408 of 2110)
PASS: lldb-api :: functionalities/data-formatter/type_summary_list_arg/TestTypeSummaryListArg.py (409 of 2110)
PASS: lldb-unit :: ScriptInterpreter/Python/./ScriptInterpreterPythonTests/PythonDataObjectsTest.TestPythonStringToStr (410 of 2110)
PASS: lldb-shell :: Settings/TestSettingsSet.test (411 of 2110)
PASS: lldb-unit :: Utility/./UtilityTests/StringLexerTest.HasAtLeast (412 of 2110)
PASS: lldb-api :: functionalities/gdb_remote_client/TestArmRegisterDefinition.py (413 of 2110)
PASS: lldb-unit :: Utility/./UtilityTests/StringListTest.JoinNonSpace (414 of 2110)
PASS: lldb-api :: commands/expression/ignore-artificial-constructors/TestIgnoreArtificialConstructors.py (415 of 2110)
PASS: lldb-shell :: Reproducer/TestDriverOptions.test (416 of 2110)
PASS: lldb-api :: lang/objc/conflicting-definition/TestConflictingDefinition.py (417 of 2110)
PASS: lldb-shell :: SymbolFile/DWARF/debug_line-relative_path.s (418 of 2110)
PASS: lldb-unit :: Utility/./UtilityTests/Flags.AnySet (419 of 2110)
PASS: lldb-api :: functionalities/gdb_remote_client/TestStopPCs.py (420 of 2110)
PASS: lldb-api :: functionalities/dlopen_other_executable/TestDlopenOtherExecutable.py (421 of 2110)
PASS: lldb-api :: functionalities/data-formatter/summary-string-onfail/Test-rdar-9974002.py (422 of 2110)
PASS: lldb-unit :: Process/gdb-remote/./ProcessGdbRemoteTests/GDBRemoteClientBaseTest.SendContinueAndAsyncSignal (423 of 2110)
PASS: lldb-unit :: ScriptInterpreter/Python/./ScriptInterpreterPythonTests/PythonDataObjectsTest.TestPythonTupleToStructuredList (424 of 2110)
PASS: lldb-unit :: UnwindAssembly/x86/./UnwindAssemblyx86Tests/Testx86AssemblyInspectionEngine.TestPushRBPWithREX (425 of 2110)
PASS: lldb-unit :: Utility/./UtilityTests/DataExtractorTest.GetCStrAtNullOffset (426 of 2110)
PASS: lldb-unit :: Utility/./UtilityTests/ConstStringTest.MangledCounterpart (427 of 2110)
PASS: lldb-api :: macosx/dyld-trie-symbols/TestDyldTrieSymbols.py (428 of 2110)
PASS: lldb-api :: functionalities/postmortem/minidump-new/TestMiniDumpUUID.py (429 of 2110)
PASS: lldb-api :: functionalities/breakpoint/comp_dir_symlink/TestCompDirSymLink.py (430 of 2110)
PASS: lldb-api :: functionalities/data-formatter/boolreference/TestFormattersBoolRefPtr.py (431 of 2110)
PASS: lldb-shell :: SymbolFile/DWARF/split-dwarf-multiple-cu.ll (432 of 2110)
PASS: lldb-api :: python_api/watchpoint/TestWatchpointIgnoreCount.py (433 of 2110)
PASS: lldb-api :: commands/expression/completion/TestExprCompletion.py (434 of 2110)
PASS: lldb-unit :: Utility/./UtilityTests/GeneratorTest.Get (435 of 2110)
PASS: lldb-shell :: SymbolFile/DWARF/debug_line-tombstone.s (436 of 2110)
PASS: lldb-api :: commands/log/invalid-args/TestInvalidArgsLog.py (437 of 2110)
PASS: lldb-unit :: Utility/./UtilityTests/StringExtractorTest.GetNameColonValueContainsColon (438 of 2110)
PASS: lldb-unit :: Utility/./UtilityTests/RangeTest.NotEqual (439 of 2110)
PASS: lldb-shell :: BuildScript/compiler-full-path.test (440 of 2110)
UNSUPPORTED: lldb-api :: functionalities/darwin_log/filter/exact_match/category/TestDarwinLogFilterMatchCategory.py (441 of 2110)
PASS: lldb-api :: functionalities/thread/concurrent_events/TestConcurrentBreakpointsDelayedBreakpointOneWatchpoint.py (442 of 2110)
PASS: lldb-api :: functionalities/thread/concurrent_events/TestConcurrentDelayWatchBreak.py (443 of 2110)
PASS: lldb-shell :: SymbolFile/DWARF/dwp-separate-debug-file.cpp (444 of 2110)
PASS: lldb-unit :: Utility/./UtilityTests/DataExtractorTest.GetDouble (445 of 2110)
PASS: lldb-unit :: Utility/./UtilityTests/FileSpecTest.AppendPathComponent (446 of 2110)
PASS: lldb-api :: lang/c/register_variables/TestRegisterVariables.py (447 of 2110)
PASS: lldb-api :: python_api/lldbutil/frame/TestFrameUtils.py (448 of 2110)
UNSUPPORTED: lldb-api :: commands/watchpoints/multi_watchpoint_slots/TestWatchpointMultipleSlots.py (449 of 2110)
PASS: lldb-api :: commands/target/stop-hook/delete/TestTargetStopHookDelete.py (450 of 2110)
UNSUPPORTED: lldb-shell :: ObjectFile/ELF/minidebuginfo-set-and-hit-breakpoint.test (451 of 2110)
PASS: lldb-api :: functionalities/tail_call_frames/thread_step_out_or_return/TestSteppingOutWithArtificialFrames.py (452 of 2110)
PASS: lldb-shell :: Expr/TestMultilineExpr.test (453 of 2110)
PASS: lldb-unit :: Utility/./UtilityTests/StreamTest.Indent (454 of 2110)
PASS: lldb-unit :: Utility/./UtilityTests/StringExtractorTest.GetU64LittleEndian (455 of 2110)
PASS: lldb-unit :: Expression/./ExpressionTests/DiagnosticManagerTest.PutStringMultiple (456 of 2110)
PASS: lldb-unit :: Utility/./UtilityTests/OptionsWithRawTest.LeadingSpaceArgs (457 of 2110)
PASS: lldb-api :: functionalities/data-formatter/type_summary_list_script/TestTypeSummaryListScript.py (458 of 2110)
PASS: lldb-api :: commands/expression/inline-namespace/TestInlineNamespace.py (459 of 2110)
PASS: lldb-api :: tools/lldb-vscode/stackTrace/TestVSCode_stackTrace.py (460 of 2110)
PASS: lldb-unit :: Utility/./UtilityTests/ArgsTest.TestQuotedTrailingBackslash (461 of 2110)
PASS: lldb-api :: functionalities/breakpoint/dummy_target_breakpoints/TestBreakpointsWithNoTargets.py (462 of 2110)
PASS: lldb-unit :: Process/minidump/./LLDBMinidumpTests/MinidumpParserTest.GetPidWow64 (463 of 2110)
PASS: lldb-unit :: Utility/./UtilityTests/PassiveReplayTest.InstrumentedBarPtr (464 of 2110)
PASS: lldb-api :: macosx/order/TestOrderFile.py (465 of 2110)
PASS: lldb-api :: functionalities/unwind/noreturn/module-end/TestNoReturnModuleEnd.py (466 of 2110)
PASS: lldb-unit :: Platform/Android/./AdbClientTests/AdbClientTest.CreateByDeviceId (467 of 2110)
PASS: lldb-unit :: Process/gdb-remote/./ProcessGdbRemoteTests/GDBRemoteCommunicationServerTest.SendErrorResponse_StringError (468 of 2110)
PASS: lldb-unit :: Utility/./UtilityTests/RangeTest.Copy (469 of 2110)
PASS: lldb-unit :: Utility/./UtilityTests/StringExtractorTest.DecodeHexU8_InvalidHex (470 of 2110)
PASS: lldb-api :: lang/objc/ivar-IMP/TestObjCiVarIMP.py (471 of 2110)
PASS: lldb-unit :: Host/./HostTests/SocketTest.TCPListen0GetPort (472 of 2110)
PASS: lldb-unit :: Utility/./UtilityTests/StringListTest.InsertStringAtIndexStdString (473 of 2110)
PASS: lldb-api :: commands/expression/completion-crash-incomplete-record/TestCompletionCrashIncompleteRecord.py (474 of 2110)
PASS: lldb-unit :: Symbol/./SymbolTests/TestTypeSystemClang.TestDeletingImplicitCopyCstrDueToMoveCStr (475 of 2110)
PASS: lldb-api :: tools/lldb-vscode/attach/TestVSCode_attach.py (476 of 2110)
PASS: lldb-unit :: Utility/./UtilityTests/RangeDataVector.FindEntryThatContains (477 of 2110)
PASS: lldb-unit :: Utility/./UtilityTests/StringExtractorTest.GetHexU8_Exact_NoEof (478 of 2110)
PASS: lldb-shell :: Driver/LocalLLDBInit.test (479 of 2110)
UNSUPPORTED: lldb-api :: commands/gui/viewlarge/TestGuiViewLarge.py (480 of 2110)
PASS: lldb-api :: lang/cpp/signed_types/TestSignedTypes.py (481 of 2110)
PASS: lldb-unit :: Utility/./UtilityTests/StringExtractorTest.GetHexU8_Underflow (482 of 2110)
PASS: lldb-unit :: Core/./LLDBCoreTests/SourceFileCache.FindSourceFileFound (483 of 2110)
PASS: lldb-api :: lang/objc/unicode-string/TestUnicodeString.py (484 of 2110)
UNSUPPORTED: lldb-shell :: SymbolFile/PDB/class-layout.test (485 of 2110)
PASS: lldb-shell :: SymbolFile/DWARF/apple-index-is-used.cpp (486 of 2110)
PASS: lldb-api :: lang/c/enum_types/TestEnumTypes.py (487 of 2110)
PASS: lldb-shell :: SymbolFile/DWARF/dwarf5-atomic.s (488 of 2110)
UNSUPPORTED: lldb-shell :: ScriptInterpreter/Lua/convenience_variables.test (489 of 2110)
PASS: lldb-api :: commands/breakpoint/set/func-regex/TestBreakpointRegexError.py (490 of 2110)
PASS: lldb-unit :: Utility/./UtilityTests/StringListTest.InsertStringAtIndexStart (491 of 2110)
PASS: lldb-unit :: Utility/./UtilityTests/StreamTest.PutBytesAsRawHex8ToMixedEndian (492 of 2110)
PASS: lldb-api :: functionalities/thread/concurrent_events/TestConcurrentManyBreakpoints.py (493 of 2110)
PASS: lldb-api :: functionalities/thread/concurrent_events/TestConcurrentManyCrash.py (494 of 2110)
UNSUPPORTED: lldb-api :: functionalities/gdb_remote_client/TestWasm.py (495 of 2110)
PASS: lldb-unit :: UnwindAssembly/x86/./UnwindAssemblyx86Tests/Testx86AssemblyInspectionEngine.Testi386IgnoredRegisters (496 of 2110)
PASS: lldb-shell :: SymbolFile/DWARF/find-basic-variable.cpp (497 of 2110)
PASS: lldb-api :: commands/expression/import-std-module/vector-dbg-info-content/TestDbgInfoContentVectorFromStdModule.py (498 of 2110)
PASS: lldb-api :: tools/lldb-server/commandline/TestStubSetSID.py (499 of 2110)
PASS: lldb-unit :: Language/Highlighting/./HighlighterTests/HighlighterTest.Colons (500 of 2110)
UNSUPPORTED: lldb-api :: linux/sepdebugsymlink/TestTargetSymbolsSepDebugSymlink.py (501 of 2110)
PASS: lldb-api :: commands/disassemble/basic/TestDisassembleBreakpoint.py (502 of 2110)
PASS: lldb-unit :: Signals/./SignalsTests/UnixSignalsTest.VersionChange (503 of 2110)
PASS: lldb-unit :: UnwindAssembly/x86/./UnwindAssemblyx86Tests/Testx86AssemblyInspectionEngine.TestSpillRegToStackViaMOVi386 (504 of 2110)
PASS: lldb-api :: functionalities/thread/concurrent_events/TestConcurrentSignalWatch.py (505 of 2110)
PASS: lldb-unit :: ScriptInterpreter/Python/./ScriptInterpreterPythonTests/PythonDataObjectsTest.TestPythonBytes (506 of 2110)
PASS: lldb-unit :: Process/gdb-remote/./ProcessGdbRemoteTests/GDBRemoteClientBaseTest.SendContinueAndLateInterrupt (507 of 2110)
PASS: lldb-unit :: Utility/./UtilityTests/RangeTest.ContainsAddrInvalid (508 of 2110)
PASS: lldb-api :: commands/process/attach/TestProcessAttach.py (509 of 2110)
UNSUPPORTED: lldb-api :: functionalities/tsan/thread_numbers/TestTsanThreadNumbers.py (510 of 2110)
PASS: lldb-unit :: Utility/./UtilityTests/FileSpecTest.EqualDotsPosixRoot (511 of 2110)
PASS: lldb-api :: lang/cpp/accelerator-table/TestCPPAccelerator.py (512 of 2110)
PASS: lldb-api :: commands/expression/import-std-module/list-dbg-info-content/TestDbgInfoContentListFromStdModule.py (513 of 2110)
PASS: lldb-api :: functionalities/plugins/python_os_plugin/TestPythonOSPlugin.py (514 of 2110)
PASS: lldb-unit :: Host/./HostTests/FileSystemTest.GetPermissions (515 of 2110)
PASS: lldb-api :: functionalities/paths/TestPaths.py (516 of 2110)
PASS: lldb-api :: functionalities/memory/read/TestMemoryRead.py (517 of 2110)
UNSUPPORTED: lldb-api :: functionalities/breakpoint/breakpoint_callback_command_source/TestBreakpointCallbackCommandSource.py (518 of 2110)
PASS: lldb-shell :: SymbolFile/DWARF/find-basic-namespace.cpp (519 of 2110)
PASS: lldb-unit :: Utility/./UtilityTests/StreamTest.PutChar (520 of 2110)
PASS: lldb-unit :: Utility/./UtilityTests/StreamTest.PutRawBytesToLittleEndian (521 of 2110)
PASS: lldb-api :: python_api/breakpoint/TestBreakpointAPI.py (522 of 2110)
PASS: lldb-api :: lang/objc/foundation/TestObjCMethodsNSError.py (523 of 2110)
PASS: lldb-api :: lang/objc/self/TestObjCSelf.py (524 of 2110)
PASS: lldb-shell :: SymbolFile/Breakpad/unwind-via-stack-cfi.test (525 of 2110)
PASS: lldb-unit :: UnwindAssembly/x86/./UnwindAssemblyx86Tests/Testx86AssemblyInspectionEngine.TestStackRealignMSVC_i386 (526 of 2110)
UNSUPPORTED: lldb-shell :: SymbolFile/PDB/function-level-linking.test (527 of 2110)
PASS: lldb-unit :: Utility/./UtilityTests/AnsiTerminal.Basic (528 of 2110)
PASS: lldb-unit :: Utility/./UtilityTests/StreamTest.ShiftOperatorChars (529 of 2110)
PASS: lldb-api :: macosx/duplicate-archive-members/TestDuplicateMembers.py (530 of 2110)
PASS: lldb-unit :: Utility/./UtilityTests/StructuredDataTest.StringDump (531 of 2110)
PASS: lldb-unit :: Utility/./UtilityTests/StringExtractorTest.GetU64BigEndian (532 of 2110)
PASS: lldb-unit :: UnwindAssembly/x86/./UnwindAssemblyx86Tests/Testx86AssemblyInspectionEngine.TestPopR14 (533 of 2110)
PASS: lldb-unit :: Utility/./UtilityTests/ArgsTest.GetArgumentArrayRef (534 of 2110)
PASS: lldb-api :: tools/lldb-server/register-reading/TestGdbRemoteGPacket.py (535 of 2110)
PASS: lldb-unit :: Utility/./UtilityTests/LogChannelEnabledTest.LogThread (536 of 2110)
PASS: lldb-shell :: SymbolFile/DWARF/win-i386-line-table.s (537 of 2110)
PASS: lldb-shell :: BuildScript/modes.test (538 of 2110)
PASS: lldb-unit :: Utility/./UtilityTests/StringExtractorTest.DecodeHexU8_InvalidHex2 (539 of 2110)
PASS: lldb-api :: macosx/universal/TestUniversal.py (540 of 2110)
PASS: lldb-unit :: Host/./HostTests/SocketTest.DomainGetConnectURI (541 of 2110)
PASS: lldb-unit :: Expression/./ExpressionTests/ClangHostTest.ComputeClangResourceDirectory (542 of 2110)
PASS: lldb-unit :: Utility/./UtilityTests/BinaryStreamTest.PutSLEB128SevenBytes (543 of 2110)
PASS: lldb-unit :: Utility/./UtilityTests/ConstStringTest.CompareStringRef (544 of 2110)
PASS: lldb-api :: tools/lldb-vscode/launch/TestVSCode_launch.py (545 of 2110)
PASS: lldb-api :: functionalities/tail_call_frames/disambiguate_tail_call_seq/TestDisambiguateTailCallSeq.py (546 of 2110)
PASS: lldb-api :: functionalities/thread/concurrent_events/TestConcurrentTwoWatchpointsOneSignal.py (547 of 2110)
PASS: lldb-unit :: DataFormatter/./LLDBFormatterTests/TypeMatcherTests.GetMatchStringExactName (548 of 2110)
PASS: lldb-unit :: ObjectFile/Breakpad/./ObjectFileBreakpadTests/Record.classify (549 of 2110)
PASS: lldb-unit :: Utility/./UtilityTests/RegularExpression.Match (550 of 2110)
PASS: lldb-unit :: Utility/./UtilityTests/BinaryStreamTest.PutSLEB128TwoBytes (551 of 2110)
UNSUPPORTED: lldb-api :: tools/intel-features/intel-pt/test/TestIntelPTSimpleBinary.py (552 of 2110)
PASS: lldb-api :: functionalities/breakpoint/consecutive_breakpoints/TestConsecutiveBreakpoints.py (553 of 2110)
UNSUPPORTED: lldb-api :: functionalities/darwin_log/source/debug/TestDarwinLogSourceDebug.py (554 of 2110)
PASS: lldb-api :: functionalities/gdb_remote_client/TestNestedRegDefinitions.py (555 of 2110)
PASS: lldb-shell :: Breakpoint/dummy-target.test (556 of 2110)
PASS: lldb-shell :: ExecControl/StopHook/stop-hook.test (557 of 2110)
PASS: lldb-unit :: Utility/./UtilityTests/StringListTest.GetMaxStringLengthEmpty (558 of 2110)
PASS: lldb-api :: tools/lldb-server/inferior-crash/TestGdbRemoteSegFault.py (559 of 2110)
PASS: lldb-shell :: Reproducer/TestFileRepro.test (560 of 2110)
PASS: lldb-unit :: Utility/./UtilityTests/UUIDTest.SetFromStringRef (561 of 2110)
PASS: lldb-unit :: Utility/./UtilityTests/RangeTest.SizeTypes (562 of 2110)
PASS: lldb-unit :: Utility/./UtilityTests/StreamTeeTest.CopyConstructor (563 of 2110)
PASS: lldb-unit :: UnwindAssembly/x86/./UnwindAssemblyx86Tests/Testx86AssemblyInspectionEngine.TestPushESI (564 of 2110)
UNSUPPORTED: lldb-api :: commands/register/register/intel_xtended_registers/mpx_offset_intersection/TestMPXOffsetIntersection.py (565 of 2110)
PASS: lldb-shell :: Commands/command-source.test (566 of 2110)
PASS: lldb-api :: commands/command/delete/TestCommandDelete.py (567 of 2110)
PASS: lldb-api :: lang/objc/orderedset/TestOrderedSet.py (568 of 2110)
PASS: lldb-unit :: Utility/./UtilityTests/BinaryStreamTest.PutULEB128One (569 of 2110)
PASS: lldb-unit :: DataFormatter/./LLDBFormatterTests/TypeMatcherTests.RegexMatchPart (570 of 2110)
PASS: lldb-unit :: Utility/./UtilityTests/UriParserTest.MinimalPort (571 of 2110)
PASS: lldb-api :: functionalities/rerun/TestRerun.py (572 of 2110)
PASS: lldb-api :: functionalities/tail_call_frames/thread_step_out_message/TestArtificialFrameStepOutMessage.py (573 of 2110)
PASS: lldb-unit :: Utility/./UtilityTests/ListenerTest.GetEventWait (574 of 2110)
PASS: lldb-shell :: SymbolFile/Breakpad/stack-cfi-parsing.test (575 of 2110)
PASS: lldb-api :: functionalities/breakpoint/scripted_bkpt/TestScriptedResolver.py (576 of 2110)
PASS: lldb-api :: functionalities/gdb_remote_client/TestNoWatchpointSupportInfo.py (577 of 2110)
PASS: lldb-shell :: ScriptInterpreter/None/import_module.test (578 of 2110)
PASS: lldb-unit :: ObjectFile/PECOFF/./ObjectFilePECOFFTests/PECallFrameInfoTest.Frame_reg_eh (579 of 2110)
PASS: lldb-unit :: Utility/./UtilityTests/RecordReplayTest.InstrumentedFooSameThis (580 of 2110)
UNSUPPORTED: lldb-shell :: SymbolFile/NativePDB/ast-functions-msvc.cpp (581 of 2110)
PASS: lldb-unit :: UnwindAssembly/x86/./UnwindAssemblyx86Tests/Testx86AssemblyInspectionEngine.Test64bitFramelessSmallStackFrame (582 of 2110)
PASS: lldb-api :: functionalities/limit-debug-info/TestLimitDebugInfo.py (583 of 2110)
PASS: lldb-unit :: Utility/./UtilityTests/CompletionRequest.ShiftArguments (584 of 2110)
PASS: lldb-api :: functionalities/pointer_num_children/TestPointerNumChildren.py (585 of 2110)
PASS: lldb-unit :: Symbol/./SymbolTests/TestTypeSystemClang.TestFunctionTemplateConstruction (586 of 2110)
PASS: lldb-unit :: Expression/./ExpressionTests/CppModuleConfigurationTest.Sysroot (587 of 2110)
PASS: lldb-unit :: ScriptInterpreter/Python/./ScriptInterpreterPythonTests/PythonDataObjectsTest.TestGlobalNameResolutionNoDot (588 of 2110)
PASS: lldb-unit :: Symbol/./SymbolTests/LineEntryTest.GetSameLineContiguousAddressRangeNestedInline (589 of 2110)
PASS: lldb-api :: functionalities/breakpoint/global_constructor/TestBreakpointInGlobalConstructor.py (590 of 2110)
PASS: lldb-unit :: Process/minidump/./LLDBMinidumpTests/MinidumpParserTest.GetThreadContext_x86_64 (591 of 2110)
PASS: lldb-unit :: SymbolFile/DWARF/./SymbolFileDWARFTests/XcodeSDKModuleTests.TestModuleGetXcodeSDK (592 of 2110)
PASS: lldb-unit :: Expression/./ExpressionTests/DWARFExpression.DW_OP_convert (593 of 2110)
PASS: lldb-unit :: Utility/./UtilityTests/BinaryStreamTest.PutULEB128OneByte (594 of 2110)
PASS: lldb-unit :: Utility/./UtilityTests/StreamTest.PutCString (595 of 2110)
PASS: lldb-unit :: Utility/./UtilityTests/StringExtractorTest.GetHexBytesAvail (596 of 2110)
UNSUPPORTED: lldb-api :: lang/cpp/static_members/TestCPPStaticMembers.py (597 of 2110)
PASS: lldb-api :: functionalities/breakpoint/step_over_breakpoint/TestStepOverBreakpoint.py (598 of 2110)
PASS: lldb-unit :: Utility/./UtilityTests/OptionsWithRawTest.ArgsButNoDelimiter (599 of 2110)
PASS: lldb-unit :: ScriptInterpreter/Python/./ScriptInterpreterPythonTests/PythonDataObjectsTest.TestPythonString (600 of 2110)
UNSUPPORTED: lldb-api :: functionalities/tsan/cpp_global_location/TestTsanCPPGlobalLocation.py (601 of 2110)
PASS: lldb-unit :: ScriptInterpreter/Python/./ScriptInterpreterPythonTests/PythonDataObjectsTest.TestPythonByteArray (602 of 2110)
PASS: lldb-api :: functionalities/set-data/TestSetData.py (603 of 2110)
PASS: lldb-api :: functionalities/history/TestHistoryRecall.py (604 of 2110)
UNSUPPORTED: lldb-api :: functionalities/thread/state/TestThreadStates.py (605 of 2110)
PASS: lldb-unit :: Symbol/./SymbolTests/LineEntryTest.GetSameLineContiguousAddressRangeNoInlines (606 of 2110)
PASS: lldb-unit :: UnwindAssembly/x86/./UnwindAssemblyx86Tests/Testx86AssemblyInspectionEngine.TestPopEBX (607 of 2110)
PASS: lldb-api :: commands/expression/call-function/TestCallBuiltinFunction.py (608 of 2110)
PASS: lldb-unit :: Utility/./UtilityTests/StringExtractorTest.GetHexBytesAvail_FullString (609 of 2110)
PASS: lldb-unit :: Utility/./UtilityTests/ArchSpecTest.TripleComponentsWereSpecified (610 of 2110)
PASS: lldb-unit :: Utility/./UtilityTests/ArgsTest.AppendArguments (611 of 2110)
PASS: lldb-shell :: SymbolFile/DWARF/DW_AT_declaration-with-children.s (612 of 2110)
PASS: lldb-shell :: SymbolFile/DWARF/debug_loc.s (613 of 2110)
PASS: lldb-api :: functionalities/data-formatter/data-formatter-objc/TestDataFormatterObjCNSDate.py (614 of 2110)
PASS: lldb-unit :: Host/./HostTests/SocketTest.TCPListen0ConnectAccept (615 of 2110)
PASS: lldb-unit :: Interpreter/./InterpreterTests/CompletionTest.FileCompletionAbsolute (616 of 2110)
PASS: lldb-unit :: DataFormatter/./LLDBFormatterTests/StringPrinterTests.CxxASCII (617 of 2110)
PASS: lldb-unit :: Utility/./UtilityTests/OptionsWithRawTest.EmptySuffix (618 of 2110)
PASS: lldb-unit :: SymbolFile/NativePDB/./SymbolFileNativePDBTests/PDBFPOProgramToDWARFExpressionTests.UnresolvedRegisterReference (619 of 2110)
PASS: lldb-unit :: Utility/./UtilityTests/LogChannelEnabledTest.LogGetLogThread (620 of 2110)
PASS: lldb-api :: functionalities/breakpoint/breakpoint_ids/TestBreakpointIDs.py (621 of 2110)
PASS: lldb-api :: commands/expression/radar_9673664/TestExprHelpExamples.py (622 of 2110)
PASS: lldb-shell :: SymbolFile/NativePDB/tag-types.cpp (623 of 2110)
PASS: lldb-shell :: SymbolFile/DWARF/debug-types-address-ranges.s (624 of 2110)
PASS: lldb-shell :: Quit/TestQuitExitCodeTooManyArgs.test (625 of 2110)
PASS: lldb-shell :: Commands/command-breakpoint-col.test (626 of 2110)
PASS: lldb-shell :: SymbolFile/Breakpad/symtab-macho.test (627 of 2110)
PASS: lldb-api :: functionalities/breakpoint/breakpoint_set_restart/TestBreakpointSetRestart.py (628 of 2110)
PASS: lldb-api :: macosx/find-app-in-bundle/TestFindAppInBundle.py (629 of 2110)
PASS: lldb-shell :: SymbolFile/Breakpad/unwind-via-stack-win-no-memory-info.yaml (630 of 2110)
PASS: lldb-api :: commands/expression/persistent_variables/TestPersistentVariables.py (631 of 2110)
PASS: lldb-api :: functionalities/data-formatter/vector-types/TestVectorTypesFormatting.py (632 of 2110)
PASS: lldb-api :: lang/cpp/auto/TestCPPAuto.py (633 of 2110)
PASS: lldb-unit :: Utility/./UtilityTests/DataExtractorTest.GetFloat (634 of 2110)
PASS: lldb-api :: lang/objc/objc-static-method-stripped/TestObjCStaticMethodStripped.py (635 of 2110)
UNSUPPORTED: lldb-api :: benchmarks/frame_variable/TestFrameVariableResponse.py (636 of 2110)
PASS: lldb-api :: macosx/lc-note/kern-ver-str/TestKernVerStrLCNOTE.py (637 of 2110)
PASS: lldb-unit :: Process/minidump/./LLDBMinidumpTests/MinidumpParserTest.GetMiscInfoWindows (638 of 2110)
PASS: lldb-api :: commands/expression/import_base_class_when_class_has_derived_member/TestImportBaseClassWhenClassHasDerivedMember.py (639 of 2110)
PASS: lldb-api :: commands/watchpoints/hello_watchpoint/TestMyFirstWatchpoint.py (640 of 2110)
PASS: lldb-api :: lang/objc/objc-property/TestObjCProperty.py (641 of 2110)
PASS: lldb-unit :: Utility/./UtilityTests/UriParserTest.TypicalPortPathIPv4 (642 of 2110)
PASS: lldb-api :: functionalities/gdb_remote_client/TestRecognizeBreakpoint.py (643 of 2110)
PASS: lldb-unit :: Expression/./ExpressionTests/DiagnosticManagerTest.GetStringBasic (644 of 2110)
PASS: lldb-unit :: ScriptInterpreter/Python/./ScriptInterpreterPythonTests/PythonDataObjectsTest.TestResetting (645 of 2110)
PASS: lldb-unit :: Utility/./UtilityTests/VMRange.Ordering (646 of 2110)
PASS: lldb-unit :: Thread/./ThreadTests/ThreadTest.SetStopInfo (647 of 2110)
PASS: lldb-api :: functionalities/data-formatter/data-formatter-stl/libcxx/optional/TestDataFormatterLibcxxOptional.py (648 of 2110)
PASS: lldb-api :: functionalities/data-formatter/data-formatter-stl/libcxx/unordered/TestDataFormatterUnordered.py (649 of 2110)
PASS: lldb-api :: macosx/add-dsym/TestAddDsymMidExecutionCommand.py (650 of 2110)
PASS: lldb-api :: functionalities/gdb_remote_client/TestThreadSelectionBug.py (651 of 2110)
PASS: lldb-api :: driver/batch_mode/TestBatchMode.py (652 of 2110)
PASS: lldb-unit :: Language/Highlighting/./HighlighterTests/HighlighterTest.ClangOperators (653 of 2110)
PASS: lldb-unit :: Expression/./ExpressionTests/CppModuleConfigurationTest.LinuxLocalLibCpp (654 of 2110)
PASS: lldb-unit :: Utility/./UtilityTests/StreamTeeTest.Flush (655 of 2110)
UNSUPPORTED: lldb-api :: commands/expression/multiline-completion/TestMultilineCompletion.py (656 of 2110)
UNSUPPORTED: lldb-shell :: ScriptInterpreter/Lua/independent_state.test (657 of 2110)
PASS: lldb-api :: functionalities/data-formatter/data-formatter-stl/libcxx/set/TestDataFormatterLibcxxSet.py (658 of 2110)
PASS: lldb-unit :: Utility/./UtilityTests/NameMatchesTest.Ignore (659 of 2110)
PASS: lldb-unit :: SymbolFile/NativePDB/./SymbolFileNativePDBTests/PDBFPOProgramToDWARFExpressionTests.InvalidOpUnary (660 of 2110)
PASS: lldb-shell :: SymbolFile/DWARF/debug-types-dwarf5.s (661 of 2110)
PASS: lldb-unit :: Utility/./UtilityTests/PassiveReplayTest.InstrumentedFoo (662 of 2110)
UNSUPPORTED: lldb-shell :: SymbolFile/NativePDB/local-variables.cpp (663 of 2110)
PASS: lldb-unit :: Utility/./UtilityTests/ScalarTest.ExtractBitfield (664 of 2110)
PASS: lldb-api :: lang/cpp/limit-debug-info/TestWithLimitDebugInfo.py (665 of 2110)
PASS: lldb-unit :: Utility/./UtilityTests/ScalarTest.Equality (666 of 2110)
PASS: lldb-api :: commands/expression/import-std-module/deque-dbg-info-content/TestDbgInfoContentDequeFromStdModule.py (667 of 2110)
PASS: lldb-api :: commands/expression/issue_11588/Test11588.py (668 of 2110)
PASS: lldb-shell :: SymbolFile/DWARF/debug_ranges.s (669 of 2110)
PASS: lldb-unit :: Utility/./UtilityTests/TimeoutTest.Format (670 of 2110)
PASS: lldb-unit :: SymbolFile/DWARF/./SymbolFileDWARFTests/SymbolFileDWARFTests.TestAbilitiesForDWARF (671 of 2110)
PASS: lldb-unit :: Expression/./ExpressionTests/DWARFExpression.DW_OP_piece (672 of 2110)
PASS: lldb-api :: commands/frame/diagnose/dereference-argument/TestDiagnoseDereferenceArgument.py (673 of 2110)
PASS: lldb-shell :: SymbolFile/DWARF/debug_ranges_and_rnglists.test (674 of 2110)
PASS: lldb-shell :: ObjectFile/ELF/build-id-case.yaml (675 of 2110)
PASS: lldb-api :: functionalities/data-formatter/poarray/TestPrintObjectArray.py (676 of 2110)
PASS: lldb-unit :: UnwindAssembly/x86/./UnwindAssemblyx86Tests/Testx86AssemblyInspectionEngine.TestPushR13 (677 of 2110)
PASS: lldb-unit :: Expression/./ExpressionTests/CppModuleConfigurationTest.LibCppV2 (678 of 2110)
PASS: lldb-api :: functionalities/postmortem/mach-core/TestMachCore.py (679 of 2110)
PASS: lldb-shell :: Reproducer/TestWorkingDir.test (680 of 2110)
UNSUPPORTED: lldb-api :: functionalities/asan/TestMemoryHistory.py (681 of 2110)
PASS: lldb-api :: functionalities/data-formatter/data-formatter-objc/TestDataFormatterObjNSException.py (682 of 2110)
PASS: lldb-api :: lang/c/const_variables/TestConstVariables.py (683 of 2110)
PASS: lldb-api :: lang/cpp/nested-class-other-compilation-unit/TestNestedClassWithParentInAnotherCU.py (684 of 2110)
PASS: lldb-api :: functionalities/breakpoint/move_nearest/TestMoveNearest.py (685 of 2110)
PASS: lldb-shell :: SymbolFile/DWARF/dwarf5-index-is-used.cpp (686 of 2110)
PASS: lldb-api :: functionalities/signal/TestSendSignal.py (687 of 2110)
UNSUPPORTED: lldb-api :: functionalities/ubsan/user-expression/TestUbsanUserExpression.py (688 of 2110)
PASS: lldb-shell :: SymbolFile/NativePDB/disassembly.cpp (689 of 2110)
PASS: lldb-api :: commands/frame/language/TestGuessLanguage.py (690 of 2110)
PASS: lldb-unit :: Utility/./UtilityTests/StreamTeeTest.Assignment (691 of 2110)
PASS: lldb-unit :: Process/minidump/./LLDBMinidumpTests/MinidumpParserTest.GetArchitecture (692 of 2110)
PASS: lldb-api :: functionalities/data-formatter/data-formatter-cpp/TestDataFormatterCpp.py (693 of 2110)
PASS: lldb-unit :: Symbol/./SymbolTests/TestTypeSystemClang.TestGetBasicTypeFromEnum (694 of 2110)
PASS: lldb-unit :: Utility/./UtilityTests/OptionsWithRawTest.EmptyArgsOnlySuffix (695 of 2110)
PASS: lldb-unit :: Utility/./UtilityTests/StreamTest.PutCStringWithStringRef (696 of 2110)
PASS: lldb-api :: lang/c/complex/TestComplexC99.py (697 of 2110)
PASS: lldb-unit :: Language/CPlusPlus/./LanguageCPlusPlusTests/CPlusPlusLanguage.CPlusPlusNameParser (698 of 2110)
UNSUPPORTED: lldb-shell :: Register/x86-zmm-read.test (699 of 2110)
PASS: lldb-shell :: Settings/TestFrameFormatMangling.test (700 of 2110)
PASS: lldb-unit :: Interpreter/./InterpreterTests/OptionArgParserTest.toScriptLanguage (701 of 2110)
PASS: lldb-api :: commands/expression/context-object/TestContextObject.py (702 of 2110)
PASS: lldb-api :: commands/frame/select/TestFrameSelect.py (703 of 2110)
PASS: lldb-shell :: SymbolFile/DWARF/find-qualified-variable.cpp (704 of 2110)
PASS: lldb-api :: tools/lldb-server/TestGdbRemoteThreadsInStopReply.py (705 of 2110)
PASS: lldb-api :: commands/expression/no-deadlock/TestExprDoesntBlock.py (706 of 2110)
PASS: lldb-unit :: Utility/./UtilityTests/CompletionRequest.DuplicateFilteringWithComments (707 of 2110)
PASS: lldb-unit :: ScriptInterpreter/Python/./ScriptInterpreterPythonTests/PythonDataObjectsTest.TestExceptions (708 of 2110)
PASS: lldb-unit :: Target/./TargetTests/MCBasedABI.MapRegisterName (709 of 2110)
PASS: lldb-unit :: Utility/./UtilityTests/DataExtractorTest.GetCStr (710 of 2110)
PASS: lldb-unit :: UnwindAssembly/x86/./UnwindAssemblyx86Tests/Testx86AssemblyInspectionEngine.Test32bitFramelessBigStackFrame (711 of 2110)
PASS: lldb-unit :: Utility/./UtilityTests/FileSpecTest.EqualSeparator (712 of 2110)
PASS: lldb-shell :: Driver/TestUseColor.test (713 of 2110)
PASS: lldb-unit :: Utility/./UtilityTests/LogTest.Unregister (714 of 2110)
UNSUPPORTED: lldb-api :: functionalities/thread/multi_break/TestMultipleBreakpoints.py (715 of 2110)
PASS: lldb-unit :: Utility/./UtilityTests/NameMatchesTest.StartsWith (716 of 2110)
PASS: lldb-api :: commands/process/attach/attach_denied/TestAttachDenied.py (717 of 2110)
PASS: lldb-unit :: Utility/./UtilityTests/RangeTest.Union (718 of 2110)
PASS: lldb-unit :: Utility/./UtilityTests/DataExtractorTest.GetBitfield (719 of 2110)
PASS: lldb-api :: lang/c/complex_int/TestComplexInt.py (720 of 2110)
PASS: lldb-api :: commands/expression/diagnostics/TestExprDiagnostics.py (721 of 2110)
PASS: lldb-unit :: Utility/./UtilityTests/RangeTest.ContainsRangeStartingFromZero (722 of 2110)
PASS: lldb-api :: lang/c/modules/TestCModules.py (723 of 2110)
PASS: lldb-api :: functionalities/thread/concurrent_events/TestConcurrentTwoWatchpointsOneDelayBreakpoint.py (724 of 2110)
PASS: lldb-unit :: Utility/./UtilityTests/FileSpecTest.EqualDotsWindows (725 of 2110)
PASS: lldb-unit :: Process/gdb-remote/./ProcessGdbRemoteTests/GDBRemoteCommunicationTest.ReadPacket_checksum (726 of 2110)
PASS: lldb-unit :: Utility/./UtilityTests/RegularExpression.Empty (727 of 2110)
PASS: lldb-api :: python_api/sbtype_typeclass/TestSBTypeTypeClass.py (728 of 2110)
PASS: lldb-unit :: Utility/./UtilityTests/UUIDTest.Validity (729 of 2110)
PASS: lldb-unit :: Utility/./UtilityTests/DataExtractorTest.GetMaxU64_unchecked (730 of 2110)
PASS: lldb-unit :: Utility/./UtilityTests/VMRange.IsValid (731 of 2110)
PASS: lldb-shell :: ScriptInterpreter/Python/eof.test (732 of 2110)
PASS: lldb-unit :: Utility/./UtilityTests/StreamTest.AddressEmptyPrefix (733 of 2110)
PASS: lldb-api :: functionalities/data-formatter/data-formatter-stl/libcxx/function/TestLibCxxFunction.py (734 of 2110)
PASS: lldb-shell :: Minidump/dump-all.test (735 of 2110)
PASS: lldb-unit :: Utility/./UtilityTests/BinaryStreamTest.PutSLEB128SixBytes (736 of 2110)
PASS: lldb-unit :: Expression/./ExpressionTests/DWARFExpression.DW_OP_pick (737 of 2110)
PASS: lldb-unit :: SymbolFile/DWARF/./SymbolFileDWARFTests/SymbolFileDWARFTests.TestAbbrevMissingTerminator (738 of 2110)
PASS: lldb-shell :: ObjectFile/Breakpad/sections.test (739 of 2110)
PASS: lldb-api :: functionalities/load_unload/TestLoadUnload.py (740 of 2110)
PASS: lldb-unit :: UnwindAssembly/x86/./UnwindAssemblyx86Tests/Testx86AssemblyInspectionEngine.TestSpArithx86_64Augmented (741 of 2110)
PASS: lldb-unit :: Utility/./UtilityTests/UUIDTest.RelationalOperators (742 of 2110)
PASS: lldb-api :: functionalities/thread/concurrent_events/TestConcurrentSignalBreak.py (743 of 2110)
PASS: lldb-unit :: Utility/./UtilityTests/StreamTest.PutHex8 (744 of 2110)
PASS: lldb-shell :: ObjectFile/ELF/gnu-debuglink.yaml (745 of 2110)
PASS: lldb-unit :: UnwindAssembly/x86/./UnwindAssemblyx86Tests/Testx86AssemblyInspectionEngine.TestPopRBX (746 of 2110)
PASS: lldb-shell :: Reproducer/TestVersionCheck.test (747 of 2110)
PASS: lldb-unit :: Utility/./UtilityTests/OptionsWithRawTest.EmptyInput (748 of 2110)
PASS: lldb-api :: commands/expression/import-std-module/forward_list-dbg-info-content/TestDbgInfoContentForwardListFromStdModule.py (749 of 2110)
PASS: lldb-shell :: SymbolFile/DWARF/DW_AT_low_pc-addrx.s (750 of 2110)
PASS: lldb-api :: functionalities/tail_call_frames/disambiguate_paths_to_common_sink/TestDisambiguatePathsToCommonSink.py (751 of 2110)
PASS: lldb-api :: functionalities/data-formatter/data-formatter-objc/nsstring/TestDataFormatterNSString.py (752 of 2110)
PASS: lldb-unit :: Utility/./UtilityTests/XcodeSDKTest.SDKSupportsModules (753 of 2110)
PASS: lldb-api :: api/multithreaded/TestMultithreaded.py (754 of 2110)
PASS: lldb-unit :: UnwindAssembly/x86/./UnwindAssemblyx86Tests/Testx86AssemblyInspectionEngine.TestPopR15 (755 of 2110)
PASS: lldb-api :: commands/process/signal/TestProcessSignal.py (756 of 2110)
PASS: lldb-api :: lang/objc/exceptions/TestObjCExceptions.py (757 of 2110)
PASS: lldb-unit :: Utility/./UtilityTests/VMRange.ContainsRange (758 of 2110)
PASS: lldb-unit :: Host/./HostTests/NativeProcessProtocolTest.ReadCStringFromMemory_CrossPageBoundary (759 of 2110)
PASS: lldb-unit :: Symbol/./SymbolTests/TestTypeSystemClang.TestGetEnumIntegerTypeInvalid (760 of 2110)
PASS: lldb-api :: commands/expression/entry-bp/TestExprEntryBP.py (761 of 2110)
PASS: lldb-api :: lang/cpp/scope/TestCppScope.py (762 of 2110)
PASS: lldb-api :: tools/lldb-server/TestGdbRemoteAttach.py (763 of 2110)
PASS: lldb-api :: commands/frame/diagnose/inheritance/TestDiagnoseInheritance.py (764 of 2110)
PASS: lldb-api :: commands/expression/call-function/TestCallUserDefinedFunction.py (765 of 2110)
PASS: lldb-api :: functionalities/unwind/zeroth_frame/TestZerothFrame.py (766 of 2110)
PASS: lldb-api :: functionalities/breakpoint/serialize/TestBreakpointSerialization.py (767 of 2110)
PASS: lldb-api :: commands/expression/import-std-module/shared_ptr-dbg-info-content/TestSharedPtrDbgInfoContentFromStdModule.py (768 of 2110)
PASS: lldb-unit :: Utility/./UtilityTests/UriParserTest.SchemeHostSeparator3 (769 of 2110)
PASS: lldb-api :: lang/cpp/gmodules/TestWithModuleDebugging.py (770 of 2110)
PASS: lldb-api :: commands/session/save/TestSessionSave.py (771 of 2110)
PASS: lldb-unit :: Utility/./UtilityTests/StringListTest.CopyListSingle (772 of 2110)
PASS: lldb-unit :: Utility/./UtilityTests/DataExtractorTest.GetMaxS64 (773 of 2110)
PASS: lldb-api :: python_api/section/TestSectionAPI.py (774 of 2110)
PASS: lldb-unit :: Expression/./ExpressionTests/DiagnosticManagerTest.GetStringPreserveOrder (775 of 2110)
PASS: lldb-api :: functionalities/thread_plan/TestThreadPlanCommands.py (776 of 2110)
PASS: lldb-shell :: Unwind/eh-frame-dwarf-unwind.test (777 of 2110)
PASS: lldb-api :: commands/expression/dont_allow_jit/TestAllowJIT.py (778 of 2110)
PASS: lldb-unit :: Language/Highlighting/./HighlighterTests/HighlighterTest.ClangUnterminatedString (779 of 2110)
PASS: lldb-shell :: BuildScript/toolchain-clang.test (780 of 2110)
PASS: lldb-api :: functionalities/postmortem/netbsd-core/TestNetBSDCore.py (781 of 2110)
PASS: lldb-unit :: Host/./HostTests/SocketTest.TCPGetAddress (782 of 2110)
PASS: lldb-unit :: Utility/./UtilityTests/StringListTest.Assignment (783 of 2110)
PASS: lldb-api :: commands/expression/invalid-args/TestInvalidArgsExpression.py (784 of 2110)
PASS: lldb-api :: sanity/TestSettingSkipping.py (785 of 2110)
PASS: lldb-shell :: SymbolFile/DWARF/dwarf5-partial-index.cpp (786 of 2110)
PASS: lldb-api :: tools/lldb-server/TestGdbRemoteExpeditedRegisters.py (787 of 2110)
PASS: lldb-shell :: ObjectFile/ELF/section-types-edgecases.yaml (788 of 2110)
PASS: lldb-api :: functionalities/data-formatter/synthcapping/TestSyntheticCapping.py (789 of 2110)
PASS: lldb-unit :: Process/gdb-remote/./ProcessGdbRemoteTests/GDBRemoteCommunicationClientTest.GetMemoryRegionInfoInvalidResponse (790 of 2110)
PASS: lldb-unit :: Utility/./UtilityTests/ScalarTest.GetBytes (791 of 2110)
PASS: lldb-unit :: Core/./LLDBCoreTests/MangledTest.EmptyForInvalidName (792 of 2110)
PASS: lldb-shell :: ObjectFile/MachO/lc_build_version_notools.yaml (793 of 2110)
UNSUPPORTED: lldb-shell :: SymbolFile/PDB/pointers.test (794 of 2110)
PASS: lldb-api :: commands/expression/context-object-objc/TestContextObjectObjc.py (795 of 2110)
PASS: lldb-api :: commands/target/modules/search-paths/insert/TestTargetModulesSearchpathsInsert.py (796 of 2110)
UNSUPPORTED: lldb-api :: commands/gui/breakpoints/TestGuiBreakpoints.py (797 of 2110)
PASS: lldb-unit :: Utility/./UtilityTests/BinaryStreamTest.PutULEB128ThreeBytes (798 of 2110)
PASS: lldb-unit :: UnwindAssembly/x86/./UnwindAssemblyx86Tests/Testx86AssemblyInspectionEngine.TestMovRSPtoRBP (799 of 2110)
PASS: lldb-unit :: Utility/./UtilityTests/UriParserTest.BracketedHostnameWithPortIPv6 (800 of 2110)
PASS: lldb-unit :: Expression/./ExpressionTests/CppModuleConfigurationTest.AmbiguousLibCpp (801 of 2110)
PASS: lldb-api :: functionalities/dynamic_value_child_count/TestDynamicValueChildCount.py (802 of 2110)
PASS: lldb-unit :: Utility/./UtilityTests/StreamTest.SetIndentLevel (803 of 2110)
UNSUPPORTED: lldb-shell :: Expr/TestIRMemoryMapWindows.test (804 of 2110)
PASS: lldb-shell :: SymbolFile/NativePDB/locate-pdb.cpp (805 of 2110)
PASS: lldb-unit :: Utility/./UtilityTests/StringListTest.AppendListCStringArrayEmpty (806 of 2110)
PASS: lldb-api :: python_api/class_members/TestSBTypeClassMembers.py (807 of 2110)
UNSUPPORTED: lldb-api :: functionalities/data-formatter/data-formatter-stl/libstdcpp/smart_ptr/TestDataFormatterStdSmartPtr.py (808 of 2110)
PASS: lldb-api :: python_api/sblaunchinfo/TestSBLaunchInfo.py (809 of 2110)
PASS: lldb-api :: functionalities/inferior-crashing/recursive-inferior/TestRecursiveInferiorStep.py (810 of 2110)
UNSUPPORTED: lldb-shell :: Breakpoint/ppc64-localentry.test (811 of 2110)
PASS: lldb-unit :: Utility/./UtilityTests/SerializationRountripTest.SerializeDeserializePodReferences (812 of 2110)
PASS: lldb-unit :: Utility/./UtilityTests/ArgsTest.ReplaceArgumentAtIndexLonger (813 of 2110)
PASS: lldb-unit :: Signals/./SignalsTests/UnixSignalsTest.Iteration (814 of 2110)
PASS: lldb-api :: commands/expression/import-std-module/shared_ptr/TestSharedPtrFromStdModule.py (815 of 2110)
PASS: lldb-api :: commands/expression/pr35310/TestExprsBug35310.py (816 of 2110)
PASS: lldb-api :: functionalities/abbreviation/TestAbbreviations.py (817 of 2110)
PASS: lldb-shell :: SymbolFile/DWARF/debug_aranges-empty-section.s (818 of 2110)
PASS: lldb-api :: python_api/watchpoint/TestWatchpointIter.py (819 of 2110)
PASS: lldb-api :: functionalities/process_crash_info/TestProcessCrashInfo.py (820 of 2110)
PASS: lldb-api :: lang/cpp/stl/TestStdCXXDisassembly.py (821 of 2110)
PASS: lldb-unit :: Utility/./UtilityTests/RangeTest.Clear (822 of 2110)
PASS: lldb-api :: functionalities/data-formatter/data-formatter-objc/TestDataFormatterObjCPlain.py (823 of 2110)
PASS: lldb-unit :: Host/./HostTests/HostInfoTest.GetHostname (824 of 2110)
UNSUPPORTED: lldb-api :: tools/lldb-server/thread-name/TestGdbRemoteThreadName.py (825 of 2110)
PASS: lldb-api :: functionalities/thread/concurrent_events/TestConcurrentTwoBreakpointsOneSignal.py (826 of 2110)
PASS: lldb-unit :: Utility/./UtilityTests/PassiveReplayTest.InstrumentedBar (827 of 2110)
PASS: lldb-api :: functionalities/gdb_remote_client/TestGDBRemoteClient.py (828 of 2110)
PASS: lldb-unit :: Host/./HostTests/SocketTest.UDPConnect (829 of 2110)
UNSUPPORTED: lldb-api :: functionalities/darwin_log/filter/regex/activity-chain/TestDarwinLogFilterRegexActivityChain.py (830 of 2110)
PASS: lldb-api :: functionalities/multiword-commands/TestMultiWordCommands.py (831 of 2110)
PASS: lldb-unit :: UnwindAssembly/x86/./UnwindAssemblyx86Tests/Testx86AssemblyInspectionEngine.TestPushEAX (832 of 2110)
UNSUPPORTED: lldb-api :: commands/register/register/intel_xtended_registers/mpx_bound_violation/TestBoundViolation.py (833 of 2110)
PASS: lldb-api :: commands/expression/calculator_mode/TestCalculatorMode.py (834 of 2110)
PASS: lldb-unit :: UnwindAssembly/x86/./UnwindAssemblyx86Tests/Testx86AssemblyInspectionEngine.TestSubRSP (835 of 2110)
PASS: lldb-api :: lang/objc/direct-dispatch-step/TestObjCDirectDispatchStepping.py (836 of 2110)
UNSUPPORTED: lldb-shell :: ScriptInterpreter/Lua/breakpoint_callback.test (837 of 2110)
PASS: lldb-unit :: Utility/./UtilityTests/BinaryStreamTest.PutSLEB128EightBytes (838 of 2110)
PASS: lldb-unit :: Utility/./UtilityTests/SerializationRountripTest.SerializeDeserializeCString (839 of 2110)
PASS: lldb-api :: functionalities/gdb_remote_client/TestRestartBug.py (840 of 2110)
PASS: lldb-unit :: SymbolFile/NativePDB/./SymbolFileNativePDBTests/PDBFPOProgramToDWARFExpressionTests.MultipleDependentAssignments (841 of 2110)
PASS: lldb-unit :: Utility/./UtilityTests/ProcessInstanceInfo.DumpTable (842 of 2110)
PASS: lldb-shell :: ObjectFile/ELF/PT_LOAD.yaml (843 of 2110)
PASS: lldb-unit :: Utility/./UtilityTests/RangeTest.NotEqualInvalid (844 of 2110)
PASS: lldb-api :: lang/cpp/nsimport/TestCppNsImport.py (845 of 2110)
PASS: lldb-unit :: Symbol/./SymbolTests/TestTypeSystemClang.TestGetEnumIntegerTypeBasicTypes (846 of 2110)
PASS: lldb-shell :: VSCode/TestOptions.test (847 of 2110)
PASS: lldb-unit :: Interpreter/./InterpreterTests/OptionArgParserTest.toChar (848 of 2110)
PASS: lldb-unit :: Symbol/./SymbolTests/TestClangASTImporter.CopyDeclTagDecl (849 of 2110)
UNSUPPORTED: lldb-api :: functionalities/thread/break_after_join/TestBreakAfterJoin.py (850 of 2110)
PASS: lldb-unit :: ScriptInterpreter/Python/./ScriptInterpreterPythonTests/PythonDataObjectsTest.TestScript (851 of 2110)
PASS: lldb-api :: functionalities/gdb_remote_client/TestTargetXMLArch.py (852 of 2110)
PASS: lldb-unit :: Utility/./UtilityTests/StringListTest.GetMaxStringLengthIncreasingSize (853 of 2110)
PASS: lldb-unit :: Utility/./UtilityTests/ArchSpecTest.TestParseMachCPUDashSubtypeTripleExtra (854 of 2110)
PASS: lldb-unit :: Symbol/./SymbolTests/TestTypeSystemClang.TestFunctionTemplateInRecordConstruction (855 of 2110)
PASS: lldb-shell :: Driver/TestProcessAttach.test (856 of 2110)
PASS: lldb-api :: functionalities/thread/concurrent_events/TestConcurrentNWatchNBreak.py (857 of 2110)
PASS: lldb-api :: commands/watchpoints/watchpoint_commands/TestWatchpointCommands.py (858 of 2110)
PASS: lldb-unit :: Utility/./UtilityTests/StreamTeeTest.GetStreamAtIndexOutOfBoundsEmpty (859 of 2110)
PASS: lldb-unit :: Utility/./UtilityTests/RangeTest.ContainsEndInclusive (860 of 2110)
PASS: lldb-unit :: Utility/./UtilityTests/Flags.IsClear (861 of 2110)
PASS: lldb-unit :: Expression/./ExpressionTests/CppModuleConfigurationTest.Linux (862 of 2110)
PASS: lldb-unit :: Utility/./UtilityTests/ArgsTest.ReplaceArgumentAtIndexOutOfRange (863 of 2110)
PASS: lldb-shell :: Reproducer/TestDSYM.test (864 of 2110)
PASS: lldb-shell :: SymbolFile/NativePDB/globals-bss.cpp (865 of 2110)
PASS: lldb-api :: lang/cpp/template/TestTemplateArgs.py (866 of 2110)
PASS: lldb-unit :: Utility/./UtilityTests/Predicate.WaitForValueNotEqualTo (867 of 2110)
PASS: lldb-unit :: ScriptInterpreter/Python/./ScriptInterpreterPythonTests/PythonDataObjectsTest.TestPythonListValueEquality (868 of 2110)
PASS: lldb-shell :: SymbolFile/DWARF/find-function-regex.cpp (869 of 2110)
PASS: lldb-api :: functionalities/data-formatter/ptr_ref_typedef/TestPtrRef2Typedef.py (870 of 2110)
PASS: lldb-shell :: Process/TestEnvironment.test (871 of 2110)
PASS: lldb-unit :: Expression/./ExpressionTests/DiagnosticManagerTest.GetStringSeverityLabels (872 of 2110)
PASS: lldb-api :: commands/watchpoints/watchpoint_commands/condition/TestWatchpointConditionCmd.py (873 of 2110)
PASS: lldb-unit :: Utility/./UtilityTests/RangeDataVector.FindEntryIndexesThatContain (874 of 2110)
PASS: lldb-unit :: Utility/./UtilityTests/StringExtractorTest.GetHexU8_Exact (875 of 2110)
PASS: lldb-unit :: UnwindAssembly/x86/./UnwindAssemblyx86Tests/Testx86AssemblyInspectionEngine.TestPushR14 (876 of 2110)
UNSUPPORTED: lldb-shell :: SymbolFile/dissassemble-entry-point.s (877 of 2110)
PASS: lldb-shell :: ObjectFile/ELF/avr-basic-info.yaml (878 of 2110)
PASS: lldb-unit :: Process/gdb-remote/./ProcessGdbRemoteTests/GDBRemoteClientBaseTest.SendContinueAndInterrupt2PacketBug (879 of 2110)
PASS: lldb-api :: functionalities/postmortem/elf-core/gcore/TestGCore.py (880 of 2110)
PASS: lldb-unit :: Utility/./UtilityTests/StreamTest.PutHex64ByteOrderBig (881 of 2110)
PASS: lldb-api :: functionalities/data-formatter/data-formatter-stl/libstdcpp/unique_ptr/invalid/TestDataFormatterInvalidStdUniquePtr.py (882 of 2110)
PASS: lldb-unit :: Utility/./UtilityTests/RecordReplayTest.InstrumentedFoo (883 of 2110)
PASS: lldb-api :: functionalities/data-formatter/data-formatter-objc/TestDataFormatterObjCNSBundle.py (884 of 2110)
PASS: lldb-unit :: ScriptInterpreter/Python/./ScriptInterpreterPythonTests/PythonDataObjectsTest.TestPythonTupleSize (885 of 2110)
PASS: lldb-unit :: Core/./LLDBCoreTests/ModuleSpecTest.InvalidInMemoryBufferValidFile (886 of 2110)
PASS: lldb-unit :: UnwindAssembly/x86/./UnwindAssemblyx86Tests/Testx86AssemblyInspectionEngine.TestDisassemblyMidFunctionEpilogues (887 of 2110)
PASS: lldb-unit :: Expression/./ExpressionTests/DiagnosticManagerTest.GetStringNoDiags (888 of 2110)
PASS: lldb-api :: commands/watchpoints/watchpoint_set_command/TestWatchLocationWithWatchSet.py (889 of 2110)
PASS: lldb-unit :: ScriptInterpreter/Python/./ScriptInterpreterPythonTests/PythonDataObjectsTest.TestPythonFile (890 of 2110)
UNSUPPORTED: lldb-shell :: SymbolFile/DWARF/debug-types-expressions.test (891 of 2110)
PASS: lldb-shell :: ObjectFile/ELF/PT_LOAD-overlap.yaml (892 of 2110)
PASS: lldb-unit :: Utility/./UtilityTests/StringExtractorTest.DecodeHexU8_Underflow (893 of 2110)
PASS: lldb-api :: functionalities/thread/concurrent_events/TestConcurrentWatchBreak.py (894 of 2110)
PASS: lldb-unit :: Editline/./EditlineTests/EditlineTestFixture.EditlineReceivesSingleLineText (895 of 2110)
PASS: lldb-api :: commands/command/script/import/rdar-12586188/TestRdar12586188.py (896 of 2110)
PASS: lldb-unit :: Utility/./UtilityTests/SerializationRountripTest.SerializeDeserializeCStringArray (897 of 2110)
PASS: lldb-unit :: Utility/./UtilityTests/DataExtractorTest.GetCStrUnterminated (898 of 2110)
PASS: lldb-unit :: ObjectFile/Breakpad/./ObjectFileBreakpadTests/LineRecord.parse (899 of 2110)
PASS: lldb-api :: types/TestCharTypeExpr.py (900 of 2110)
PASS: lldb-unit :: Utility/./UtilityTests/DataExtractorTest.GetFloatUnaligned (901 of 2110)
PASS: lldb-unit :: Process/gdb-remote/./ProcessGdbRemoteTests/GDBRemoteCommunicationServerTest.SendErrorResponse_ErrorNumber (902 of 2110)
PASS: lldb-unit :: Interpreter/./InterpreterTests/CompletionTest.DirCompletionUsername (903 of 2110)
PASS: lldb-unit :: Process/minidump/./LLDBMinidumpTests/MinidumpParserTest.FindMemoryRangeWithFullMemoryMinidump (904 of 2110)
UNSUPPORTED: lldb-shell :: SymbolFile/PDB/vbases.test (905 of 2110)
PASS: lldb-api :: functionalities/value_md5_crash/TestValueMD5Crash.py (906 of 2110)
PASS: lldb-api :: commands/expression/persistent_types/TestNestedPersistentTypes.py (907 of 2110)
PASS: lldb-api :: python_api/formatters/TestFormattersSBAPI.py (908 of 2110)
UNSUPPORTED: lldb-shell :: SymbolFile/PDB/ast-restore.test (909 of 2110)
PASS: lldb-unit :: Utility/./UtilityTests/ArchSpecTest.MergeFrom (910 of 2110)
PASS: lldb-unit :: Utility/./UtilityTests/UriParserTest.LongPath (911 of 2110)
PASS: lldb-api :: functionalities/lazy-loading/TestLazyLoading.py (912 of 2110)
PASS: lldb-api :: commands/expression/call-function/TestCallStopAndContinue.py (913 of 2110)
PASS: lldb-api :: tools/lldb-server/TestGdbRemote_vCont.py (914 of 2110)
PASS: lldb-unit :: Utility/./UtilityTests/ScalarTest.APIntConstructor (915 of 2110)
PASS: lldb-shell :: Minidump/memory-region-from-module.yaml (916 of 2110)
PASS: lldb-unit :: Utility/./UtilityTests/LogChannelTest.Enable (917 of 2110)
PASS: lldb-api :: functionalities/testid/TestTestId.py (918 of 2110)
PASS: lldb-unit :: Symbol/./SymbolTests/PostfixExpression.ParseFPOProgram (919 of 2110)
PASS: lldb-api :: lang/cpp/symbols/TestSymbols.py (920 of 2110)
PASS: lldb-unit :: Utility/./UtilityTests/NameMatchesTest.Equals (921 of 2110)
UNSUPPORTED: lldb-shell :: Unwind/eh-frame-small-fde.test (922 of 2110)
PASS: lldb-api :: python_api/function_symbol/TestSymbolAPI.py (923 of 2110)
PASS: lldb-unit :: Utility/./UtilityTests/BinaryStreamTest.PutULEB128EightBytes (924 of 2110)
UNSUPPORTED: lldb-api :: functionalities/darwin_log/filter/exact_match/message/TestDarwinLogFilterMatchMessage.py (925 of 2110)
PASS: lldb-unit :: Utility/./UtilityTests/StreamTeeTest.SetStreamAtIndexOverwrite (926 of 2110)
PASS: lldb-api :: functionalities/breakpoint/breakpoint_conditions/TestBreakpointConditions.py (927 of 2110)
UNSUPPORTED: lldb-shell :: ScriptInterpreter/Lua/nested_sessions.test (928 of 2110)
UNSUPPORTED: lldb-shell :: SymbolFile/PDB/enums-layout.test (929 of 2110)
XFAIL: lldb-shell :: Register/x86-mm-xmm-read.test (930 of 2110)
PASS: lldb-api :: lang/objc/objc_direct-methods/TestObjCDirectMethods.py (931 of 2110)
PASS: lldb-api :: commands/register/register/register_command/TestRegisters.py (932 of 2110)
PASS: lldb-shell :: Minidump/Windows/broken-unwind.test (933 of 2110)
PASS: lldb-unit :: Language/Highlighting/./HighlighterTests/HighlighterTest.ClangTrailingBackslashWithWhitespace (934 of 2110)
PASS: lldb-api :: functionalities/thread/concurrent_events/TestConcurrentWatchpointWithDelayWatchpointThreads.py (935 of 2110)
PASS: lldb-unit :: ScriptInterpreter/Python/./ScriptInterpreterPythonTests/PythonDataObjectsTest.TestPythonStringToStructuredString (936 of 2110)
UNSUPPORTED: lldb-shell :: SymbolFile/PDB/udt-layout.test (937 of 2110)
PASS: lldb-unit :: Host/./HostTests/FileSystemTest.EnumerateDirectory (938 of 2110)
PASS: lldb-api :: functionalities/data-formatter/data-formatter-objc/TestDataFormatterObjCKVO.py (939 of 2110)
PASS: lldb-unit :: Interpreter/./InterpreterTests/CompletionTest.DirCompletionAbsolute (940 of 2110)
UNSUPPORTED: lldb-api :: linux/thread/create_during_instruction_step/TestCreateDuringInstructionStep.py (941 of 2110)
PASS: lldb-unit :: Utility/./UtilityTests/ArgsTest.TestSingleArg (942 of 2110)
PASS: lldb-shell :: ScriptInterpreter/None/none.test (943 of 2110)
PASS: lldb-api :: python_api/watchpoint/watchlocation/TestTargetWatchAddress.py (944 of 2110)
PASS: lldb-unit :: ScriptInterpreter/Python/./ScriptInterpreterPythonTests/PythonDataObjectsTest.TestPythonBoolean (945 of 2110)
PASS: lldb-api :: lang/objc/foundation/TestObjCMethodsNSArray.py (946 of 2110)
PASS: lldb-api :: commands/platform/file/read/TestPlatformFileRead.py (947 of 2110)
PASS: lldb-unit :: Utility/./UtilityTests/ArgsTest.BareSingleQuote (948 of 2110)
PASS: lldb-unit :: Utility/./UtilityTests/StringLexerTest.Next (949 of 2110)
PASS: lldb-api :: functionalities/thread/exit_during_expression/TestExitDuringExpression.py (950 of 2110)
PASS: lldb-unit :: Utility/./UtilityTests/UriParserTest.SchemeHostSeparator (951 of 2110)
UNSUPPORTED: lldb-api :: functionalities/data-formatter/data-formatter-stl/libstdcpp/list/TestDataFormatterStdList.py (952 of 2110)
PASS: lldb-api :: commands/expression/dollar-in-variable/TestDollarInVariable.py (953 of 2110)
UNSUPPORTED: lldb-shell :: Register/x86-ymm-read.test (954 of 2110)
PASS: lldb-api :: functionalities/optimized_code/TestNoASanExceptionAfterEvalOP_piece.py (955 of 2110)
UNSUPPORTED: lldb-api :: commands/gui/basicdebug/TestGuiBasicDebug.py (956 of 2110)
PASS: lldb-shell :: SymbolFile/DWARF/debug_rnglists-dwo.s (957 of 2110)
UNSUPPORTED: lldb-api :: commands/register/register/intel_xtended_registers/TestMPXRegisters.py (958 of 2110)
PASS: lldb-unit :: Utility/./UtilityTests/ArgsTest.DoubleQuotedItem (959 of 2110)
PASS: lldb-unit :: Process/gdb-remote/./ProcessGdbRemoteTests/GDBRemoteCommunicationClientTest.SendSignalsToIgnore (960 of 2110)
PASS: lldb-api :: functionalities/breakpoint/inlined_breakpoints/TestInlinedBreakpoints.py (961 of 2110)
UNSUPPORTED: lldb-api :: functionalities/thread/create_during_step/TestCreateDuringStep.py (962 of 2110)
PASS: lldb-api :: functionalities/gdb_remote_client/TestNoGPacketSupported.py (963 of 2110)
UNSUPPORTED: lldb-shell :: Register/x86-ymm-write.test (964 of 2110)
PASS: lldb-api :: functionalities/signal/handle-abrt/TestHandleAbort.py (965 of 2110)
PASS: lldb-api :: functionalities/data-formatter/nsdictionarysynth/TestNSDictionarySynthetic.py (966 of 2110)
PASS: lldb-unit :: Utility/./UtilityTests/DataExtractorTest.GetCStrAtEnd (967 of 2110)
PASS: lldb-unit :: Utility/./UtilityTests/StreamTest.PutMaxHex64ByteOrderLittle (968 of 2110)
UNSUPPORTED: lldb-shell :: ScriptInterpreter/Lua/command_script_import.test (969 of 2110)
PASS: lldb-unit :: Interpreter/./InterpreterTests/OptionValueFileColonLine.setFromString (970 of 2110)
PASS: lldb-unit :: Utility/./UtilityTests/StringExtractorTest.GetHexBytes_OddPair (971 of 2110)
PASS: lldb-unit :: Symbol/./SymbolTests/TestTypeSystemClang.TestGetBasicTypeFromName (972 of 2110)
PASS: lldb-unit :: Process/minidump/./LLDBMinidumpTests/MinidumpParserTest.FindMemoryRange (973 of 2110)
PASS: lldb-api :: commands/expression/completion-in-lambda-and-unnamed-class/TestCompletionInLambdaAndUnnamedClass.py (974 of 2110)
PASS: lldb-api :: tools/lldb-vscode/breakpoint-events/TestVSCode_breakpointEvents.py (975 of 2110)
PASS: lldb-unit :: Target/./TargetTests/ModuleCacheTest.GetAndPutUuidExists (976 of 2110)
PASS: lldb-api :: lang/cpp/constructors/TestCppConstructors.py (977 of 2110)
PASS: lldb-unit :: Expression/./ExpressionTests/ClangHostTest.MacOSX (978 of 2110)
PASS: lldb-api :: lang/cpp/call-function/TestCallCPPFunction.py (979 of 2110)
UNSUPPORTED: lldb-shell :: Register/aarch64-fp-read.test (980 of 2110)
PASS: lldb-shell :: SymbolFile/DWARF/find-method-local-struct.cpp (981 of 2110)
PASS: lldb-shell :: ObjectFile/PECOFF/dep-modules.yaml (982 of 2110)
PASS: lldb-api :: functionalities/thread/concurrent_events/TestConcurrentTwoBreakpointsOneDelaySignal.py (983 of 2110)
PASS: lldb-unit :: Host/./HostTests/FileSystemTest.Exists (984 of 2110)
PASS: lldb-api :: lang/cpp/bitfields/TestCppBitfields.py (985 of 2110)
PASS: lldb-shell :: SymbolFile/DWARF/find-inline-method.s (986 of 2110)
PASS: lldb-api :: python_api/lldbutil/TestSwigVersion.py (987 of 2110)
PASS: lldb-api :: functionalities/memory/cache/TestMemoryCache.py (988 of 2110)
PASS: lldb-unit :: Symbol/./SymbolTests/TestTypeSystemClang.TestConvertAccessTypeToAccessSpecifier (989 of 2110)
UNSUPPORTED: lldb-api :: benchmarks/expression/TestRepeatedExprs.py (990 of 2110)
PASS: lldb-api :: commands/expression/test/TestExprs.py (991 of 2110)
PASS: lldb-unit :: Utility/./UtilityTests/SubsystemRAIITest.NormalSubsystem (992 of 2110)
PASS: lldb-unit :: Host/./HostTests/FileActionTest.Open (993 of 2110)
PASS: lldb-unit :: Utility/./UtilityTests/BinaryStreamTest.PutULEB128FourBytes (994 of 2110)
PASS: lldb-unit :: UnwindAssembly/x86/./UnwindAssemblyx86Tests/Testx86AssemblyInspectionEngine.TestSimple32bitFrameFunction (995 of 2110)
UNSUPPORTED: lldb-shell :: SymbolFile/PDB/function-nested-block.test (996 of 2110)
PASS: lldb-api :: linux/builtin_trap/TestBuiltinTrap.py (997 of 2110)
PASS: lldb-unit :: Utility/./UtilityTests/Predicate.WaitForValueEqualTo (998 of 2110)
PASS: lldb-shell :: Unwind/thread-step-out-ret-addr-check.test (999 of 2110)
PASS: lldb-api :: python_api/process/io/TestProcessIO.py (1000 of 2110)
PASS: lldb-unit :: Utility/./UtilityTests/StringListTest.GetMaxStringLengthEqualSize (1001 of 2110)
PASS: lldb-api :: python_api/objc_type/TestObjCType.py (1002 of 2110)
PASS: lldb-unit :: Utility/./UtilityTests/RangeTest.ClearWithStarAddress (1003 of 2110)
PASS: lldb-api :: lang/c/offsetof/TestOffsetof.py (1004 of 2110)
PASS: lldb-api :: functionalities/thread/concurrent_events/TestConcurrentManyWatchpoints.py (1005 of 2110)
PASS: lldb-shell :: ObjectFile/wasm/stripped-debug-sections.yaml (1006 of 2110)
PASS: lldb-api :: lang/cpp/virtual-functions/TestCppVirtualFunctions.py (1007 of 2110)
UNSUPPORTED: lldb-shell :: SymbolFile/PDB/compilands.test (1008 of 2110)
PASS: lldb-shell :: ObjectFile/PECOFF/section-types.yaml (1009 of 2110)
PASS: lldb-unit :: Symbol/./SymbolTests/TestTypeSystemClang.TestRecordHasFields (1010 of 2110)
PASS: lldb-unit :: Utility/./UtilityTests/BinaryStreamTest.PutULEB128FiveBytes (1011 of 2110)
PASS: lldb-api :: functionalities/data-formatter/data-formatter-advanced/TestDataFormatterAdv.py (1012 of 2110)
PASS: lldb-api :: functionalities/inferior-crashing/TestInferiorCrashingStep.py (1013 of 2110)
PASS: lldb-unit :: Utility/./UtilityTests/StringExtractorTest.DecodeHexU8_Underflow2 (1014 of 2110)
UNSUPPORTED: lldb-shell :: Register/arm-gp-read.test (1015 of 2110)
PASS: lldb-unit :: Utility/./UtilityTests/BinaryStreamTest.PutULEB128TwoBytes (1016 of 2110)
PASS: lldb-shell :: SymbolFile/DWARF/array-sizes.s (1017 of 2110)
PASS: lldb-shell :: ObjectFile/wasm/embedded-debug-sections.yaml (1018 of 2110)
PASS: lldb-unit :: Utility/./UtilityTests/EnvironmentTest.EnvpConversion (1019 of 2110)
UNSUPPORTED: lldb-shell :: Reproducer/TestLuaImport.test (1020 of 2110)
UNSUPPORTED: lldb-api :: functionalities/darwin_log/filter/regex/activity/TestDarwinLogFilterRegexActivity.py (1021 of 2110)
PASS: lldb-api :: functionalities/breakpoint/breakpoint_command/TestRegexpBreakCommand.py (1022 of 2110)
PASS: lldb-api :: lang/cpp/global_operators/TestCppGlobalOperators.py (1023 of 2110)
PASS: lldb-api :: python_api/module_section/TestModuleAndSection.py (1024 of 2110)
PASS: lldb-unit :: Host/./HostTests/File.GetWaitableHandleFileno (1025 of 2110)
PASS: lldb-unit :: Utility/./UtilityTests/StreamTest.PutPtr (1026 of 2110)
PASS: lldb-api :: lang/objcxx/hide-runtime-values/TestObjCXXHideRuntimeValues.py (1027 of 2110)
PASS: lldb-api :: lang/c/shared_lib/TestSharedLib.py (1028 of 2110)
PASS: lldb-shell :: Settings/TestFrameFormatNoColor.test (1029 of 2110)
PASS: lldb-unit :: Process/minidump/./LLDBMinidumpTests/MinidumpParserTest.GetThreadContext_x86_32 (1030 of 2110)
PASS: lldb-shell :: ObjectFile/wasm/unified-debug-sections.yaml (1031 of 2110)
PASS: lldb-unit :: Process/gdb-remote/./ProcessGdbRemoteTests/GDBRemoteCommunicationClientTest.WriteRegister (1032 of 2110)
PASS: lldb-api :: functionalities/thread/num_threads/TestNumThreads.py (1033 of 2110)
PASS: lldb-unit :: Language/Highlighting/./HighlighterTests/HighlighterTest.ClangCursorPosEndOfLine (1034 of 2110)
PASS: lldb-unit :: Language/Highlighting/./HighlighterTests/HighlighterTest.DefaultHighlighterWithCursor (1035 of 2110)
PASS: lldb-api :: python_api/function_symbol/TestDisasmAPI.py (1036 of 2110)
PASS: lldb-unit :: Process/gdb-remote/./ProcessGdbRemoteTests/GDBRemoteClientBaseTest.SendPacketAndReceiveResponseWithOutputSupport (1037 of 2110)
PASS: lldb-unit :: Utility/./UtilityTests/Flags.AnyClear (1038 of 2110)
PASS: lldb-unit :: Utility/./UtilityTests/ArgsTest.TestOverwriteArgs (1039 of 2110)
PASS: lldb-api :: python_api/value/empty_class/TestValueAPIEmptyClass.py (1040 of 2110)
UNSUPPORTED: lldb-api :: commands/expression/macros/TestMacros.py (1041 of 2110)
PASS: lldb-unit :: Expression/./ExpressionTests/DiagnosticManagerTest.GetStringMultiline (1042 of 2110)
PASS: lldb-api :: types/TestIntegerType.py (1043 of 2110)
PASS: lldb-unit :: Expression/./ExpressionTests/DiagnosticManagerTest.AppendMessageNoDiag (1044 of 2110)
PASS: lldb-unit :: Symbol/./SymbolTests/DWARFCallFrameInfoTest.Basic_dwarf3 (1045 of 2110)
PASS: lldb-unit :: UnwindAssembly/x86/./UnwindAssemblyx86Tests/Testx86AssemblyInspectionEngine.TestPushEDI (1046 of 2110)
PASS: lldb-unit :: Utility/./UtilityTests/ConstStringTest.YAML (1047 of 2110)
PASS: lldb-unit :: Symbol/./SymbolTests/DWARFCallFrameInfoTest.Basic_dwarf4 (1048 of 2110)
PASS: lldb-unit :: Language/Highlighting/./HighlighterTests/HighlighterTest.ClangCommas (1049 of 2110)
PASS: lldb-api :: lang/cpp/this/TestCPPThis.py (1050 of 2110)
PASS: lldb-unit :: Symbol/./SymbolTests/TestTypeSystemClang.TemplateArguments (1051 of 2110)
PASS: lldb-unit :: Utility/./UtilityTests/StreamTest.AddressPrefixAndSuffix (1052 of 2110)
PASS: lldb-unit :: Utility/./UtilityTests/StringListTest.GetSize (1053 of 2110)
PASS: lldb-shell :: Driver/TestNoUseColor.test (1054 of 2110)
PASS: lldb-api :: python_api/type/TestTypeList.py (1055 of 2110)
PASS: lldb-api :: macosx/indirect_symbol/TestIndirectSymbols.py (1056 of 2110)
PASS: lldb-unit :: UnwindAssembly/x86/./UnwindAssemblyx86Tests/Testx86AssemblyInspectionEngine.TestPopR12 (1057 of 2110)
FAIL: lldb-api :: macosx/simulator/TestSimulatorPlatform.py (1058 of 2110)
******************** TEST 'lldb-api :: macosx/simulator/TestSimulatorPlatform.py' FAILED ********************
Script:
--
/Users/buildslave/jenkins/workspace/lldb-cmake-sanitized/lldb-build/lldb-test-build.noindex/copied-python /Users/buildslave/jenkins/workspace/lldb-cmake-sanitized/llvm-project/lldb/test/API/dotest.py --arch x86_64 -s /Users/buildslave/jenkins/workspace/lldb-cmake-sanitized/lldb-build/lldb-test-traces -S nm -u CXXFLAGS -u CFLAGS --codesign-identity lldb_codesign --server /Users/buildslave/jenkins/workspace/lldb-cmake-sanitized/lldb-build/./bin/debugserver --arch x86_64 --build-dir /Users/buildslave/jenkins/workspace/lldb-cmake-sanitized/lldb-build/lldb-test-build.noindex -s=/Users/buildslave/jenkins/workspace/lldb-cmake-sanitized/test/logs -t --env TERM=vt100 --env LLVM_LIBS_DIR=/Users/buildslave/jenkins/workspace/lldb-cmake-sanitized/lldb-build/./lib --inferior-env ASAN_OPTIONS=detect_stack_use_after_return=1 --inferior-env DYLD_INSERT_LIBRARIES=/Users/buildslave/jenkins/workspace/lldb-cmake-sanitized/host-compiler/lib/clang/12.0.0/lib/darwin/libclang_rt.asan_osx_dynamic.dylib --build-dir /Users/buildslave/jenkins/workspace/lldb-cmake-sanitized/lldb-build/lldb-test-build.noindex --lldb-module-cache-dir /Users/buildslave/jenkins/workspace/lldb-cmake-sanitized/lldb-build/lldb-test-build.noindex/module-cache-lldb/lldb-api --clang-module-cache-dir /Users/buildslave/jenkins/workspace/lldb-cmake-sanitized/lldb-build/lldb-test-build.noindex/module-cache-clang/lldb-api --executable /Users/buildslave/jenkins/workspace/lldb-cmake-sanitized/lldb-build/./bin/lldb --compiler /Users/buildslave/jenkins/workspace/lldb-cmake-sanitized/lldb-build/./bin/clang --dsymutil /Users/buildslave/jenkins/workspace/lldb-cmake-sanitized/lldb-build/./bin/dsymutil --filecheck /Users/buildslave/jenkins/workspace/lldb-cmake-sanitized/lldb-build/./bin/FileCheck --yaml2obj /Users/buildslave/jenkins/workspace/lldb-cmake-sanitized/lldb-build/./bin/yaml2obj --lldb-libs-dir /Users/buildslave/jenkins/workspace/lldb-cmake-sanitized/lldb-build/./lib /Users/buildslave/jenkins/workspace/lldb-cmake-sanitized/llvm-project/lldb/test/API/macosx/simulator -p TestSimulatorPlatform.py
--
Exit Code: 1

Hide Details

Command Output (stdout): -- lldb version 12.0.99 clang revision 0464acd0197cda149f81dff20bf5c379a057722a llvm revision 0464acd0197cda149f81dff20bf5c379a057722a LLDB library dir: /Users/buildslave/jenkins/workspace/lldb-cmake-sanitized/lldb-build/bin LLDB import library dir: /Users/buildslave/jenkins/workspace/lldb-cmake-sanitized/lldb-build/./lib libstdcxx tests will not be run because: Don't know how to build with libstdcxx on macosx Skipping following debug info categories: ['dwo']

Hide Details

-- Command Output (stderr): --

Hide Details

Session logs for test failures/errors/unexpected successes will go into directory '/Users/buildslave/jenkins/workspace/lldb-cmake-sanitized/test/logs' Change dir to: /Users/buildslave/jenkins/workspace/lldb-cmake-sanitized/llvm-project/lldb/test/API/macosx/simulator runCmd: settings clear -all output:

Hide Details

runCmd: settings set symbols.enable-external-lookup false output:

Hide Details

runCmd: settings set target.inherit-tcc true output:

Hide Details

runCmd: settings set target.auto-apply-fixits false output:

Hide Details

runCmd: settings set plugin.process.gdb-remote.packet-timeout 60 output:

Hide Details

runCmd: settings set symbols.clang-modules-cache-path "/Users/buildslave/jenkins/workspace/lldb-cmake-sanitized/lldb-build/lldb-test-build.noindex/module-cache-lldb/lldb-api" output:

Hide Details

runCmd: settings set use-color false output:

Hide Details

runCmd: setting set target.prefer-dynamic-value no-dynamic-values output:

Hide Details

runCmd: settings set target.env-vars ASAN_OPTIONS=detect_stack_use_after_return=1 DYLD_INSERT_LIBRARIES=/Users/buildslave/jenkins/workspace/lldb-cmake-sanitized/host-compiler/lib/clang/12.0.0/lib/darwin/libclang_rt.asan_osx_dynamic.dylib output:

Hide Details

runCmd: log enable gdb-remote packets -f /Users/buildslave/jenkins/workspace/lldb-cmake-sanitized/lldb-build/lldb-test-build.noindex/macosx/simulator/TestSimulatorPlatform.test_ios/packets.log output:

Hide Details

runCmd: settings set target.env-vars ASAN_OPTIONS=detect_stack_use_after_return=1 DYLD_INSERT_LIBRARIES=/Users/buildslave/jenkins/workspace/lldb-cmake-sanitized/host-compiler/lib/clang/12.0.0/lib/darwin/libclang_rt.asan_osx_dynamic.dylib output:

Hide Details

FAIL: LLDB (/Users/buildslave/jenkins/workspace/lldb-cmake-sanitized/lldb-build/bin/clang-x86_64) :: test_ios (TestSimulatorPlatform.TestSimulatorPlatformLaunching) <bound method SBProcess.Kill of <lldb.SBProcess; proxy of <Swig Object of type 'lldb::SBProcess *' at 0x10deb85a0> >>: success

Hide Details

runCmd: settings clear -all output:

Hide Details

runCmd: settings set symbols.enable-external-lookup false output:

Hide Details

runCmd: settings set target.inherit-tcc true output:

Hide Details

runCmd: settings set target.auto-apply-fixits false output:

Hide Details

runCmd: settings set plugin.process.gdb-remote.packet-timeout 60 output:

Hide Details

runCmd: settings set symbols.clang-modules-cache-path "/Users/buildslave/jenkins/workspace/lldb-cmake-sanitized/lldb-build/lldb-test-build.noindex/module-cache-lldb/lldb-api" output:

Hide Details

runCmd: settings set use-color false output:

Hide Details

runCmd: setting set target.prefer-dynamic-value no-dynamic-values output:

Hide Details

runCmd: settings set target.env-vars ASAN_OPTIONS=detect_stack_use_after_return=1 DYLD_INSERT_LIBRARIES=/Users/buildslave/jenkins/workspace/lldb-cmake-sanitized/host-compiler/lib/clang/12.0.0/lib/darwin/libclang_rt.asan_osx_dynamic.dylib output:

Hide Details

UNSUPPORTED: LLDB (/Users/buildslave/jenkins/workspace/lldb-cmake-sanitized/lldb-build/bin/clang-x86_64) :: test_ios_backdeploy_apple_silicon (TestSimulatorPlatform.TestSimulatorPlatformLaunching) (skipping due to the following parameter(s): architecture) runCmd: settings clear -all output:

Hide Details

runCmd: settings set symbols.enable-external-lookup false output:

Hide Details

runCmd: settings set target.inherit-tcc true output:

Hide Details

runCmd: settings set target.auto-apply-fixits false output:

Hide Details

runCmd: settings set plugin.process.gdb-remote.packet-timeout 60 output:

Hide Details

runCmd: settings set symbols.clang-modules-cache-path "/Users/buildslave/jenkins/workspace/lldb-cmake-sanitized/lldb-build/lldb-test-build.noindex/module-cache-lldb/lldb-api" output:

Hide Details

runCmd: settings set use-color false output:

Hide Details

runCmd: setting set target.prefer-dynamic-value no-dynamic-values output:

Hide Details

runCmd: settings set target.env-vars ASAN_OPTIONS=detect_stack_use_after_return=1 DYLD_INSERT_LIBRARIES=/Users/buildslave/jenkins/workspace/lldb-cmake-sanitized/host-compiler/lib/clang/12.0.0/lib/darwin/libclang_rt.asan_osx_dynamic.dylib output:

Hide Details

runCmd: log enable gdb-remote packets -f /Users/buildslave/jenkins/workspace/lldb-cmake-sanitized/lldb-build/lldb-test-build.noindex/macosx/simulator/TestSimulatorPlatform.test_ios_backdeploy_x86/packets.log output:

Hide Details

runCmd: settings set target.env-vars ASAN_OPTIONS=detect_stack_use_after_return=1 DYLD_INSERT_LIBRARIES=/Users/buildslave/jenkins/workspace/lldb-cmake-sanitized/host-compiler/lib/clang/12.0.0/lib/darwin/libclang_rt.asan_osx_dynamic.dylib output:

Hide Details

FAIL: LLDB (/Users/buildslave/jenkins/workspace/lldb-cmake-sanitized/lldb-build/bin/clang-x86_64) :: test_ios_backdeploy_x86 (TestSimulatorPlatform.TestSimulatorPlatformLaunching) <bound method SBProcess.Kill of <lldb.SBProcess; proxy of <Swig Object of type 'lldb::SBProcess *' at 0x10b17f900> >>: success

Hide Details

runCmd: settings clear -all output:

Hide Details

runCmd: settings set symbols.enable-external-lookup false output:

Hide Details

runCmd: settings set target.inherit-tcc true output:

Hide Details

runCmd: settings set target.auto-apply-fixits false output:

Hide Details

runCmd: settings set plugin.process.gdb-remote.packet-timeout 60 output:

Hide Details

runCmd: settings set symbols.clang-modules-cache-path "/Users/buildslave/jenkins/workspace/lldb-cmake-sanitized/lldb-build/lldb-test-build.noindex/module-cache-lldb/lldb-api" output:

Hide Details

runCmd: settings set use-color false output:

Hide Details

runCmd: setting set target.prefer-dynamic-value no-dynamic-values output:

Hide Details

runCmd: settings set target.env-vars ASAN_OPTIONS=detect_stack_use_after_return=1 DYLD_INSERT_LIBRARIES=/Users/buildslave/jenkins/workspace/lldb-cmake-sanitized/host-compiler/lib/clang/12.0.0/lib/darwin/libclang_rt.asan_osx_dynamic.dylib output:

Hide Details

runCmd: log enable gdb-remote packets -f /Users/buildslave/jenkins/workspace/lldb-cmake-sanitized/lldb-build/lldb-test-build.noindex/macosx/simulator/TestSimulatorPlatform.test_lc_version_min_iphoneos/packets.log output:

Hide Details

runCmd: settings set target.env-vars ASAN_OPTIONS=detect_stack_use_after_return=1 DYLD_INSERT_LIBRARIES=/Users/buildslave/jenkins/workspace/lldb-cmake-sanitized/host-compiler/lib/clang/12.0.0/lib/darwin/libclang_rt.asan_osx_dynamic.dylib output:

Hide Details

FAIL: LLDB (/Users/buildslave/jenkins/workspace/lldb-cmake-sanitized/lldb-build/bin/clang-x86_64) :: test_lc_version_min_iphoneos (TestSimulatorPlatform.TestSimulatorPlatformLaunching) <bound method SBProcess.Kill of <lldb.SBProcess; proxy of <Swig Object of type 'lldb::SBProcess *' at 0x10ac473f0> >>: success

Hide Details

runCmd: settings clear -all output:

Hide Details

runCmd: settings set symbols.enable-external-lookup false output:

Hide Details

runCmd: settings set target.inherit-tcc true output:

Hide Details

runCmd: settings set target.auto-apply-fixits false output:

Hide Details

runCmd: settings set plugin.process.gdb-remote.packet-timeout 60 output:

Hide Details

runCmd: settings set symbols.clang-modules-cache-path "/Users/buildslave/jenkins/workspace/lldb-cmake-sanitized/lldb-build/lldb-test-build.noindex/module-cache-lldb/lldb-api" output:

Hide Details

runCmd: settings set use-color false output:

Hide Details

runCmd: setting set target.prefer-dynamic-value no-dynamic-values output:

Hide Details

runCmd: settings set target.env-vars ASAN_OPTIONS=detect_stack_use_after_return=1 DYLD_INSERT_LIBRARIES=/Users/buildslave/jenkins/workspace/lldb-cmake-sanitized/host-compiler/lib/clang/12.0.0/lib/darwin/libclang_rt.asan_osx_dynamic.dylib output:

Hide Details

runCmd: log enable gdb-remote packets -f /Users/buildslave/jenkins/workspace/lldb-cmake-sanitized/lldb-build/lldb-test-build.noindex/macosx/simulator/TestSimulatorPlatform.test_lc_version_min_macosx/packets.log output:

Hide Details

runCmd: settings set target.env-vars ASAN_OPTIONS=detect_stack_use_after_return=1 DYLD_INSERT_LIBRARIES=/Users/buildslave/jenkins/workspace/lldb-cmake-sanitized/host-compiler/lib/clang/12.0.0/lib/darwin/libclang_rt.asan_osx_dynamic.dylib output:

Hide Details

runCmd: image list -b -t output: [ 0] a.out x86_64-apple-macosx10.9.0 [ 1] dyld x86_64-apple-macosx10.15.0 [ 2] libc++.1.dylib x86_64-apple-macosx10.15.0 [ 3] libSystem.B.dylib x86_64-apple-macosx10.15.0 [ 4] libc++abi.dylib x86_64-apple-macosx10.15.0 [ 5] libcache.dylib x86_64-apple-macosx10.15.0 [ 6] libcommonCrypto.dylib x86_64-apple-macosx10.15.0 [ 7] libcompiler_rt.dylib x86_64-apple-macosx10.15.0 [ 8] libcopyfile.dylib x86_64-apple-macosx10.15.0 [ 9] libcorecrypto.dylib x86_64-apple-macosx10.15.0 [ 10] libdispatch.dylib x86_64-apple-macosx10.15.0 [ 11] libdyld.dylib x86_64-apple-macosx10.15.0 [ 12] libkeymgr.dylib x86_64-apple-macosx10.15.0 [ 13] liblaunch.dylib x86_64-apple-macosx10.15.0 [ 14] libmacho.dylib x86_64-apple-macosx10.15.0 [ 15] libquarantine.dylib x86_64-apple-macosx10.15.0 [ 16] libremovefile.dylib x86_64-apple-macosx10.15.0 [ 17] libsystem_asl.dylib x86_64-apple-macosx10.15.0 [ 18] libsystem_blocks.dylib x86_64-apple-macosx10.15.0 [ 19] libsystem_c.dylib x86_64-apple-macosx10.15.0 [ 20] libsystem_configuration.dylib x86_64-apple-macosx10.15.0 [ 21] libsystem_coreservices.dylib x86_64-apple-macosx10.15.0 [ 22] libsystem_darwin.dylib x86_64-apple-macosx10.15.0 [ 23] libsystem_dnssd.dylib x86_64-apple-macosx10.15.0 [ 24] libsystem_featureflags.dylib x86_64-apple-macosx10.15.0 [ 25] libsystem_info.dylib x86_64-apple-macosx10.15.0 [ 26] libsystem_m.dylib x86_64-apple-macosx10.15.0 [ 27] libsystem_malloc.dylib x86_64-apple-macosx10.15.0 [ 28] libsystem_networkextension.dylib x86_64-apple-macosx10.15.0 [ 29] libsystem_notify.dylib x86_64-apple-macosx10.15.0 [ 30] libsystem_sandbox.dylib x86_64-apple-macosx10.15.0 [ 31] libsystem_secinit.dylib x86_64-apple-macosx10.15.0 [ 32] libsystem_kernel.dylib x86_64-apple-macosx10.15.0 [ 33] libsystem_platform.dylib x86_64-apple-macosx10.15.0 [ 34] libsystem_pthread.dylib x86_64-apple-macosx10.15.0 [ 35] libsystem_symptoms.dylib x86_64-apple-macosx10.15.0 [ 36] libsystem_trace.dylib x86_64-apple-macosx10.15.0 [ 37] libunwind.dylib x86_64-apple-macosx10.15.0 [ 38] libxpc.dylib x86_64-apple-macosx10.15.0 [ 39] libobjc.A.dylib x86_64-apple-macosx10.15.0 [ 40] libclang_rt.asan_osx_dynamic.dylib x86_64-apple-macosx10.9.0

Hide Details

Hide Details

Expecting pattern: a\.out x86_64-apple-macosx10.9.* Matched

Hide Details

FAIL: LLDB (/Users/buildslave/jenkins/workspace/lldb-cmake-sanitized/lldb-build/bin/clang-x86_64) :: test_lc_version_min_macosx (TestSimulatorPlatform.TestSimulatorPlatformLaunching) <bound method SBProcess.Kill of <lldb.SBProcess; proxy of <Swig Object of type 'lldb::SBProcess *' at 0x10b17fb40> >>: success

Hide Details

runCmd: settings clear -all output:

Hide Details

runCmd: settings set symbols.enable-external-lookup false output:

Hide Details

runCmd: settings set target.inherit-tcc true output:

Hide Details

runCmd: settings set target.auto-apply-fixits false output:

Hide Details

runCmd: settings set plugin.process.gdb-remote.packet-timeout 60 output:

Hide Details

runCmd: settings set symbols.clang-modules-cache-path "/Users/buildslave/jenkins/workspace/lldb-cmake-sanitized/lldb-build/lldb-test-build.noindex/module-cache-lldb/lldb-api" output:

Hide Details

runCmd: settings set use-color false output:

Hide Details

runCmd: setting set target.prefer-dynamic-value no-dynamic-values output:

Hide Details

runCmd: settings set target.env-vars ASAN_OPTIONS=detect_stack_use_after_return=1 DYLD_INSERT_LIBRARIES=/Users/buildslave/jenkins/workspace/lldb-cmake-sanitized/host-compiler/lib/clang/12.0.0/lib/darwin/libclang_rt.asan_osx_dynamic.dylib output:

Hide Details

runCmd: log enable gdb-remote packets -f /Users/buildslave/jenkins/workspace/lldb-cmake-sanitized/lldb-build/lldb-test-build.noindex/macosx/simulator/TestSimulatorPlatform.test_lc_version_min_tvos/packets.log output:

Hide Details

runCmd: settings set target.env-vars ASAN_OPTIONS=detect_stack_use_after_return=1 DYLD_INSERT_LIBRARIES=/Users/buildslave/jenkins/workspace/lldb-cmake-sanitized/host-compiler/lib/clang/12.0.0/lib/darwin/libclang_rt.asan_osx_dynamic.dylib output:

Hide Details

FAIL: LLDB (/Users/buildslave/jenkins/workspace/lldb-cmake-sanitized/lldb-build/bin/clang-x86_64) :: test_lc_version_min_tvos (TestSimulatorPlatform.TestSimulatorPlatformLaunching) <bound method SBProcess.Kill of <lldb.SBProcess; proxy of <Swig Object of type 'lldb::SBProcess *' at 0x10ac478d0> >>: success

Hide Details

UNSUPPORTED: LLDB (/Users/buildslave/jenkins/workspace/lldb-cmake-sanitized/lldb-build/bin/clang-x86_64) :: test_lc_version_min_watchos (TestSimulatorPlatform.TestSimulatorPlatformLaunching) (skip on macosx, darwin, ios, tvos, watchos, bridgeos) runCmd: settings clear -all output:

Hide Details

runCmd: settings set symbols.enable-external-lookup false output:

Hide Details

runCmd: settings set target.inherit-tcc true output:

Hide Details

runCmd: settings set target.auto-apply-fixits false output:

Hide Details

runCmd: settings set plugin.process.gdb-remote.packet-timeout 60 output:

Hide Details

runCmd: settings set symbols.clang-modules-cache-path "/Users/buildslave/jenkins/workspace/lldb-cmake-sanitized/lldb-build/lldb-test-build.noindex/module-cache-lldb/lldb-api" output:

Hide Details

runCmd: settings set use-color false output:

Hide Details

runCmd: setting set target.prefer-dynamic-value no-dynamic-values output:

Hide Details

runCmd: settings set target.env-vars ASAN_OPTIONS=detect_stack_use_after_return=1 DYLD_INSERT_LIBRARIES=/Users/buildslave/jenkins/workspace/lldb-cmake-sanitized/host-compiler/lib/clang/12.0.0/lib/darwin/libclang_rt.asan_osx_dynamic.dylib output:

Hide Details

runCmd: log enable gdb-remote packets -f /Users/buildslave/jenkins/workspace/lldb-cmake-sanitized/lldb-build/lldb-test-build.noindex/macosx/simulator/TestSimulatorPlatform.test_tvos/packets.log output:

Hide Details

runCmd: settings set target.env-vars ASAN_OPTIONS=detect_stack_use_after_return=1 DYLD_INSERT_LIBRARIES=/Users/buildslave/jenkins/workspace/lldb-cmake-sanitized/host-compiler/lib/clang/12.0.0/lib/darwin/libclang_rt.asan_osx_dynamic.dylib output:

Hide Details

FAIL: LLDB (/Users/buildslave/jenkins/workspace/lldb-cmake-sanitized/lldb-build/bin/clang-x86_64) :: test_tvos (TestSimulatorPlatform.TestSimulatorPlatformLaunching) <bound method SBProcess.Kill of <lldb.SBProcess; proxy of <Swig Object of type 'lldb::SBProcess *' at 0x10b17f900> >>: success

Hide Details

runCmd: settings clear -all output:

Hide Details

runCmd: settings set symbols.enable-external-lookup false output:

Hide Details

runCmd: settings set target.inherit-tcc true output:

Hide Details

runCmd: settings set target.auto-apply-fixits false output:

Hide Details

runCmd: settings set plugin.process.gdb-remote.packet-timeout 60 output:

Hide Details

runCmd: settings set symbols.clang-modules-cache-path "/Users/buildslave/jenkins/workspace/lldb-cmake-sanitized/lldb-build/lldb-test-build.noindex/module-cache-lldb/lldb-api" output:

Hide Details

runCmd: settings set use-color false output:

Hide Details

runCmd: setting set target.prefer-dynamic-value no-dynamic-values output:

Hide Details

runCmd: settings set target.env-vars ASAN_OPTIONS=detect_stack_use_after_return=1 DYLD_INSERT_LIBRARIES=/Users/buildslave/jenkins/workspace/lldb-cmake-sanitized/host-compiler/lib/clang/12.0.0/lib/darwin/libclang_rt.asan_osx_dynamic.dylib output:

Hide Details

UNSUPPORTED: LLDB (/Users/buildslave/jenkins/workspace/lldb-cmake-sanitized/lldb-build/bin/clang-x86_64) :: test_tvos_backdeploy_apple_silicon (TestSimulatorPlatform.TestSimulatorPlatformLaunching) (skipping due to the following parameter(s): architecture) UNSUPPORTED: LLDB (/Users/buildslave/jenkins/workspace/lldb-cmake-sanitized/lldb-build/bin/clang-x86_64) :: test_watchos_armv7k (TestSimulatorPlatform.TestSimulatorPlatformLaunching) (skip on macosx, darwin, ios, tvos, watchos, bridgeos) UNSUPPORTED: LLDB (/Users/buildslave/jenkins/workspace/lldb-cmake-sanitized/lldb-build/bin/clang-x86_64) :: test_watchos_backdeploy_apple_silicon (TestSimulatorPlatform.TestSimulatorPlatformLaunching) (skip on macosx, darwin, ios, tvos, watchos, bridgeos) UNSUPPORTED: LLDB (/Users/buildslave/jenkins/workspace/lldb-cmake-sanitized/lldb-build/bin/clang-x86_64) :: test_watchos_i386 (TestSimulatorPlatform.TestSimulatorPlatformLaunching) (skip on macosx, darwin, ios, tvos, watchos, bridgeos) Restore dir to: /Users/buildslave/jenkins/workspace/lldb-cmake-sanitized/lldb-build/tools/lldb/test ====================================================================== FAIL: test_ios (TestSimulatorPlatform.TestSimulatorPlatformLaunching) Test running an iOS simulator binary ---------------------------------------------------------------------- Traceback (most recent call last): File "/Users/buildslave/jenkins/workspace/lldb-cmake-sanitized/llvm-project/lldb/packages/Python/lldbsuite/test/decorators.py", line 135, in wrapper return func(*args, **kwargs) File "/Users/buildslave/jenkins/workspace/lldb-cmake-sanitized/llvm-project/lldb/packages/Python/lldbsuite/test/decorators.py", line 135, in wrapper return func(*args, **kwargs) File "/Users/buildslave/jenkins/workspace/lldb-cmake-sanitized/llvm-project/lldb/test/API/macosx/simulator/TestSimulatorPlatform.py", line 63, in test_ios expected_load_command='LC_BUILD_VERSION') File "/Users/buildslave/jenkins/workspace/lldb-cmake-sanitized/llvm-project/lldb/test/API/macosx/simulator/TestSimulatorPlatform.py", line 50, in run_with lldb.SBFileSpec("hello.c")) File "/Users/buildslave/jenkins/workspace/lldb-cmake-sanitized/llvm-project/lldb/packages/Python/lldbsuite/test/lldbutil.py", line 919, in run_to_source_breakpoint only_one_thread, extra_images) File "/Users/buildslave/jenkins/workspace/lldb-cmake-sanitized/llvm-project/lldb/packages/Python/lldbsuite/test/lldbutil.py", line 848, in run_to_breakpoint_do_run test.assertEqual(num_threads, 1, "Expected 1 thread to stop at breakpoint, %d did."%(num_threads)) AssertionError: 0 != 1 : Expected 1 thread to stop at breakpoint, 0 did. Config=x86_64-/Users/buildslave/jenkins/workspace/lldb-cmake-sanitized/lldb-build/bin/clang ====================================================================== FAIL: test_ios_backdeploy_x86 (TestSimulatorPlatform.TestSimulatorPlatformLaunching) Test running a back-deploying iOS simulator binary ---------------------------------------------------------------------- Traceback (most recent call last): File "/Users/buildslave/jenkins/workspace/lldb-cmake-sanitized/llvm-project/lldb/packages/Python/lldbsuite/test/decorators.py", line 135, in wrapper return func(*args, **kwargs) File "/Users/buildslave/jenkins/workspace/lldb-cmake-sanitized/llvm-project/lldb/packages/Python/lldbsuite/test/decorators.py", line 135, in wrapper return func(*args, **kwargs) File "/Users/buildslave/jenkins/workspace/lldb-cmake-sanitized/llvm-project/lldb/packages/Python/lldbsuite/test/decorators.py", line 135, in wrapper return func(*args, **kwargs) File "/Users/buildslave/jenkins/workspace/lldb-cmake-sanitized/llvm-project/lldb/test/API/macosx/simulator/TestSimulatorPlatform.py", line 139, in test_ios_backdeploy_x86 expected_load_command='LC_BUILD_VERSION') File "/Users/buildslave/jenkins/workspace/lldb-cmake-sanitized/llvm-project/lldb/test/API/macosx/simulator/TestSimulatorPlatform.py", line 50, in run_with lldb.SBFileSpec("hello.c")) File "/Users/buildslave/jenkins/workspace/lldb-cmake-sanitized/llvm-project/lldb/packages/Python/lldbsuite/test/lldbutil.py", line 919, in run_to_source_breakpoint only_one_thread, extra_images) File "/Users/buildslave/jenkins/workspace/lldb-cmake-sanitized/llvm-project/lldb/packages/Python/lldbsuite/test/lldbutil.py", line 848, in run_to_breakpoint_do_run test.assertEqual(num_threads, 1, "Expected 1 thread to stop at breakpoint, %d did."%(num_threads)) AssertionError: 0 != 1 : Expected 1 thread to stop at breakpoint, 0 did. Config=x86_64-/Users/buildslave/jenkins/workspace/lldb-cmake-sanitized/lldb-build/bin/clang ====================================================================== FAIL: test_lc_version_min_iphoneos (TestSimulatorPlatform.TestSimulatorPlatformLaunching) Test running a back-deploying iOS simulator binary ---------------------------------------------------------------------- Traceback (most recent call last): File "/Users/buildslave/jenkins/workspace/lldb-cmake-sanitized/llvm-project/lldb/packages/Python/lldbsuite/test/decorators.py", line 135, in wrapper return func(*args, **kwargs) File "/Users/buildslave/jenkins/workspace/lldb-cmake-sanitized/llvm-project/lldb/packages/Python/lldbsuite/test/decorators.py", line 135, in wrapper return func(*args, **kwargs) File "/Users/buildslave/jenkins/workspace/lldb-cmake-sanitized/llvm-project/lldb/packages/Python/lldbsuite/test/decorators.py", line 135, in wrapper return func(*args, **kwargs) File "/Users/buildslave/jenkins/workspace/lldb-cmake-sanitized/llvm-project/lldb/test/API/macosx/simulator/TestSimulatorPlatform.py", line 127, in test_lc_version_min_iphoneos expected_load_command='LC_VERSION_MIN_IPHONEOS') File "/Users/buildslave/jenkins/workspace/lldb-cmake-sanitized/llvm-project/lldb/test/API/macosx/simulator/TestSimulatorPlatform.py", line 50, in run_with lldb.SBFileSpec("hello.c")) File "/Users/buildslave/jenkins/workspace/lldb-cmake-sanitized/llvm-project/lldb/packages/Python/lldbsuite/test/lldbutil.py", line 919, in run_to_source_breakpoint only_one_thread, extra_images) File "/Users/buildslave/jenkins/workspace/lldb-cmake-sanitized/llvm-project/lldb/packages/Python/lldbsuite/test/lldbutil.py", line 848, in run_to_breakpoint_do_run test.assertEqual(num_threads, 1, "Expected 1 thread to stop at breakpoint, %d did."%(num_threads)) AssertionError: 0 != 1 : Expected 1 thread to stop at breakpoint, 0 did. Config=x86_64-/Users/buildslave/jenkins/workspace/lldb-cmake-sanitized/lldb-build/bin/clang ====================================================================== FAIL: test_lc_version_min_macosx (TestSimulatorPlatform.TestSimulatorPlatformLaunching) Test running a back-deploying non-simulator MacOS X binary ---------------------------------------------------------------------- Traceback (most recent call last): File "/Users/buildslave/jenkins/workspace/lldb-cmake-sanitized/llvm-project/lldb/packages/Python/lldbsuite/test/decorators.py", line 135, in wrapper return func(*args, **kwargs) File "/Users/buildslave/jenkins/workspace/lldb-cmake-sanitized/llvm-project/lldb/test/API/macosx/simulator/TestSimulatorPlatform.py", line 116, in test_lc_version_min_macosx expected_load_command='LC_VERSION_MIN_MACOSX') File "/Users/buildslave/jenkins/workspace/lldb-cmake-sanitized/llvm-project/lldb/test/API/macosx/simulator/TestSimulatorPlatform.py", line 53, in run_with self.check_debugserver(log, os+env, vers) File "/Users/buildslave/jenkins/workspace/lldb-cmake-sanitized/llvm-project/lldb/test/API/macosx/simulator/TestSimulatorPlatform.py", line 36, in check_debugserver self.assertTrue(aout_info) AssertionError: None is not True Config=x86_64-/Users/buildslave/jenkins/workspace/lldb-cmake-sanitized/lldb-build/bin/clang ====================================================================== FAIL: test_lc_version_min_tvos (TestSimulatorPlatform.TestSimulatorPlatformLaunching) Test running a back-deploying tvOS simulator binary ---------------------------------------------------------------------- Traceback (most recent call last): File "/Users/buildslave/jenkins/workspace/lldb-cmake-sanitized/llvm-project/lldb/packages/Python/lldbsuite/test/decorators.py", line 135, in wrapper return func(*args, **kwargs) File "/Users/buildslave/jenkins/workspace/lldb-cmake-sanitized/llvm-project/lldb/packages/Python/lldbsuite/test/decorators.py", line 135, in wrapper return func(*args, **kwargs) File "/Users/buildslave/jenkins/workspace/lldb-cmake-sanitized/llvm-project/lldb/packages/Python/lldbsuite/test/decorators.py", line 135, in wrapper return func(*args, **kwargs) File "/Users/buildslave/jenkins/workspace/lldb-cmake-sanitized/llvm-project/lldb/test/API/macosx/simulator/TestSimulatorPlatform.py", line 162, in test_lc_version_min_tvos expected_load_command='LC_VERSION_MIN_TVOS') File "/Users/buildslave/jenkins/workspace/lldb-cmake-sanitized/llvm-project/lldb/test/API/macosx/simulator/TestSimulatorPlatform.py", line 50, in run_with lldb.SBFileSpec("hello.c")) File "/Users/buildslave/jenkins/workspace/lldb-cmake-sanitized/llvm-project/lldb/packages/Python/lldbsuite/test/lldbutil.py", line 919, in run_to_source_breakpoint only_one_thread, extra_images) File "/Users/buildslave/jenkins/workspace/lldb-cmake-sanitized/llvm-project/lldb/packages/Python/lldbsuite/test/lldbutil.py", line 848, in run_to_breakpoint_do_run test.assertEqual(num_threads, 1, "Expected 1 thread to stop at breakpoint, %d did."%(num_threads)) AssertionError: 0 != 1 : Expected 1 thread to stop at breakpoint, 0 did. Config=x86_64-/Users/buildslave/jenkins/workspace/lldb-cmake-sanitized/lldb-build/bin/clang ====================================================================== FAIL: test_tvos (TestSimulatorPlatform.TestSimulatorPlatformLaunching) Test running an tvOS simulator binary ---------------------------------------------------------------------- Traceback (most recent call last): File "/Users/buildslave/jenkins/workspace/lldb-cmake-sanitized/llvm-project/lldb/packages/Python/lldbsuite/test/decorators.py", line 135, in wrapper return func(*args, **kwargs) File "/Users/buildslave/jenkins/workspace/lldb-cmake-sanitized/llvm-project/lldb/packages/Python/lldbsuite/test/decorators.py", line 135, in wrapper return func(*args, **kwargs) File "/Users/buildslave/jenkins/workspace/lldb-cmake-sanitized/llvm-project/lldb/test/API/macosx/simulator/TestSimulatorPlatform.py", line 73, in test_tvos expected_load_command='LC_BUILD_VERSION') File "/Users/buildslave/jenkins/workspace/lldb-cmake-sanitized/llvm-project/lldb/test/API/macosx/simulator/TestSimulatorPlatform.py", line 50, in run_with lldb.SBFileSpec("hello.c")) File "/Users/buildslave/jenkins/workspace/lldb-cmake-sanitized/llvm-project/lldb/packages/Python/lldbsuite/test/lldbutil.py", line 919, in run_to_source_breakpoint only_one_thread, extra_images) File "/Users/buildslave/jenkins/workspace/lldb-cmake-sanitized/llvm-project/lldb/packages/Python/lldbsuite/test/lldbutil.py", line 848, in run_to_breakpoint_do_run test.assertEqual(num_threads, 1, "Expected 1 thread to stop at breakpoint, %d did."%(num_threads)) AssertionError: 0 != 1 : Expected 1 thread to stop at breakpoint, 0 did. Config=x86_64-/Users/buildslave/jenkins/workspace/lldb-cmake-sanitized/lldb-build/bin/clang ---------------------------------------------------------------------- Ran 12 tests in 48.400s

Hide Details

RESULT: FAILED (0 passes, 6 failures, 0 errors, 6 skipped, 0 expected failures, 0 unexpected successes)

Hide Details

--

Hide Details

******************** PASS: lldb-api :: source-manager/TestSourceManager.py (1059 of 2110) PASS: lldb-unit :: Utility/./UtilityTests/StringExtractorTest.GetNameColonValueNoColon (1060 of 2110) PASS: lldb-unit :: Utility/./UtilityTests/BinaryStreamTest.PutSLEB128ThreeBytes (1061 of 2110) PASS: lldb-unit :: Utility/./UtilityTests/RangeTest.ContainsEndInclusiveInvalid (1062 of 2110) PASS: lldb-unit :: Host/./HostTests/NativeProcessProtocolTest.SetBreakpoint (1063 of 2110) PASS: lldb-unit :: Utility/./UtilityTests/Flags.AllClear (1064 of 2110) PASS: lldb-unit :: Utility/./UtilityTests/VMRange.Clear (1065 of 2110) PASS: lldb-unit :: UnwindAssembly/x86/./UnwindAssemblyx86Tests/Testx86AssemblyInspectionEngine.TestSpillRegToStackViaMOVx86_64 (1066 of 2110) PASS: lldb-api :: functionalities/breakpoint/cpp/TestCPPBreakpointLocations.py (1067 of 2110) PASS: lldb-shell :: ObjectFile/ELF/duplicate-section.yaml (1068 of 2110) PASS: lldb-unit :: Utility/./UtilityTests/StreamTest.PutHex16ByteOrderBig (1069 of 2110) PASS: lldb-unit :: Utility/./UtilityTests/OptionsWithRawTest.WhitespaceInput (1070 of 2110) PASS: lldb-shell :: SymbolFile/Breakpad/line-table-edgecases.test (1071 of 2110) PASS: lldb-api :: functionalities/reproducers/attach/TestReproducerAttach.py (1072 of 2110) PASS: lldb-unit :: Utility/./UtilityTests/RegularExpression.CopyAssignment (1073 of 2110) PASS: lldb-unit :: Utility/./UtilityTests/ArgsTest.TestQuotedUnknownEscape (1074 of 2110) PASS: lldb-unit :: Host/./HostTests/NativeProcessProtocolTest.ReadCStringFromMemory (1075 of 2110) PASS: lldb-shell :: SymbolFile/NativePDB/function-types-classes.cpp (1076 of 2110) UNSUPPORTED: lldb-api :: lang/objc/objc-dynamic-value/TestObjCDynamicValue.py (1077 of 2110) PASS: lldb-api :: commands/expression/result_numbering/TestResultNumbering.py (1078 of 2110) PASS: lldb-api :: lang/objcxx/class-name-clash/TestNameClash.py (1079 of 2110) PASS: lldb-api :: lang/objc/objc-ivar-offsets/TestObjCIvarOffsets.py (1080 of 2110) PASS: lldb-unit :: Symbol/./SymbolTests/TestTypeSystemClang.TestGetEnumIntegerTypeUnexpectedType (1081 of 2110) PASS: lldb-unit :: Process/./ProcessEventDataTests/ProcessEventDataTest.DoOnRemoval (1082 of 2110) PASS: lldb-api :: lang/objc/rdar-10967107/TestRdar10967107.py (1083 of 2110) PASS: lldb-api :: commands/frame/diagnose/dereference-this/TestDiagnoseDereferenceThis.py (1084 of 2110) PASS: lldb-shell :: ObjectFile/MachO/lc_version_min.yaml (1085 of 2110) PASS: lldb-shell :: Driver/TestHelp.test (1086 of 2110) PASS: lldb-unit :: Expression/./ExpressionTests/CppModuleConfigurationTest.MissingUsrInclude (1087 of 2110) PASS: lldb-api :: python_api/sbvalue_persist/TestSBValuePersist.py (1088 of 2110) PASS: lldb-shell :: Minidump/Windows/find-module.test (1089 of 2110) PASS: lldb-unit :: UnwindAssembly/x86/./UnwindAssemblyx86Tests/Testx86AssemblyInspectionEngine.Test64bitFramelessBigStackFrame (1090 of 2110) PASS: lldb-api :: lang/c/find_struct_type/TestFindStructTypes.py (1091 of 2110) PASS: lldb-unit :: Utility/./UtilityTests/StringExtractorTest.GetHexBytes_OddPair2 (1092 of 2110) PASS: lldb-api :: macosx/version_zero/TestGetVersionZeroVersion.py (1093 of 2110) PASS: lldb-api :: functionalities/data-formatter/data-formatter-stl/libcxx/multiset/TestDataFormatterLibcxxMultiSet.py (1094 of 2110) PASS: lldb-unit :: Utility/./UtilityTests/StringExtractorTest.GetHexBytesAvail_OddPair2 (1095 of 2110) PASS: lldb-api :: functionalities/memory-region/TestMemoryRegion.py (1096 of 2110) PASS: lldb-unit :: debugserver/./debugserverTests/RNBSocket.LoopBackListenIPv6 (1097 of 2110) PASS: lldb-unit :: Utility/./UtilityTests/StringExtractorTest.GetHexU8_Underflow_NoEof (1098 of 2110) PASS: lldb-unit :: ObjectFile/Breakpad/./ObjectFileBreakpadTests/ModuleRecord.parse (1099 of 2110) UNSUPPORTED: lldb-api :: functionalities/darwin_log/format/TestDarwinLogMessageFormat.py (1100 of 2110) PASS: lldb-shell :: SymbolFile/Breakpad/symtab.test (1101 of 2110) PASS: lldb-unit :: Utility/./UtilityTests/ListenerTest.GetEventImmediate (1102 of 2110) PASS: lldb-unit :: Utility/./UtilityTests/StreamTest.PutHex32ByteOrderLittle (1103 of 2110) PASS: lldb-shell :: SymbolFile/DWARF/split-dwarf-inlining.cpp (1104 of 2110) PASS: lldb-unit :: Process/minidump/./LLDBMinidumpTests/MinidumpParserTest.GetMemoryRegionInfoFromMemoryList (1105 of 2110) PASS: lldb-unit :: Utility/./UtilityTests/DataExtractorTest.GetSLEB128_bit63 (1106 of 2110) PASS: lldb-unit :: Symbol/./SymbolTests/TestClangASTImporter.MetadataPropagation (1107 of 2110) PASS: lldb-unit :: Symbol/./SymbolTests/Type.CompilerContextPattern (1108 of 2110) PASS: lldb-api :: functionalities/gdb_remote_client/TestGDBRemoteLoad.py (1109 of 2110) PASS: lldb-unit :: Utility/./UtilityTests/ArchSpecTest.YAML (1110 of 2110) PASS: lldb-unit :: UnwindAssembly/x86/./UnwindAssemblyx86Tests/Testx86AssemblyInspectionEngine.TestSimple64bitFrameFunction (1111 of 2110) PASS: lldb-shell :: SymbolFile/DWARF/debug_loc-aslr.s (1112 of 2110) PASS: lldb-unit :: Utility/./UtilityTests/StreamTest.PutNHex8 (1113 of 2110) UNSUPPORTED: lldb-api :: functionalities/breakpoint/hardware_breakpoints/hardware_breakpoint_on_multiple_threads/TestHWBreakMultiThread.py (1114 of 2110) PASS: lldb-unit :: Language/Highlighting/./HighlighterTests/HighlighterTest.ClangEmptyInput (1115 of 2110) PASS: lldb-unit :: Symbol/./SymbolTests/TestTypeSystemClang.TestRemoveFastQualifiers (1116 of 2110) PASS: lldb-unit :: Utility/./UtilityTests/BroadcasterTest.EventTypeHasListeners (1117 of 2110) PASS: lldb-unit :: Utility/./UtilityTests/OptionsWithRawTest.UnterminatedQuote (1118 of 2110) PASS: lldb-api :: functionalities/data-formatter/parray/TestPrintArray.py (1119 of 2110) PASS: lldb-api :: lang/objc/rdar-11355592/TestRdar11355592.py (1120 of 2110) PASS: lldb-unit :: Utility/./UtilityTests/StreamTeeTest.SetStreamAtIndexOutOfBounds (1121 of 2110) PASS: lldb-unit :: Utility/./UtilityTests/ProcessInstanceInfoMatch.Name (1122 of 2110) PASS: lldb-unit :: Utility/./UtilityTests/StringExtractorTest.DecodeHexU8_Exact (1123 of 2110) UNSUPPORTED: lldb-api :: arm/breakpoint-it/TestBreakpointIt.py (1124 of 2110) PASS: lldb-unit :: Utility/./UtilityTests/StreamTest.ChangingByteOrder (1125 of 2110) PASS: lldb-api :: types/TestShortTypeExpr.py (1126 of 2110) PASS: lldb-shell :: SymbolFile/DWARF/debug-types-signature-loop.s (1127 of 2110) PASS: lldb-api :: lang/objc/objc-dyn-sbtype/TestObjCDynamicSBType.py (1128 of 2110) PASS: lldb-unit :: Symbol/./SymbolTests/TestTypeSystemClang.TestOwningModule (1129 of 2110) PASS: lldb-api :: functionalities/fat_archives/TestFatArchives.py (1130 of 2110) PASS: lldb-unit :: SymbolFile/NativePDB/./SymbolFileNativePDBTests/PDBFPOProgramToDWARFExpressionTests.DependencyChain (1131 of 2110) PASS: lldb-shell :: ObjectFile/PECOFF/basic-info-arm.yaml (1132 of 2110) PASS: lldb-unit :: Utility/./UtilityTests/StreamTest.AddressRangeSize (1133 of 2110) PASS: lldb-api :: functionalities/jitloader_gdb/TestJITLoaderGDB.py (1134 of 2110) PASS: lldb-shell :: SymbolFile/DWARF/dir-separator-no-comp-dir-relative-name.s (1135 of 2110) PASS: lldb-unit :: Utility/./UtilityTests/ProcessInstanceInfo.Yaml (1136 of 2110) PASS: lldb-unit :: Utility/./UtilityTests/XcodeSDKTest.MergeTest (1137 of 2110) PASS: lldb-api :: functionalities/thread/concurrent_events/TestConcurrentCrashWithBreak.py (1138 of 2110) PASS: lldb-shell :: Quit/TestQuitExitCodeNonInt.test (1139 of 2110) PASS: lldb-unit :: Process/gdb-remote/./ProcessGdbRemoteTests/GDBRemoteClientBaseTest.SendContinueAndInterrupt (1140 of 2110) UNSUPPORTED: lldb-api :: macosx/macCatalystAppMacOSFramework/TestMacCatalystAppWithMacOSFramework.py (1141 of 2110) PASS: lldb-unit :: Utility/./UtilityTests/XcodeSDKTest.GetSDKTypeForTriple (1142 of 2110) PASS: lldb-unit :: Utility/./UtilityTests/FileSpecTest.OperatorBool (1143 of 2110) PASS: lldb-unit :: Platform/./LLDBPlatformTests/PlatformAppleSimulatorTest.TestHostPlatformToSim (1144 of 2110) PASS: lldb-unit :: Utility/./UtilityTests/CompletionRequest.DuplicateFiltering (1145 of 2110) PASS: lldb-unit :: Utility/./UtilityTests/StringListTest.ShiftCString (1146 of 2110) UNSUPPORTED: lldb-shell :: Unwind/eh-frame-augment-noop.test (1147 of 2110) PASS: lldb-unit :: Utility/./UtilityTests/ArgsTest.EscapeLLDBCommandArgument (1148 of 2110) PASS: lldb-api :: commands/command/script_alias/TestCommandScriptAlias.py (1149 of 2110) UNSUPPORTED: lldb-api :: functionalities/tsan/basic/TestTsanBasic.py (1150 of 2110) PASS: lldb-api :: lang/objcxx/cxx-bridged-po/TestObjCXXBridgedPO.py (1151 of 2110) PASS: lldb-unit :: Core/./LLDBCoreTests/MangledTest.ResultForValidName (1152 of 2110) PASS: lldb-api :: functionalities/data-formatter/data-formatter-objc/cmtime/TestDataFormatterCMTime.py (1153 of 2110) PASS: lldb-api :: functionalities/breakpoint/breakpoint_command/TestBreakpointCommandsFromPython.py (1154 of 2110) PASS: lldb-shell :: SymbolFile/DWARF/find-variable-file.cpp (1155 of 2110) PASS: lldb-api :: functionalities/data-formatter/frameformat_smallstruct/TestFrameFormatSmallStruct.py (1156 of 2110) PASS: lldb-api :: functionalities/thread/jump/TestThreadJump.py (1157 of 2110) PASS: lldb-unit :: Utility/./UtilityTests/ArchSpecTest.TestParseMachCPUDashSubtypeTripleSimple (1158 of 2110) PASS: lldb-shell :: Reproducer/TestDump.test (1159 of 2110) PASS: lldb-api :: macosx/nslog/TestDarwinNSLogOutput.py (1160 of 2110) PASS: lldb-api :: lang/c/step_over_no_deadlock/TestStepOverDoesntBlock.py (1161 of 2110) PASS: lldb-api :: lang/objc/objc-struct-return/TestObjCStructReturn.py (1162 of 2110) PASS: lldb-api :: lang/objc/radar-9691614/TestObjCMethodReturningBOOL.py (1163 of 2110) PASS: lldb-unit :: debugserver/./debugserverTests/RNBSocket.AnyListen (1164 of 2110) PASS: lldb-api :: lang/cpp/breakpoint_in_member_func_w_non_primitive_params/TestBreakpointInMemberFuncWNonPrimitiveParams.py (1165 of 2110) PASS: lldb-unit :: Utility/./UtilityTests/StringListTest.LongestCommonPrefixSingleElement (1166 of 2110) PASS: lldb-unit :: ScriptInterpreter/Python/./ScriptInterpreterPythonTests/PythonDataObjectsTest.TestModuleNameResolutionNoDot (1167 of 2110) XFAIL: lldb-shell :: Register/x86-mm-xmm-write.test (1168 of 2110) UNSUPPORTED: lldb-api :: functionalities/ubsan/basic/TestUbsanBasic.py (1169 of 2110) PASS: lldb-api :: lang/c/vla/TestVLA.py (1170 of 2110) PASS: lldb-unit :: Utility/./UtilityTests/DataExtractorTest.GetMaxU64 (1171 of 2110) PASS: lldb-unit :: Utility/./UtilityTests/StringListTest.AppendStringCString (1172 of 2110) PASS: lldb-unit :: Utility/./UtilityTests/ArgsTest.StringListConstructor (1173 of 2110) PASS: lldb-shell :: ObjectFile/MachO/lc_build_version.yaml (1174 of 2110) PASS: lldb-unit :: Utility/./UtilityTests/StreamTest.AddressPrefix (1175 of 2110) PASS: lldb-api :: commands/expression/rdar42038760/TestScalarURem.py (1176 of 2110) PASS: lldb-unit :: Utility/./UtilityTests/BroadcasterTest.BroadcastEvent (1177 of 2110) PASS: lldb-api :: commands/settings/quoting/TestQuoting.py (1178 of 2110) PASS: lldb-shell :: Register/x86-64-read.test (1179 of 2110) PASS: lldb-unit :: Utility/./UtilityTests/StreamTeeTest.DefaultConstructor (1180 of 2110) PASS: lldb-unit :: Process/minidump/./LLDBMinidumpTests/MinidumpParserTest.GetThreadContext_x86_32_wow64 (1181 of 2110) PASS: lldb-shell :: SymbolFile/NativePDB/break-by-line.cpp (1182 of 2110) PASS: lldb-shell :: Host/TestCustomShell.test (1183 of 2110) UNSUPPORTED: lldb-shell :: SymbolFile/PDB/variables.test (1184 of 2110) PASS: lldb-api :: commands/expression/import_builtin_fileid/TestImportBuiltinFileID.py (1185 of 2110) PASS: lldb-unit :: tools/lldb-server/tests/./LLDBServerTests/TestBase.LaunchModePreservesEnvironment (1186 of 2110) PASS: lldb-unit :: Utility/./UtilityTests/BinaryStreamTest.PutULEB128MaxValue (1187 of 2110) PASS: lldb-unit :: Utility/./UtilityTests/CompletionRequest.TryCompleteCurrentArgBad (1188 of 2110) UNSUPPORTED: lldb-api :: commands/expression/call-restarts/TestCallThatRestarts.py (1189 of 2110) PASS: lldb-unit :: Utility/./UtilityTests/RangeTest.EqualInvalid (1190 of 2110) PASS: lldb-api :: types/TestRecursiveTypes.py (1191 of 2110) PASS: lldb-unit :: SymbolFile/NativePDB/./SymbolFileNativePDBTests/PDBFPOProgramToDWARFExpressionTests.MultipleIndependentAssignments (1192 of 2110) PASS: lldb-shell :: ObjectFile/wasm/basic.yaml (1193 of 2110) PASS: lldb-api :: lang/objc/modules-compile-error/TestModulesCompileError.py (1194 of 2110) PASS: lldb-api :: lang/objc/modules-app-update/TestClangModulesAppUpdate.py (1195 of 2110) UNSUPPORTED: lldb-api :: commands/gui/basic/TestGuiBasic.py (1196 of 2110) PASS: lldb-api :: functionalities/data-formatter/setvaluefromcstring/TestSetValueFromCString.py (1197 of 2110) UNSUPPORTED: lldb-shell :: SymbolFile/NativePDB/typedefs.cpp (1198 of 2110) PASS: lldb-api :: lang/c/inlines/TestRedefinitionsInInlines.py (1199 of 2110) PASS: lldb-unit :: Utility/./UtilityTests/StreamTest.PutBytesAsRawHex8ToLittleEndian (1200 of 2110) PASS: lldb-unit :: Utility/./UtilityTests/StringListTest.ShiftMove (1201 of 2110) PASS: lldb-api :: lang/objc/objc-super/TestObjCSuper.py (1202 of 2110) PASS: lldb-unit :: Host/./HostTests/MainLoopTest.ReadObject (1203 of 2110) PASS: lldb-api :: lang/cpp/wchar_t/TestCxxWCharT.py (1204 of 2110) PASS: lldb-api :: functionalities/gdb_remote_client/TestProcessConnect.py (1205 of 2110) PASS: lldb-unit :: Core/./LLDBCoreTests/UniqueCStringMap.NoDefaultConstructor (1206 of 2110) PASS: lldb-api :: lang/objc/modules-inline-functions/TestModulesInlineFunctions.py (1207 of 2110) PASS: lldb-api :: python_api/name_lookup/TestNameLookup.py (1208 of 2110) PASS: lldb-unit :: Utility/./UtilityTests/UriParserTest.BadPort (1209 of 2110) PASS: lldb-shell :: Commands/command-script-import.test (1210 of 2110) PASS: lldb-unit :: Symbol/./SymbolTests/SymbolsTest.LocateExecutableSymbolFileForUnknownExecutableAndMissingSymbolFile (1211 of 2110) PASS: lldb-unit :: Language/CPlusPlus/./LanguageCPlusPlusTests/CPlusPlusLanguage.MethodNameParsing (1212 of 2110) PASS: lldb-unit :: Utility/./UtilityTests/StringListTest.CopyList (1213 of 2110) PASS: lldb-api :: functionalities/data-formatter/data-formatter-categories/TestDataFormatterCategories.py (1214 of 2110) PASS: lldb-unit :: UnwindAssembly/x86/./UnwindAssemblyx86Tests/Testx86AssemblyInspectionEngine.TestPushImm (1215 of 2110) PASS: lldb-api :: lang/cpp/llvm-style/TestLLVMStyle.py (1216 of 2110) PASS: lldb-unit :: Utility/./UtilityTests/StreamTeeTest.Constructor2Streams (1217 of 2110) UNSUPPORTED: lldb-api :: functionalities/tsan/thread_leak/TestTsanThreadLeak.py (1218 of 2110) PASS: lldb-unit :: Utility/./UtilityTests/LogChannelTest.List (1219 of 2110) PASS: lldb-api :: sample_test/TestSampleInlineTest.py (1220 of 2110) PASS: lldb-api :: functionalities/inferior-assert/TestInferiorAssert.py (1221 of 2110) PASS: lldb-shell :: Breakpoint/single-file-split-dwarf.test (1222 of 2110) UNSUPPORTED: lldb-api :: functionalities/data-formatter/data-formatter-stl/libstdcpp/string/TestDataFormatterStdString.py (1223 of 2110) PASS: lldb-shell :: SymbolFile/DWARF/limit-debug-info.s (1224 of 2110) PASS: lldb-unit :: Expression/./ExpressionTests/CppModuleConfigurationTest.Xcode (1225 of 2110) PASS: lldb-shell :: SymbolFile/NativePDB/bitfields.cpp (1226 of 2110) UNSUPPORTED: lldb-api :: python_api/disassemble-raw-data/TestDisassemble_VST1_64.py (1227 of 2110) PASS: lldb-unit :: Language/CPlusPlus/./LanguageCPlusPlusTests/CPlusPlusLanguage.FindAlternateFunctionManglings (1228 of 2110) PASS: lldb-api :: python_api/hello_world/TestHelloWorld.py (1229 of 2110) PASS: lldb-shell :: Reproducer/TestCaptureEnvOverride.test (1230 of 2110) PASS: lldb-api :: lang/cpp/namespace_conflicts/TestNamespaceConflicts.py (1231 of 2110) PASS: lldb-unit :: Utility/./UtilityTests/ArgsTest.GetQuotedCommandString (1232 of 2110) PASS: lldb-unit :: Host/./HostTests/MainLoopTest.DetectsEOF (1233 of 2110) PASS: lldb-shell :: SymbolFile/NativePDB/ast-methods.cpp (1234 of 2110) PASS: lldb-api :: commands/settings/TestSettings.py (1235 of 2110) PASS: lldb-shell :: ObjectFile/PECOFF/export-dllfunc.yaml (1236 of 2110) PASS: lldb-unit :: Utility/./UtilityTests/StringListTest.JoinThree (1237 of 2110) PASS: lldb-unit :: Utility/./UtilityTests/StreamTest.PutRawBytesToMixedEndian (1238 of 2110) PASS: lldb-unit :: Target/./TargetTests/ExecutionContextTest.GetByteOrder (1239 of 2110) PASS: lldb-unit :: Utility/./UtilityTests/OptionsWithRawTest.SingleWhitespaceInput (1240 of 2110) PASS: lldb-api :: functionalities/thread/crash_during_step/TestCrashDuringStep.py (1241 of 2110) PASS: lldb-unit :: Utility/./UtilityTests/IndexToObjectTest.ObjectForIndex (1242 of 2110) PASS: lldb-unit :: Utility/./UtilityTests/BinaryStreamTest.PutULEB128SevenBytes (1243 of 2110) PASS: lldb-api :: commands/expression/ir-interpreter-phi-nodes/TestIRInterpreterPHINodes.py (1244 of 2110) PASS: lldb-unit :: Utility/./UtilityTests/StreamTest.PutHex64ByteOrderLittle (1245 of 2110) PASS: lldb-shell :: ObjectFile/ELF/short-build-id.yaml (1246 of 2110) PASS: lldb-api :: functionalities/thread/concurrent_events/TestConcurrentTwoBreakpointsOneWatchpoint.py (1247 of 2110) PASS: lldb-unit :: Core/./LLDBCoreTests/RichManglingContextTest.IPDRealloc (1248 of 2110) PASS: lldb-unit :: Language/Highlighting/./HighlighterTests/HighlighterTest.ClangTrailingBackslashBeforeNewline (1249 of 2110) PASS: lldb-api :: commands/expression/import-std-module/forward_list/TestForwardListFromStdModule.py (1250 of 2110) UNSUPPORTED: lldb-shell :: Register/x86-gp-read.test (1251 of 2110) PASS: lldb-unit :: Utility/./UtilityTests/CompletionRequest.FakeLastArg (1252 of 2110) UNSUPPORTED: lldb-shell :: Register/x86-64-ymm16-read.test (1253 of 2110) PASS: lldb-api :: lang/cpp/thread_local/TestThreadLocal.py (1254 of 2110) PASS: lldb-unit :: Host/./HostTests/NativeProcessProtocolTest.SetBreakpointFailWrite (1255 of 2110) PASS: lldb-unit :: Interpreter/./InterpreterTests/OptionArgParserTest.toBoolean (1256 of 2110) PASS: lldb-unit :: Utility/./UtilityTests/StreamTeeTest.GetStreamAtIndexOutOfBounds (1257 of 2110) PASS: lldb-unit :: Utility/./UtilityTests/StringListTest.LongestCommonPrefixDuplicateElement (1258 of 2110) PASS: lldb-api :: commands/frame/diagnose/array/TestArray.py (1259 of 2110) UNSUPPORTED: lldb-shell :: Register/x86-64-zmm-read.test (1260 of 2110) PASS: lldb-unit :: Host/./HostTests/FileSystemTest.FileAndDirectoryComponents (1261 of 2110) PASS: lldb-shell :: SymbolFile/DWARF/dwp.s (1262 of 2110) PASS: lldb-unit :: Utility/./UtilityTests/BinaryStreamTest.PutSLEB128Zero (1263 of 2110) PASS: lldb-api :: lang/cpp/const_this/TestConstThis.py (1264 of 2110) PASS: lldb-unit :: ScriptInterpreter/Python/./ScriptInterpreterPythonTests/PythonDataObjectsTest.TestPythonCallableInvoke (1265 of 2110) PASS: lldb-api :: commands/expression/import-std-module/weak_ptr-dbg-info-content/TestDbgInfoContentWeakPtrFromStdModule.py (1266 of 2110) PASS: lldb-api :: functionalities/data-formatter/data-formatter-synthtype/TestDataFormatterSynthType.py (1267 of 2110) PASS: lldb-api :: commands/platform/basic/TestPlatformPython.py (1268 of 2110) PASS: lldb-unit :: Utility/./UtilityTests/RangeTest.Equal (1269 of 2110) PASS: lldb-unit :: Utility/./UtilityTests/ScalarTest.Getters (1270 of 2110) PASS: lldb-unit :: Process/minidump/./LLDBMinidumpTests/MinidumpParserTest.GetLinuxProcStatus (1271 of 2110) PASS: lldb-unit :: Utility/./UtilityTests/LogTest.LLDB_LOG_nullptr (1272 of 2110) UNSUPPORTED: lldb-api :: functionalities/asan/TestReportData.py (1273 of 2110) PASS: lldb-api :: lang/cpp/type_lookup/TestCppTypeLookup.py (1274 of 2110) PASS: lldb-api :: functionalities/data-formatter/data-formatter-named-summaries/TestDataFormatterNamedSummaries.py (1275 of 2110) PASS: lldb-api :: commands/expression/formatters/TestFormatters.py (1276 of 2110) PASS: lldb-api :: functionalities/var_path/TestVarPath.py (1277 of 2110) PASS: lldb-unit :: Utility/./UtilityTests/GeneratorTest.GetOrCreate (1278 of 2110) PASS: lldb-unit :: Utility/./UtilityTests/ScalarTest.TruncOrExtendTo (1279 of 2110) PASS: lldb-api :: functionalities/data-formatter/data-formatter-stl/libcxx/atomic/TestLibCxxAtomic.py (1280 of 2110) PASS: lldb-api :: lang/cpp/chained-calls/TestCppChainedCalls.py (1281 of 2110) UNSUPPORTED: lldb-shell :: SymbolFile/DWARF/split-dwarf-expression-eval-bug.cpp (1282 of 2110) Cannot contact green-dragon-23: java.lang.InterruptedException apparent clock skew in /Users/buildslave/jenkins/workspace/lldb-cmake-sanitized@tmp/durable-5a3e96c5 wrapper script does not seem to be touching the log file in /Users/buildslave/jenkins/workspace/lldb-cmake-sanitized@tmp/durable-5a3e96c5 (JENKINS-48300: if on an extremely laggy filesystem, consider -Dorg.jenkinsci.plugins.durabletask.BourneShellScript.HEARTBEAT_CHECK_INTERVAL=86400) [Pipeline] } [Pipeline] // timeout [Pipeline] } [Pipeline] // stage [Pipeline] stage [Pipeline] { (Declarative: Post Actions) [Pipeline] scanForIssues [Clang (LLVM based)] Sleeping for 5 seconds due to JENKINS-32191... [Clang (LLVM based)] Parsing console log (workspace: '/Users/buildslave/jenkins/workspace/lldb-cmake-sanitized') [Clang (LLVM based)] Successfully parsed console log [Clang (LLVM based)] -> found 3 issues (skipped 0 duplicates) [Clang (LLVM based)] Post processing issues on 'green-dragon-23' with source code encoding 'UTF-8' [Clang (LLVM based)] Creating SCM blamer to obtain author and commit information for affected files [Clang (LLVM based)] Creating SCM miner to obtain statistics for affected repository files [Clang (LLVM based)] Resolving file names for all issues in source directory '/Users/buildslave/jenkins/workspace/lldb-cmake-sanitized' [Clang (LLVM based)] -> resolved paths in source directory (2 found, 0 not found) [Clang (LLVM based)] Resolving module names from module definitions (build.xml, pom.xml, or Manifest.mf files) [Clang (LLVM based)] -> resolved module names for 3 issues [Clang (LLVM based)] Resolving package names (or namespaces) by parsing the affected files [Clang (LLVM based)] -> resolved package names of 2 affected files [Clang (LLVM based)] No filter has been set, publishing all 3 issues [Clang (LLVM based)] Creating fingerprints for all affected code blocks to track issues over different builds [Clang (LLVM based)] -> created fingerprints for 3 issues (skipped 0 issues) [Clang (LLVM based)] Copying affected files to Jenkins' build folder '/Users/Shared/Jenkins/Home/jobs/lldb-cmake-sanitized/builds/1702/files-with-issues' [Clang (LLVM based)] -> 2 copied, 0 not in workspace, 0 not-found, 0 with I/O error [Pipeline] junit Recording test results No test report files were found. Configuration error? Error when executing always post condition: Also: hudson.remoting.Channel$CallSiteStackTrace: Remote call to green-dragon-23 at hudson.remoting.Channel.attachCallSiteStackTrace(Channel.java:1788) at hudson.remoting.UserRequest$ExceptionResponse.retrieve(UserRequest.java:356) at hudson.remoting.Channel.call(Channel.java:998) at hudson.FilePath.act(FilePath.java:1069) at hudson.FilePath.act(FilePath.java:1058) at hudson.tasks.junit.JUnitParser.parseResult(JUnitParser.java:114) at hudson.tasks.junit.JUnitResultArchiver.parse(JUnitResultArchiver.java:137) at hudson.tasks.junit.JUnitResultArchiver.parseAndAttach(JUnitResultArchiver.java:167) at hudson.tasks.junit.pipeline.JUnitResultsStepExecution.run(JUnitResultsStepExecution.java:52) at hudson.tasks.junit.pipeline.JUnitResultsStepExecution.run(JUnitResultsStepExecution.java:25) at org.jenkinsci.plugins.workflow.steps.SynchronousNonBlockingStepExecution.lambda$start$0(SynchronousNonBlockingStepExecution.java:47) at java.util.concurrent.Executors$RunnableAdapter.call(Executors.java:511) hudson.AbortException: No test report files were found. Configuration error? at hudson.tasks.junit.JUnitParser$ParseResultCallable.invoke(JUnitParser.java:154) at hudson.tasks.junit.JUnitParser$ParseResultCallable.invoke(JUnitParser.java:118) at hudson.FilePath$FileCallableWrapper.call(FilePath.java:3073) at hudson.remoting.UserRequest.perform(UserRequest.java:211) at hudson.remoting.UserRequest.perform(UserRequest.java:54) at hudson.remoting.Request$2.run(Request.java:369) at hudson.remoting.InterceptingExecutorService$1.call(InterceptingExecutorService.java:72) at java.util.concurrent.FutureTask.run(FutureTask.java:266) at java.util.concurrent.ThreadPoolExecutor.runWorker(ThreadPoolExecutor.java:1149) at java.util.concurrent.ThreadPoolExecutor$Worker.run(ThreadPoolExecutor.java:624) at java.lang.Thread.run(Thread.java:748)

Hide Details

[Pipeline] } [Pipeline] // stage [Pipeline] } [Pipeline] // withEnv [Pipeline] } [Pipeline] // node [Pipeline] End of Pipeline ERROR: script returned exit code -1 Finished: FAILURE