FailedConsole Output

Skipping 9,469 KB.. Full Log
087)
PASS: lldb-shell :: SymbolFile/DWARF/find-inline-method.s (635 of 2087)
PASS: lldb-unit :: Core/./LLDBCoreTests/UniqueCStringMap.NoDefaultConstructor (636 of 2087)
PASS: lldb-unit :: Utility/./UtilityTests/TimeoutTest.Construction (637 of 2087)
PASS: lldb-api :: functionalities/param_entry_vals/basic_entry_values/TestBasicEntryValues.py (638 of 2087)
PASS: lldb-unit :: Host/./HostTests/NativeProcessProtocolTest.SetBreakpointFailWrite (639 of 2087)
PASS: lldb-unit :: Utility/./UtilityTests/StringListTest.JoinNonSpace (640 of 2087)
PASS: lldb-unit :: Utility/./UtilityTests/ScalarTest.TruncOrExtendTo (641 of 2087)
PASS: lldb-unit :: Utility/./UtilityTests/DataExtractorTest.GetCStrAtEnd (642 of 2087)
PASS: lldb-api :: commands/watchpoints/watchpoint_events/TestWatchpointEvents.py (643 of 2087)
PASS: lldb-api :: commands/quit/TestQuit.py (644 of 2087)
PASS: lldb-api :: functionalities/thread/concurrent_events/TestConcurrentDelaySignalBreak.py (645 of 2087)
PASS: lldb-shell :: Breakpoint/debug_rnglistx_rlex.test (646 of 2087)
PASS: lldb-unit :: Utility/./UtilityTests/RangeTest.DoesAdjoinOrIntersect (647 of 2087)
PASS: lldb-unit :: Expression/./ExpressionTests/CppModuleConfigurationTest.Xcode (648 of 2087)
PASS: lldb-unit :: Target/./TargetTests/StackFrameRecognizerTest.NullModuleRegex (649 of 2087)
PASS: lldb-shell :: ObjectFile/ELF/netbsd-exec-8.99.30-amd64.yaml (650 of 2087)
PASS: lldb-api :: lang/cpp/stl/TestStdCXXDisassembly.py (651 of 2087)
PASS: lldb-unit :: ScriptInterpreter/Python/./ScriptInterpreterPythonTests/PythonDataObjectsTest.TestModuleNameResolutionNoDot (652 of 2087)
PASS: lldb-unit :: Utility/./UtilityTests/ArgsTest.ReplaceArgumentAtIndexShort (653 of 2087)
UNSUPPORTED: lldb-api :: functionalities/data-formatter/data-formatter-stl/libstdcpp/string/TestDataFormatterStdString.py (654 of 2087)
PASS: lldb-api :: python_api/symbol-context/TestSymbolContext.py (655 of 2087)
PASS: lldb-api :: commands/expression/unwind_expression/TestUnwindExpression.py (656 of 2087)
PASS: lldb-unit :: Process/gdb-remote/./ProcessGdbRemoteTests/GDBRemoteCommunicationClientTest.SendGetMetaDataPacket (657 of 2087)
PASS: lldb-unit :: Host/./HostTests/NativeProcessProtocolTest.ReadMemoryWithoutTrap (658 of 2087)
PASS: lldb-unit :: Process/gdb-remote/./ProcessGdbRemoteTests/GDBRemoteCommunicationClientTest.WriteRegister (659 of 2087)
PASS: lldb-unit :: Disassembler/./DisassemblerTests/TestArm64Disassembly.TestArmv81Instruction (660 of 2087)
PASS: lldb-unit :: SymbolFile/NativePDB/./SymbolFileNativePDBTests/PDBFPOProgramToDWARFExpressionTests.UnknownOp (661 of 2087)
PASS: lldb-unit :: Utility/./UtilityTests/VMRange.ContainsRange (662 of 2087)
PASS: lldb-api :: commands/watchpoints/watchpoint_commands/command/TestWatchpointCommandPython.py (663 of 2087)
UNSUPPORTED: lldb-api :: macosx/macabi/TestMacABImacOSFramework.py (664 of 2087)
PASS: lldb-api :: functionalities/breakpoint/address_breakpoints/TestAddressBreakpoints.py (665 of 2087)
PASS: lldb-unit :: Language/Highlighting/./HighlighterTests/HighlighterTest.ClangCursorPosAfterOtherToken (666 of 2087)
PASS: lldb-api :: macosx/load-kext/TestLoadKext.py (667 of 2087)
PASS: lldb-unit :: Utility/./UtilityTests/StreamTeeTest.Constructor2Streams (668 of 2087)
PASS: lldb-unit :: Utility/./UtilityTests/StatusTest.ErrorConversion (669 of 2087)
PASS: lldb-unit :: Utility/./UtilityTests/StringExtractorTest.InitEmpty (670 of 2087)
PASS: lldb-unit :: debugserver/./debugserverTests/RNBSocket.LoopBackConnectIPv4 (671 of 2087)
PASS: lldb-api :: sanity/TestSettingSkipping.py (672 of 2087)
PASS: lldb-unit :: ScriptInterpreter/Python/./ScriptInterpreterPythonTests/PythonDataObjectsTest.TestPythonIntegerToStructuredInteger (673 of 2087)
PASS: lldb-shell :: SymbolFile/DWARF/static_scope.s (674 of 2087)
PASS: lldb-unit :: Utility/./UtilityTests/ArgsTest.Yaml (675 of 2087)
PASS: lldb-shell :: Unwind/thread-step-out-ret-addr-check.test (676 of 2087)
PASS: lldb-api :: functionalities/gdb_remote_client/TestArmRegisterDefinition.py (677 of 2087)
PASS: lldb-unit :: Utility/./UtilityTests/BinaryStreamTest.PutULEB128EightBytes (678 of 2087)
PASS: lldb-unit :: Utility/./UtilityTests/UriParserTest.MinimalPortPath (679 of 2087)
PASS: lldb-unit :: Utility/./UtilityTests/Flags.AllSet (680 of 2087)
UNSUPPORTED: lldb-api :: tools/lldb-vscode/completions/TestVSCode_completions.py (681 of 2087)
PASS: lldb-unit :: SymbolFile/NativePDB/./SymbolFileNativePDBTests/PDBFPOProgramToDWARFExpressionTests.UnresolvedRegisterAssignmentReference (682 of 2087)
PASS: lldb-api :: functionalities/data-formatter/language_category_updates/TestDataFormatterLanguageCategoryUpdates.py (683 of 2087)
PASS: lldb-unit :: Core/./LLDBCoreTests/RichManglingContextTest.IPDRealloc (684 of 2087)
PASS: lldb-unit :: Signals/./SignalsTests/UnixSignalsTest.Iteration (685 of 2087)
PASS: lldb-unit :: SymbolFile/NativePDB/./SymbolFileNativePDBTests/PDBFPOProgramToDWARFExpressionTests.InvalidOpBinary (686 of 2087)
PASS: lldb-unit :: Language/Highlighting/./HighlighterTests/HighlighterTest.ClangBraces (687 of 2087)
PASS: lldb-api :: commands/watchpoints/watchpoint_commands/command/TestWatchpointCommandLLDB.py (688 of 2087)
PASS: lldb-api :: commands/expression/weak_symbols/TestWeakSymbols.py (689 of 2087)
PASS: lldb-shell :: SymbolFile/Breakpad/unwind-via-stack-win.test (690 of 2087)
PASS: lldb-unit :: Utility/./UtilityTests/StringListTest.AppendList (691 of 2087)
PASS: lldb-api :: lang/cpp/gmodules/TestWithModuleDebugging.py (692 of 2087)
PASS: lldb-api :: functionalities/breakpoint/address_breakpoints/TestBadAddressBreakpoints.py (693 of 2087)
PASS: lldb-unit :: Utility/./UtilityTests/StringListTest.InsertStringAtIndexStart (694 of 2087)
PASS: lldb-unit :: Utility/./UtilityTests/StringListTest.AppendStringStdString (695 of 2087)
PASS: lldb-unit :: Process/gdb-remote/./ProcessGdbRemoteTests/GDBRemoteCommunicationServerTest.SendErrorResponse_ErrorNumber (696 of 2087)
PASS: lldb-unit :: ObjectFile/Breakpad/./ObjectFileBreakpadTests/FileRecord.parse (697 of 2087)
PASS: lldb-shell :: SymbolFile/DWARF/parallel-indexing-stress.s (698 of 2087)
UNSUPPORTED: lldb-shell :: SymbolFile/PDB/class-layout.test (699 of 2087)
PASS: lldb-unit :: Utility/./UtilityTests/Flags.GetBitSize (700 of 2087)
PASS: lldb-api :: sanity/TestModuleCacheSanity.py (701 of 2087)
PASS: lldb-unit :: Utility/./UtilityTests/BinaryStreamTest.PutSLEB128SixBytes (702 of 2087)
PASS: lldb-api :: commands/gui/invalid-args/TestInvalidArgsGui.py (703 of 2087)
PASS: lldb-unit :: Utility/./UtilityTests/StringExtractorTest.DecodeHexU8_Underflow (704 of 2087)
PASS: lldb-api :: lang/objc/foundation/TestObjCMethods.py (705 of 2087)
PASS: lldb-shell :: SymbolFile/DWARF/debug-types-line-tables.s (706 of 2087)
PASS: lldb-api :: lang/objc/foundation/TestObjCMethodsNSError.py (707 of 2087)
PASS: lldb-api :: commands/expression/fixits/TestFixIts.py (708 of 2087)
PASS: lldb-api :: commands/expression/scoped_enums/TestScopedEnumType.py (709 of 2087)
PASS: lldb-shell :: Reproducer/TestDriverOptions.test (710 of 2087)
PASS: lldb-unit :: Expression/./ExpressionTests/CppModuleConfigurationTest.MissingUsrInclude (711 of 2087)
UNSUPPORTED: lldb-shell :: ScriptInterpreter/Lua/breakpoint_callback.test (712 of 2087)
UNSUPPORTED: lldb-api :: lang/objc/rdar-12408181/TestRdar12408181.py (713 of 2087)
PASS: lldb-shell :: SymbolFile/NativePDB/ast-types.cpp (714 of 2087)
PASS: lldb-unit :: Utility/./UtilityTests/RangeTest.ContainsAddr (715 of 2087)
PASS: lldb-api :: functionalities/data-formatter/data-formatter-objc/cmtime/TestDataFormatterCMTime.py (716 of 2087)
UNSUPPORTED: lldb-shell :: SymbolFile/PDB/function-nested-block.test (717 of 2087)
PASS: lldb-unit :: Utility/./UtilityTests/StringExtractorTest.GetHexU8_Underflow (718 of 2087)
PASS: lldb-unit :: Utility/./UtilityTests/RangeTest.ContainsRange (719 of 2087)
PASS: lldb-unit :: Utility/./UtilityTests/LogChannelTest.Disable (720 of 2087)
PASS: lldb-api :: functionalities/data-formatter/data-formatter-python-synth/TestDataFormatterPythonSynth.py (721 of 2087)
PASS: lldb-unit :: Utility/./UtilityTests/RangeTest.DefaultConstructor (722 of 2087)
PASS: lldb-api :: commands/expression/dollar-in-variable/TestDollarInVariable.py (723 of 2087)
PASS: lldb-unit :: Interpreter/./InterpreterTests/CompletionTest.FileCompletionAbsolute (724 of 2087)
PASS: lldb-api :: commands/expression/pr35310/TestExprsBug35310.py (725 of 2087)
PASS: lldb-api :: macosx/duplicate-archive-members/TestDuplicateMembers.py (726 of 2087)
PASS: lldb-shell :: ObjectFile/PECOFF/basic-info.yaml (727 of 2087)
PASS: lldb-api :: functionalities/thread/step_until/TestStepUntil.py (728 of 2087)
PASS: lldb-unit :: Signals/./SignalsTests/UnixSignalsTest.GetFilteredSignals (729 of 2087)
PASS: lldb-api :: lang/objc/objc-baseclass-sbtype/TestObjCBaseClassSBType.py (730 of 2087)
PASS: lldb-shell :: SymbolFile/NativePDB/break-by-line.cpp (731 of 2087)
PASS: lldb-unit :: Symbol/./SymbolTests/TestTypeSystemClang.TestNotDeletingUserCopyCstrDueToMoveCStr (732 of 2087)
PASS: lldb-api :: commands/expression/import-std-module/shared_ptr/TestSharedPtrFromStdModule.py (733 of 2087)
PASS: lldb-unit :: Utility/./UtilityTests/StringListTest.PopBack (734 of 2087)
PASS: lldb-unit :: UnwindAssembly/x86/./UnwindAssemblyx86Tests/Testx86AssemblyInspectionEngine.TestPushRBX (735 of 2087)
PASS: lldb-unit :: ScriptInterpreter/Python/./ScriptInterpreterPythonTests/PythonDataObjectsTest.TestPythonStringToStructuredString (736 of 2087)
PASS: lldb-api :: python_api/thread/TestThreadAPI.py (737 of 2087)
PASS: lldb-api :: functionalities/data-formatter/refpointer-recursion/TestDataFormatterRefPtrRecursion.py (738 of 2087)
PASS: lldb-api :: iohandler/completion/TestIOHandlerCompletion.py (739 of 2087)
PASS: lldb-unit :: Utility/./UtilityTests/StringExtractorTest.GetNameColonValueSuccess (740 of 2087)
PASS: lldb-unit :: Utility/./UtilityTests/OptionsWithRawTest.ArgsButNoLeadingDash (741 of 2087)
PASS: lldb-unit :: Language/Highlighting/./HighlighterTests/HighlighterTest.DefaultHighlighterWithCursorOutOfBounds (742 of 2087)
UNSUPPORTED: lldb-api :: functionalities/thread/thread_specific_break_plus_condition/TestThreadSpecificBpPlusCondition.py (743 of 2087)
PASS: lldb-api :: functionalities/data-formatter/frameformat_smallstruct/TestFrameFormatSmallStruct.py (744 of 2087)
PASS: lldb-api :: commands/watchpoints/step_over_watchpoint/TestStepOverWatchpoint.py (745 of 2087)
PASS: lldb-unit :: UnwindAssembly/x86/./UnwindAssemblyx86Tests/Testx86AssemblyInspectionEngine.TestPopRBPWithREX (746 of 2087)
PASS: lldb-api :: functionalities/tsan/multiple/TestTsanMultiple.py (747 of 2087)
PASS: lldb-unit :: Utility/./UtilityTests/AnsiTerminal.KnownPrefix (748 of 2087)
PASS: lldb-api :: lang/objcxx/class-name-clash/TestNameClash.py (749 of 2087)
PASS: lldb-unit :: Process/minidump/./LLDBMinidumpTests/MinidumpParserTest.FindMemoryRangeWithFullMemoryMinidump (750 of 2087)
PASS: lldb-shell :: SymbolFile/DWARF/dwarf5_locations.s (751 of 2087)
UNSUPPORTED: lldb-api :: functionalities/darwin_log/filter/exact_match/message/TestDarwinLogFilterMatchMessage.py (752 of 2087)
PASS: lldb-api :: functionalities/gdb_remote_client/TestJLink6Armv7RegisterDefinition.py (753 of 2087)
PASS: lldb-api :: commands/expression/import-std-module/vector-bool/TestVectorBoolFromStdModule.py (754 of 2087)
PASS: lldb-shell :: SymbolFile/DWARF/find-variable-dwo.cpp (755 of 2087)
PASS: lldb-api :: tools/lldb-vscode/variables/TestVSCode_variables.py (756 of 2087)
PASS: lldb-shell :: Minidump/memory-region.yaml (757 of 2087)
UNSUPPORTED: lldb-api :: commands/watchpoints/hello_watchlocation/TestWatchLocation.py (758 of 2087)
PASS: lldb-api :: functionalities/postmortem/minidump-new/TestMiniDumpNew.py (759 of 2087)
PASS: lldb-unit :: Host/./HostTests/SocketTest.DomainListenConnectAccept (760 of 2087)
PASS: lldb-api :: commands/expression/test/TestExprs2.py (761 of 2087)
PASS: lldb-unit :: Language/Highlighting/./HighlighterTests/HighlighterTest.ClangUnterminatedString (762 of 2087)
PASS: lldb-unit :: Utility/./UtilityTests/BroadcasterTest.BroadcastEvent (763 of 2087)
PASS: lldb-unit :: Utility/./UtilityTests/UserIDResolver.GetGroupName (764 of 2087)
PASS: lldb-unit :: Utility/./UtilityTests/StringListTest.JoinThree (765 of 2087)
PASS: lldb-unit :: Utility/./UtilityTests/StringListTest.LongestCommonPrefixNoPrefix (766 of 2087)
UNSUPPORTED: lldb-shell :: Register/x86-64-zmm-write.test (767 of 2087)
PASS: lldb-unit :: ObjectFile/Breakpad/./ObjectFileBreakpadTests/StackWinRecord.parse (768 of 2087)
PASS: lldb-api :: commands/expression/deleting-implicit-copy-constructor/TestDeletingImplicitCopyConstructor.py (769 of 2087)
PASS: lldb-api :: commands/expression/options/TestExprOptions.py (770 of 2087)
PASS: lldb-unit :: Utility/./UtilityTests/ArgsTest.StringListConstructor (771 of 2087)
PASS: lldb-unit :: Utility/./UtilityTests/StreamTest.PutStringAsRawHex8 (772 of 2087)
PASS: lldb-unit :: Language/CLanguages/./LanguageCLanguagesTests/CLanguages.LookupCLanguagesByLanguageType (773 of 2087)
PASS: lldb-unit :: Expression/./ExpressionTests/DiagnosticManagerTest.AppendMessageSubsequentDiags (774 of 2087)
PASS: lldb-api :: lang/objc/objc-checker/TestObjCCheckers.py (775 of 2087)
UNSUPPORTED: lldb-api :: benchmarks/continue/TestBenchmarkContinue.py (776 of 2087)
UNSUPPORTED: lldb-api :: functionalities/darwin_log/filter/regex/category/TestDarwinLogFilterRegexCategory.py (777 of 2087)
PASS: lldb-unit :: Process/gdb-remote/./ProcessGdbRemoteTests/GDBRemoteClientBaseTest.SendContinueAndAsyncSignal (778 of 2087)
PASS: lldb-api :: tools/lldb-server/TestGdbRemoteHostInfo.py (779 of 2087)
PASS: lldb-api :: functionalities/tail_call_frames/thread_step_out_or_return/TestSteppingOutWithArtificialFrames.py (780 of 2087)
PASS: lldb-api :: tools/lldb-vscode/breakpoint/TestVSCode_setExceptionBreakpoints.py (781 of 2087)
PASS: lldb-api :: types/TestLongTypesExpr.py (782 of 2087)
PASS: lldb-unit :: Utility/./UtilityTests/CompletionRequest.TryCompleteCurrentArgMode (783 of 2087)
PASS: lldb-shell :: ScriptInterpreter/Python/scripted_breakpoint.test (784 of 2087)
PASS: lldb-unit :: ObjectFile/PECOFF/./ObjectFilePECOFFTests/PECallFrameInfoTest.Basic_eh (785 of 2087)
PASS: lldb-api :: functionalities/data-formatter/cstring-utf8-summary/TestCstringUnicode.py (786 of 2087)
PASS: lldb-unit :: Utility/./UtilityTests/StringListTest.CopyListEmpty (787 of 2087)
PASS: lldb-api :: functionalities/breakpoint/consecutive_breakpoints/TestConsecutiveBreakpoints.py (788 of 2087)
PASS: lldb-unit :: Host/./HostTests/NativeProcessProtocolTest.SetBreakpointFailRead (789 of 2087)
PASS: lldb-shell :: Breakpoint/case-sensitive.test (790 of 2087)
PASS: lldb-api :: functionalities/breakpoint/step_over_breakpoint/TestStepOverBreakpoint.py (791 of 2087)
PASS: lldb-api :: lang/objc/foundation/TestRuntimeTypes.py (792 of 2087)
PASS: lldb-unit :: Symbol/./SymbolTests/LineEntryTest.GetSameLineContiguousAddressRangeNoInlines (793 of 2087)
UNSUPPORTED: lldb-api :: python_api/event/TestEvents.py (794 of 2087)
PASS: lldb-unit :: Utility/./UtilityTests/StreamTest.PutCStringWithStringRef (795 of 2087)
PASS: lldb-shell :: SymbolFile/NativePDB/nested-types.cpp (796 of 2087)
PASS: lldb-shell :: Reproducer/TestGDBRemoteRepro.test (797 of 2087)
PASS: lldb-api :: functionalities/tail_call_frames/ambiguous_tail_call_seq2/TestAmbiguousTailCallSeq2.py (798 of 2087)
PASS: lldb-api :: commands/expression/top-level/TestTopLevelExprs.py (799 of 2087)
PASS: lldb-unit :: Utility/./UtilityTests/XcodeSDKTest.GetCanonicalNameAndConstruct (800 of 2087)
PASS: lldb-shell :: Settings/TestDisableColor.test (801 of 2087)
PASS: lldb-unit :: UnwindAssembly/x86/./UnwindAssemblyx86Tests/Testx86AssemblyInspectionEngine.TestPushImm (802 of 2087)
PASS: lldb-unit :: Symbol/./SymbolTests/Type.GetTypeScopeAndBasename (803 of 2087)
PASS: lldb-api :: commands/expression/context-object/TestContextObject.py (804 of 2087)
PASS: lldb-shell :: ObjectFile/PECOFF/basic-info-arm64.yaml (805 of 2087)
PASS: lldb-unit :: Interpreter/./InterpreterTests/OptionArgParserTest.toChar (806 of 2087)
PASS: lldb-api :: functionalities/inferior-assert/TestInferiorAssert.py (807 of 2087)
PASS: lldb-unit :: Utility/./UtilityTests/ArgsTest.DoubleQuotedItem (808 of 2087)
PASS: lldb-api :: commands/watchpoints/watchpoint_commands/TestWatchpointCommands.py (809 of 2087)
PASS: lldb-unit :: Utility/./UtilityTests/ArgsTest.TestArgv (810 of 2087)
PASS: lldb-api :: commands/settings/TestSettings.py (811 of 2087)
PASS: lldb-unit :: UnwindAssembly/x86/./UnwindAssemblyx86Tests/Testx86AssemblyInspectionEngine.Test64bitFramelessBigStackFrame (812 of 2087)
PASS: lldb-api :: functionalities/data-formatter/type_summary_list_script/TestTypeSummaryListScript.py (813 of 2087)
PASS: lldb-unit :: Editline/./EditlineTests/EditlineTestFixture.EditlineReceivesSingleLineText (814 of 2087)
PASS: lldb-shell :: Driver/TestSingleQuote.test (815 of 2087)
PASS: lldb-unit :: Utility/./UtilityTests/ScalarTest.GetValue (816 of 2087)
PASS: lldb-api :: functionalities/backticks/TestBackticksWithoutATarget.py (817 of 2087)
PASS: lldb-api :: functionalities/data-formatter/data-formatter-stl/libcxx/multiset/TestDataFormatterLibcxxMultiSet.py (818 of 2087)
PASS: lldb-shell :: Settings/TestModuleCacheSanity.test (819 of 2087)
PASS: lldb-shell :: SymbolFile/DWARF/debug-types-basic.test (820 of 2087)
PASS: lldb-unit :: ScriptInterpreter/Python/./ScriptInterpreterPythonTests/PythonDataObjectsTest.TestPythonTupleValues (821 of 2087)
PASS: lldb-api :: commands/frame/diagnose/dereference-function-return/TestDiagnoseDereferenceFunctionReturn.py (822 of 2087)
PASS: lldb-unit :: Expression/./ExpressionTests/DiagnosticManagerTest.GetStringMultiline (823 of 2087)
PASS: lldb-api :: lang/cpp/modules-import/TestCXXModulesImport.py (824 of 2087)
PASS: lldb-unit :: Utility/./UtilityTests/StringListTest.SplitIntoLinesEmpty (825 of 2087)
PASS: lldb-unit :: Utility/./UtilityTests/StringExtractorTest.GetHexBytes_Partial (826 of 2087)
PASS: lldb-api :: types/TestCharTypeExpr.py (827 of 2087)
PASS: lldb-unit :: Utility/./UtilityTests/StringListTest.SetSize (828 of 2087)
PASS: lldb-unit :: Expression/./ExpressionTests/CppModuleConfigurationTest.LinuxLocalLibCpp (829 of 2087)
PASS: lldb-shell :: ObjectFile/Breakpad/discontiguous-sections.test (830 of 2087)
PASS: lldb-api :: tools/lldb-server/register-reading/TestGdbRemoteGPacket.py (831 of 2087)
PASS: lldb-unit :: ScriptInterpreter/Python/./ScriptInterpreterPythonTests/PythonDataObjectsTest.TestRun (832 of 2087)
PASS: lldb-api :: functionalities/breakpoint/cpp/TestCPPBreakpointLocations.py (833 of 2087)
PASS: lldb-unit :: ScriptInterpreter/Python/./ScriptInterpreterPythonTests/PythonDataObjectsTest.TestGlobalNameResolutionWithDot (834 of 2087)
PASS: lldb-unit :: Platform/Android/./AdbClientTests/AdbClientTest.CreateByDeviceId (835 of 2087)
PASS: lldb-api :: commands/statistics/basic/TestStats.py (836 of 2087)
PASS: lldb-unit :: Process/gdb-remote/./ProcessGdbRemoteTests/GDBRemoteCommunicationClientTest.SendGetDataPacket (837 of 2087)
PASS: lldb-api :: functionalities/breakpoint/breakpoint_callback_command_source/TestBreakpointCallbackCommandSource.py (838 of 2087)
PASS: lldb-shell :: Breakpoint/split-dwarf-5-addrbase.test (839 of 2087)
PASS: lldb-unit :: Utility/./UtilityTests/XcodeSDKTest.SDKSupportsSwift (840 of 2087)
UNSUPPORTED: lldb-shell :: Register/x86-64-xmm16-write.test (841 of 2087)
PASS: lldb-api :: functionalities/data-formatter/data-formatter-stl/libcxx/vector/TestDataFormatterLibcxxVector.py (842 of 2087)
UNSUPPORTED: lldb-shell :: Register/aarch64-fp-read.test (843 of 2087)
PASS: lldb-unit :: Language/Highlighting/./HighlighterTests/HighlighterTest.ClangTrailingBackslashWithWhitespace (844 of 2087)
PASS: lldb-api :: macosx/indirect_symbol/TestIndirectSymbols.py (845 of 2087)
PASS: lldb-api :: commands/log/basic/TestLogging.py (846 of 2087)
PASS: lldb-api :: functionalities/data-formatter/data-formatter-disabling/TestDataFormatterDisabling.py (847 of 2087)
PASS: lldb-api :: functionalities/inferior-crashing/TestInferiorCrashingStep.py (848 of 2087)
PASS: lldb-unit :: Symbol/./SymbolTests/DWARFCallFrameInfoTest.Basic_eh (849 of 2087)
PASS: lldb-unit :: Utility/./UtilityTests/StringLexerTest.GetUnlexed (850 of 2087)
PASS: lldb-unit :: ObjectFile/Breakpad/./ObjectFileBreakpadTests/PublicRecord.parse (851 of 2087)
UNSUPPORTED: lldb-api :: tools/lldb-server/libraries-svr4/TestGdbRemoteLibrariesSvr4Support.py (852 of 2087)
PASS: lldb-unit :: Utility/./UtilityTests/StreamTest.PutULEB128 (853 of 2087)
PASS: lldb-unit :: Utility/./UtilityTests/StringListTest.JoinEmpty (854 of 2087)
PASS: lldb-unit :: Target/./TargetTests/ExecutionContextTest.GetByteOrder (855 of 2087)
PASS: lldb-api :: functionalities/data-formatter/data-formatter-cpp/TestDataFormatterCpp.py (856 of 2087)
PASS: lldb-api :: lang/cpp/dynamic-value-same-basename/TestDynamicValueSameBase.py (857 of 2087)
PASS: lldb-api :: lang/c/function_types/TestFunctionTypes.py (858 of 2087)
PASS: lldb-unit :: Expression/./ExpressionTests/DWARFExpression.DW_OP_stack_value (859 of 2087)
PASS: lldb-shell :: Reproducer/TestReuseDirectory.test (860 of 2087)
PASS: lldb-api :: commands/frame/recognizer/TestFrameRecognizer.py (861 of 2087)
PASS: lldb-api :: commands/command/delete/TestCommandDelete.py (862 of 2087)
PASS: lldb-shell :: SymbolFile/DWARF/dwp-separate-debug-file.cpp (863 of 2087)
PASS: lldb-api :: functionalities/gdb_remote_client/TestNestedRegDefinitions.py (864 of 2087)
PASS: lldb-api :: functionalities/data-formatter/nssetsynth/TestNSSetSynthetic.py (865 of 2087)
PASS: lldb-unit :: Utility/./UtilityTests/EnvironmentTest.EnvpConversion (866 of 2087)
PASS: lldb-api :: commands/expression/import-std-module/stack/TestStackFromStdModule.py (867 of 2087)
PASS: lldb-shell :: Process/Optimization.test (868 of 2087)
PASS: lldb-unit :: Utility/./UtilityTests/StreamTeeTest.SetStreamAtIndexOverwrite (869 of 2087)
PASS: lldb-unit :: Language/Highlighting/./HighlighterTests/HighlighterTest.ClangComments (870 of 2087)
PASS: lldb-shell :: Unwind/eh-frame-dwarf-unwind.test (871 of 2087)
PASS: lldb-shell :: Quit/TestQuitExitCode30.test (872 of 2087)
PASS: lldb-unit :: Utility/./UtilityTests/VMRange.CollectionContains (873 of 2087)
PASS: lldb-unit :: Utility/./UtilityTests/CompletionRequest.Constructor (874 of 2087)
PASS: lldb-unit :: UnwindAssembly/x86/./UnwindAssemblyx86Tests/Testx86AssemblyInspectionEngine.TestSimple64bitFrameFunction (875 of 2087)
PASS: lldb-unit :: Utility/./UtilityTests/StreamTest.Indent (876 of 2087)
PASS: lldb-api :: lang/cpp/operators/TestCppOperators.py (877 of 2087)
PASS: lldb-unit :: Host/./HostTests/Host.GetEnvironment (878 of 2087)
UNSUPPORTED: lldb-api :: commands/target/auto-install-main-executable/TestAutoInstallMainExecutable.py (879 of 2087)
PASS: lldb-api :: functionalities/memory/find/TestMemoryFind.py (880 of 2087)
PASS: lldb-unit :: Language/Highlighting/./HighlighterTests/HighlighterTest.ClangCommas (881 of 2087)
PASS: lldb-api :: functionalities/non-overlapping-index-variable-i/TestIndexVariable.py (882 of 2087)
PASS: lldb-unit :: Utility/./UtilityTests/StringExtractorTest.GetU32LittleEndian (883 of 2087)
UNSUPPORTED: lldb-shell :: SymbolFile/PDB/vbases.test (884 of 2087)
PASS: lldb-shell :: ObjectFile/PECOFF/basic-info-arm.yaml (885 of 2087)
PASS: lldb-unit :: Process/minidump/./LLDBMinidumpTests/MinidumpParserTest.MinidumpModuleOrder (886 of 2087)
UNSUPPORTED: lldb-shell :: SymbolFile/PDB/calling-conventions.test (887 of 2087)
PASS: lldb-api :: python_api/lldbutil/process/TestPrintStackTraces.py (888 of 2087)
PASS: lldb-api :: commands/expression/call-throws/TestCallThatThrows.py (889 of 2087)
PASS: lldb-unit :: Host/./HostTests/SocketTest.TCPGetAddress (890 of 2087)
PASS: lldb-api :: commands/target/create-no-such-arch/TestNoSuchArch.py (891 of 2087)
PASS: lldb-api :: commands/expression/import-std-module/weak_ptr-dbg-info-content/TestDbgInfoContentWeakPtrFromStdModule.py (892 of 2087)
PASS: lldb-shell :: Commands/command-disassemble.s (893 of 2087)
PASS: lldb-unit :: Utility/./UtilityTests/StreamTeeTest.GetStreamAtIndexOutOfBounds (894 of 2087)
PASS: lldb-api :: commands/add-dsym/uuid/TestAddDsymCommand.py (895 of 2087)
PASS: lldb-unit :: Symbol/./SymbolTests/PostfixExpression.ParseFPOProgram (896 of 2087)
PASS: lldb-api :: lang/cpp/multiple-inheritance/TestCppMultipleInheritance.py (897 of 2087)
PASS: lldb-shell :: Reproducer/Functionalities/TestStepping.test (898 of 2087)
PASS: lldb-unit :: UnwindAssembly/x86/./UnwindAssemblyx86Tests/Testx86AssemblyInspectionEngine.Test32bitFramelessSmallStackFrame (899 of 2087)
PASS: lldb-api :: functionalities/inferior-crashing/TestInferiorCrashing.py (900 of 2087)
PASS: lldb-unit :: Symbol/./SymbolTests/SymbolsTest.TerminateLocateExecutableSymbolFileForUnknownExecutableAndUnknownSymbolFile (901 of 2087)
PASS: lldb-shell :: Driver/TestNoUseColor.test (902 of 2087)
PASS: lldb-unit :: Process/gdb-remote/./ProcessGdbRemoteTests/GDBRemoteClientBaseTest.SendContinueAndInterrupt (903 of 2087)
UNSUPPORTED: lldb-api :: functionalities/data-formatter/data-formatter-stl/libstdcpp/iterator/TestDataFormatterStdIterator.py (904 of 2087)
PASS: lldb-shell :: ObjectFile/ELF/duplicate-section.yaml (905 of 2087)
PASS: lldb-unit :: Utility/./UtilityTests/ScalarTest.ExtractBitfield (906 of 2087)
PASS: lldb-unit :: Utility/./UtilityTests/ArchSpecTest.Compatibility (907 of 2087)
PASS: lldb-unit :: SymbolFile/DWARF/./SymbolFileDWARFTests/SymbolFileDWARFTests.TestAbbrevNullAttrValidForm (908 of 2087)
PASS: lldb-shell :: Quit/TestQuitExitCodeHex0.test (909 of 2087)
PASS: lldb-unit :: Utility/./UtilityTests/BinaryStreamTest.PutULEB128SevenBytes (910 of 2087)
UNSUPPORTED: lldb-shell :: Watchpoint/netbsd-nouserdbregs.test (911 of 2087)
PASS: lldb-unit :: Expression/./ExpressionTests/DiagnosticManagerTest.PutString (912 of 2087)
PASS: lldb-unit :: Utility/./UtilityTests/StreamTest.PutPtr (913 of 2087)
PASS: lldb-api :: functionalities/thread_plan/TestThreadPlanCommands.py (914 of 2087)
PASS: lldb-unit :: Symbol/./SymbolTests/TestTypeSystemClang.TestGetBasicTypeFromName (915 of 2087)
PASS: lldb-api :: lang/cpp/frame-var-anon-unions/TestFrameVariableAnonymousUnions.py (916 of 2087)
PASS: lldb-unit :: Expression/./ExpressionTests/DiagnosticManagerTest.GetStringPreserveOrder (917 of 2087)
UNSUPPORTED: lldb-api :: benchmarks/libcxxlist/TestBenchmarkLibcxxList.py (918 of 2087)
PASS: lldb-shell :: ObjectFile/MachO/subsections.yaml (919 of 2087)
PASS: lldb-api :: lang/c/const_variables/TestConstVariables.py (920 of 2087)
PASS: lldb-api :: lang/objcxx/hide-runtime-values/TestObjCXXHideRuntimeValues.py (921 of 2087)
PASS: lldb-api :: terminal/TestEditline.py (922 of 2087)
PASS: lldb-api :: python_api/watchpoint/TestWatchpointIter.py (923 of 2087)
PASS: lldb-unit :: tools/lldb-server/tests/./LLDBServerTests/TestBase.DebugserverEnv (924 of 2087)
PASS: lldb-api :: python_api/function_symbol/TestDisasmAPI.py (925 of 2087)
PASS: lldb-api :: commands/expression/ignore-artificial-constructors/TestIgnoreArtificialConstructors.py (926 of 2087)
PASS: lldb-api :: functionalities/data-formatter/array_typedef/TestArrayTypedef.py (927 of 2087)
PASS: lldb-shell :: Driver/LocalLLDBInit.test (928 of 2087)
PASS: lldb-unit :: Utility/./UtilityTests/StringExtractorTest.DecodeHexU8_Extra (929 of 2087)
PASS: lldb-shell :: BuildScript/script-args.test (930 of 2087)
PASS: lldb-unit :: Utility/./UtilityTests/StreamTest.AddressPrefix (931 of 2087)
PASS: lldb-api :: functionalities/var_path/TestVarPath.py (932 of 2087)
PASS: lldb-shell :: SymbolFile/symbol-binding.test (933 of 2087)
PASS: lldb-unit :: Utility/./UtilityTests/CompletionRequest.FakeLastArg (934 of 2087)
PASS: lldb-api :: lang/objc/rdar-11355592/TestRdar11355592.py (935 of 2087)
PASS: lldb-api :: commands/expression/import-std-module/deque-dbg-info-content/TestDbgInfoContentDequeFromStdModule.py (936 of 2087)
PASS: lldb-shell :: ObjectFile/wasm/embedded-debug-sections.yaml (937 of 2087)
PASS: lldb-unit :: debugserver/./debugserverTests/RNBSocket.LoopBackConnectIPv6 (938 of 2087)
PASS: lldb-unit :: Utility/./UtilityTests/TildeExpressionResolver.ResolveFullPath (939 of 2087)
PASS: lldb-unit :: Utility/./UtilityTests/Flags.AllClear (940 of 2087)
PASS: lldb-api :: python_api/signals/TestSignalsAPI.py (941 of 2087)
PASS: lldb-unit :: Utility/./UtilityTests/StringExtractorTest.GetHexU8_Underflow2_NoEof (942 of 2087)
PASS: lldb-shell :: ObjectFile/PECOFF/symbol.yaml (943 of 2087)
PASS: lldb-unit :: Utility/./UtilityTests/VMRange.Comparison (944 of 2087)
PASS: lldb-unit :: Symbol/./SymbolTests/TestTypeSystemClang.TestDeletingImplicitCopyCstrDueToMoveCStr (945 of 2087)
PASS: lldb-api :: python_api/interpreter/TestCommandInterpreterAPI.py (946 of 2087)
PASS: lldb-api :: commands/expression/import-std-module/vector/TestVectorFromStdModule.py (947 of 2087)
PASS: lldb-api :: lang/cpp/namespace_definitions/TestNamespaceDefinitions.py (948 of 2087)
PASS: lldb-unit :: UnwindAssembly/x86/./UnwindAssemblyx86Tests/Testx86AssemblyInspectionEngine.TestPush0 (949 of 2087)
PASS: lldb-shell :: ObjectFile/ELF/minidebuginfo-corrupt-xz.yaml (950 of 2087)
PASS: lldb-unit :: Utility/./UtilityTests/StreamTest.AddressEmptyPrefix (951 of 2087)
PASS: lldb-unit :: Utility/./UtilityTests/BinaryStreamTest.PutSLEB128Zero (952 of 2087)
PASS: lldb-shell :: SymbolFile/DWARF/win-i386-line-table.s (953 of 2087)
UNSUPPORTED: lldb-shell :: ScriptInterpreter/Lua/io.test (954 of 2087)
PASS: lldb-api :: functionalities/gdb_remote_client/TestRecognizeBreakpoint.py (955 of 2087)
PASS: lldb-unit :: Utility/./UtilityTests/DataExtractorTest.GetFloat (956 of 2087)
PASS: lldb-unit :: ScriptInterpreter/Python/./ScriptInterpreterPythonTests/PythonDataObjectsTest.TestExceptions (957 of 2087)
PASS: lldb-unit :: Language/CPlusPlus/./LanguageCPlusPlusTests/CPlusPlusLanguage.CPlusPlusNameParser (958 of 2087)
PASS: lldb-shell :: ObjectFile/ELF/PT_LOAD-overlap-PT_TLS.yaml (959 of 2087)
PASS: lldb-unit :: Utility/./UtilityTests/StringListTest.JoinMultiCharSeparator (960 of 2087)
PASS: lldb-unit :: Utility/./UtilityTests/StringListTest.DefaultConstructor (961 of 2087)
PASS: lldb-unit :: Utility/./UtilityTests/ProcessInstanceInfoMatch.Name (962 of 2087)
PASS: lldb-api :: commands/expression/function_template_specialization_temp_args/TestFunctionTemplateSpecializationTempArgs.py (963 of 2087)
PASS: lldb-shell :: Reproducer/TestProcessList.test (964 of 2087)
UNSUPPORTED: lldb-shell :: ExecControl/StopHook/stop-hook-threads.test (965 of 2087)
PASS: lldb-unit :: Language/Highlighting/./HighlighterTests/HighlighterTest.HighlighterSelectionType (966 of 2087)
PASS: lldb-unit :: Process/gdb-remote/./ProcessGdbRemoteTests/GDBRemoteClientBaseTest.SendPacketAndReceiveResponseWithOutputSupport (967 of 2087)
PASS: lldb-shell :: VSCode/TestOptions.test (968 of 2087)
PASS: lldb-api :: functionalities/data-formatter/data-formatter-advanced/TestDataFormatterAdv.py (969 of 2087)
PASS: lldb-unit :: UnwindAssembly/x86/./UnwindAssemblyx86Tests/Testx86AssemblyInspectionEngine.TestSubRSP (970 of 2087)
PASS: lldb-unit :: Utility/./UtilityTests/UriParserTest.Empty (971 of 2087)
PASS: lldb-api :: functionalities/history/TestHistoryRecall.py (972 of 2087)
PASS: lldb-unit :: Utility/./UtilityTests/ListenerTest.GetEventImmediate (973 of 2087)
PASS: lldb-api :: tools/lldb-vscode/launch/TestVSCode_launch.py (974 of 2087)
UNSUPPORTED: lldb-api :: functionalities/data-formatter/data-formatter-stl/libstdcpp/vbool/TestDataFormatterStdVBool.py (975 of 2087)
PASS: lldb-unit :: Language/Highlighting/./HighlighterTests/HighlighterTest.Colons (976 of 2087)
PASS: lldb-unit :: Host/./HostTests/FileSystemTest.GetPermissions (977 of 2087)
PASS: lldb-shell :: Quit/TestQuitExitCodeHexA.test (978 of 2087)
PASS: lldb-unit :: Utility/./UtilityTests/BinaryStreamTest.PutULEB128Zero (979 of 2087)
UNSUPPORTED: lldb-api :: functionalities/thread/multi_break/TestMultipleBreakpoints.py (980 of 2087)
UNSUPPORTED: lldb-api :: api/multiple-debuggers/TestMultipleDebuggers.py (981 of 2087)
PASS: lldb-unit :: Expression/./ExpressionTests/CppModuleConfigurationTest.Sysroot (982 of 2087)
PASS: lldb-api :: python_api/lldbutil/TestSwigVersion.py (983 of 2087)
PASS: lldb-shell :: ObjectFile/ELF/PT_LOAD-overlap.yaml (984 of 2087)
PASS: lldb-shell :: ScriptInterpreter/Python/eof.test (985 of 2087)
UNSUPPORTED: lldb-shell :: SymbolFile/PDB/variables-locations.test (986 of 2087)
PASS: lldb-shell :: SymbolFile/Breakpad/unwind-via-raSearch.test (987 of 2087)
PASS: lldb-api :: lang/objc/modules-incomplete/TestIncompleteModules.py (988 of 2087)
PASS: lldb-shell :: Commands/command-breakpoint-col.test (989 of 2087)
PASS: lldb-api :: functionalities/data-formatter/data-formatter-stl/libcxx/atomic/TestLibCxxAtomic.py (990 of 2087)
PASS: lldb-api :: api/log/TestAPILog.py (991 of 2087)
PASS: lldb-api :: commands/expression/import-std-module/deque-basic/TestDequeFromStdModule.py (992 of 2087)
PASS: lldb-api :: commands/expression/ir-interpreter-phi-nodes/TestIRInterpreterPHINodes.py (993 of 2087)
PASS: lldb-shell :: Reproducer/TestDSYM.test (994 of 2087)
UNSUPPORTED: lldb-api :: commands/watchpoints/multi_watchpoint_slots/TestWatchpointMultipleSlots.py (995 of 2087)
PASS: lldb-shell :: SymbolFile/DWARF/DW_AT_low_pc-addrx.s (996 of 2087)
PASS: lldb-api :: functionalities/data-formatter/data-formatter-stl/libcxx/optional/TestDataFormatterLibcxxOptional.py (997 of 2087)
PASS: lldb-unit :: ScriptInterpreter/Python/./ScriptInterpreterPythonTests/PythonDataObjectsTest.TestPythonCallableCheck (998 of 2087)
PASS: lldb-api :: tools/lldb-vscode/breakpoint-events/TestVSCode_breakpointEvents.py (999 of 2087)
PASS: lldb-unit :: Utility/./UtilityTests/StructuredDataTest.StringDump (1000 of 2087)
PASS: lldb-api :: python_api/watchpoint/TestSetWatchpoint.py (1001 of 2087)
UNSUPPORTED: lldb-api :: commands/register/register/intel_xtended_registers/mpx_offset_intersection/TestMPXOffsetIntersection.py (1002 of 2087)
PASS: lldb-unit :: Process/minidump/./LLDBMinidumpTests/MinidumpParserTest.GetLinuxProcStatus_no_stream (1003 of 2087)
PASS: lldb-api :: lang/objc/blocks/TestObjCIvarsInBlocks.py (1004 of 2087)
PASS: lldb-unit :: debugserver/./debugserverTests/RNBSocket.LoopBackListenIPv6 (1005 of 2087)
PASS: lldb-api :: sample_test/TestSampleInlineTest.py (1006 of 2087)
PASS: lldb-unit :: Host/./HostTests/FileSystemTest.OpenErrno (1007 of 2087)
PASS: lldb-api :: functionalities/postmortem/elf-core/TestLinuxCore.py (1008 of 2087)
PASS: lldb-unit :: Process/minidump/./LLDBMinidumpTests/MinidumpParserTest.GetThreadContext_x86_64 (1009 of 2087)
PASS: lldb-api :: lang/c/array_types/TestArrayTypes.py (1010 of 2087)
PASS: lldb-shell :: ScriptInterpreter/None/import_module.test (1011 of 2087)
PASS: lldb-unit :: ObjectFile/ELF/./ObjectFileELFTests/ObjectFileELFTest.GetModuleSpecifications_EarlySectionHeaders (1012 of 2087)
PASS: lldb-unit :: Utility/./UtilityTests/StringExtractorTest.GetHexU8_Extra (1013 of 2087)
PASS: lldb-unit :: Process/minidump/./LLDBMinidumpTests/MinidumpParserTest.GetMiscInfoWindows (1014 of 2087)
PASS: lldb-unit :: Utility/./UtilityTests/ArgsTest.ReplaceArgumentAtIndexOutOfRange (1015 of 2087)
PASS: lldb-shell :: ObjectFile/PECOFF/sections-names.yaml (1016 of 2087)
PASS: lldb-unit :: SymbolFile/NativePDB/./SymbolFileNativePDBTests/PDBFPOProgramToDWARFExpressionTests.InvalidAssignmentSingle (1017 of 2087)
PASS: lldb-api :: lang/objc/variadic_methods/TestVariadicMethods.py (1018 of 2087)
PASS: lldb-unit :: Utility/./UtilityTests/SubsystemRAIITest.SubsystemWithErrorFailure (1019 of 2087)
PASS: lldb-unit :: Utility/./UtilityTests/RegisterValueTest.GetSet8 (1020 of 2087)
PASS: lldb-unit :: ScriptInterpreter/Python/./ScriptInterpreterPythonTests/PythonDataObjectsTest.TestPythonInteger (1021 of 2087)
PASS: lldb-unit :: SymbolFile/NativePDB/./SymbolFileNativePDBTests/PDBFPOProgramToDWARFExpressionTests.UnsupportedRASearch (1022 of 2087)
PASS: lldb-api :: functionalities/gdb_remote_client/TestNoGPacketSupported.py (1023 of 2087)
PASS: lldb-api :: commands/command/invalid-args/TestInvalidArgsCommand.py (1024 of 2087)
PASS: lldb-api :: commands/expression/persistent_ptr_update/TestPersistentPtrUpdate.py (1025 of 2087)
PASS: lldb-api :: functionalities/thread/concurrent_events/TestConcurrentBreakpointsDelayedBreakpointOneWatchpoint.py (1026 of 2087)
PASS: lldb-unit :: Host/./HostTests/MainLoopTest.TerminatesImmediately (1027 of 2087)
PASS: lldb-unit :: Utility/./UtilityTests/DataExtractorTest.GetDoubleUnaligned (1028 of 2087)
PASS: lldb-api :: commands/platform/basic/TestPlatformCommand.py (1029 of 2087)
PASS: lldb-unit :: Platform/./LLDBPlatformTests/PlatformDarwinTest.FindComponentInPath (1030 of 2087)
PASS: lldb-unit :: Utility/./UtilityTests/StatusTest.Formatv (1031 of 2087)
PASS: lldb-unit :: Utility/./UtilityTests/RecordReplayTest.InstrumentedBarRef (1032 of 2087)
PASS: lldb-api :: commands/expression/persistent_types/TestPersistentTypes.py (1033 of 2087)
PASS: lldb-shell :: Reproducer/TestCrash.test (1034 of 2087)
PASS: lldb-api :: commands/expression/import-std-module/queue/TestQueueFromStdModule.py (1035 of 2087)
PASS: lldb-api :: functionalities/data-formatter/nsdictionarysynth/TestNSDictionarySynthetic.py (1036 of 2087)
PASS: lldb-api :: commands/expression/completion-crash-incomplete-record/TestCompletionCrashIncompleteRecord.py (1037 of 2087)
PASS: lldb-unit :: Utility/./UtilityTests/ArchSpecTest.MergeFromMachOUnknown (1038 of 2087)
PASS: lldb-unit :: Utility/./UtilityTests/StringExtractorTest.DecodeHexU8_InvalidHex (1039 of 2087)
PASS: lldb-api :: functionalities/testid/TestTestId.py (1040 of 2087)
PASS: lldb-unit :: Utility/./UtilityTests/NameMatchesTest.Ignore (1041 of 2087)
PASS: lldb-unit :: Symbol/./SymbolTests/TestTypeSystemClang.TestGetTypeClassTypeOfExpr (1042 of 2087)
PASS: lldb-unit :: UnwindAssembly/x86/./UnwindAssemblyx86Tests/Testx86AssemblyInspectionEngine.TestPopEDI (1043 of 2087)
PASS: lldb-unit :: Symbol/./SymbolTests/Type.CompilerContextPattern (1044 of 2087)
UNSUPPORTED: lldb-api :: functionalities/data-formatter/data-formatter-stl/libstdcpp/list/TestDataFormatterStdList.py (1045 of 2087)
PASS: lldb-unit :: Utility/./UtilityTests/FileSpecTest.GuessPathStyle (1046 of 2087)
PASS: lldb-unit :: SymbolFile/NativePDB/./SymbolFileNativePDBTests/PDBFPOProgramToDWARFExpressionTests.UnresolvedCyclicRegisterAssignmentReference (1047 of 2087)
PASS: lldb-shell :: SymbolFile/DWARF/gnu-style-compression.cpp (1048 of 2087)
PASS: lldb-unit :: Utility/./UtilityTests/DataExtractorTest.GetDouble (1049 of 2087)
PASS: lldb-api :: lang/c/blocks/TestBlocks.py (1050 of 2087)
PASS: lldb-api :: functionalities/data-formatter/setvaluefromcstring/TestSetValueFromCString.py (1051 of 2087)
PASS: lldb-unit :: Utility/./UtilityTests/LogChannelTest.EnableOptions (1052 of 2087)
PASS: lldb-unit :: SymbolFile/NativePDB/./SymbolFileNativePDBTests/PDBFPOProgramToDWARFExpressionTests.InvalidOpUnary (1053 of 2087)
PASS: lldb-unit :: Utility/./UtilityTests/StringExtractorTest.DecodeHexU8_Exact (1054 of 2087)
PASS: lldb-unit :: Utility/./UtilityTests/RangeDataVector.CustomSort (1055 of 2087)
PASS: lldb-unit :: Target/./TargetTests/ModuleCacheTest.GetAndPutUuidExists (1056 of 2087)
UNSUPPORTED: lldb-shell :: Register/x86-64-ymm16-read.test (1057 of 2087)
PASS: lldb-unit :: Utility/./UtilityTests/SerializationRountripTest.SerializeDeserializePod (1058 of 2087)
PASS: lldb-unit :: Utility/./UtilityTests/ArchSpecTest.TestParseMachCPUDashSubtypeTripleExtra (1059 of 2087)
PASS: lldb-api :: functionalities/thread/concurrent_events/TestConcurrentCrashWithBreak.py (1060 of 2087)
PASS: lldb-unit :: Utility/./UtilityTests/StreamTest.ChangingByteOrder (1061 of 2087)
PASS: lldb-unit :: Symbol/./SymbolTests/TestTypeSystemClang.TestRemoveFastQualifiers (1062 of 2087)
PASS: lldb-api :: functionalities/postmortem/netbsd-core/TestNetBSDCore.py (1063 of 2087)
PASS: lldb-shell :: ObjectFile/ELF/PT_LOAD-empty.yaml (1064 of 2087)
PASS: lldb-shell :: SymbolFile/DWARF/find-variable-file.cpp (1065 of 2087)
PASS: lldb-api :: iohandler/resize/TestIOHandlerResizeNoEditline.py (1066 of 2087)
PASS: lldb-shell :: SymbolFile/NativePDB/globals-bss.cpp (1067 of 2087)
PASS: lldb-shell :: Minidump/Windows/arm-fp-unwind.test (1068 of 2087)
PASS: lldb-shell :: ObjectFile/ELF/basic-info.yaml (1069 of 2087)
PASS: lldb-unit :: Process/minidump/./LLDBMinidumpTests/MinidumpParserTest.FindMemoryRange (1070 of 2087)
PASS: lldb-api :: lang/cpp/thread_local/TestThreadLocal.py (1071 of 2087)
PASS: lldb-unit :: Target/./TargetTests/MemoryRegionInfoTest.Formatv (1072 of 2087)
PASS: lldb-unit :: Utility/./UtilityTests/StringExtractorTest.GetHexBytesAvail_OddPair2 (1073 of 2087)
PASS: lldb-api :: commands/settings/use_source_cache/TestUseSourceCache.py (1074 of 2087)
PASS: lldb-unit :: UnwindAssembly/x86/./UnwindAssemblyx86Tests/Testx86AssemblyInspectionEngine.TestSpArithx86_64Augmented (1075 of 2087)
PASS: lldb-unit :: Expression/./ExpressionTests/CppModuleConfigurationTest.AmbiguousLibCpp (1076 of 2087)
UNSUPPORTED: lldb-shell :: ScriptInterpreter/Lua/command_script_import.test (1077 of 2087)
PASS: lldb-unit :: Utility/./UtilityTests/StringLexerTest.NextIf (1078 of 2087)
UNSUPPORTED: lldb-api :: benchmarks/expression/TestExpressionCmd.py (1079 of 2087)
PASS: lldb-unit :: Utility/./UtilityTests/RangeDataVector.FindEntryThatContains (1080 of 2087)
PASS: lldb-shell :: SymbolFile/DWARF/debug_loc_and_loclists.s (1081 of 2087)
PASS: lldb-unit :: Utility/./UtilityTests/BinaryStreamTest.PutULEB128One (1082 of 2087)
PASS: lldb-unit :: Breakpoint/./LLDBBreakpointTests/BreakpointIDTest.StringIsBreakpointName (1083 of 2087)
PASS: lldb-unit :: Process/minidump/./LLDBMinidumpTests/MinidumpParserTest.GetThreadContext_x86_32_wow64 (1084 of 2087)
PASS: lldb-unit :: Host/./HostTests/FileSystemTest.Readable (1085 of 2087)
PASS: lldb-unit :: Symbol/./SymbolTests/TestTypeSystemClang.TestGetTypeClassNested (1086 of 2087)
UNSUPPORTED: lldb-api :: tools/lldb-vscode/disconnect/TestVSCode_disconnect.py (1087 of 2087)
PASS: lldb-unit :: ScriptInterpreter/Python/./ScriptInterpreterPythonTests/PythonDataObjectsTest.TestPythonCallableInvoke (1088 of 2087)
PASS: lldb-api :: functionalities/reproducers/attach/TestReproducerAttach.py (1089 of 2087)
PASS: lldb-unit :: Language/Highlighting/./HighlighterTests/HighlighterTest.ClangCursorPosInOtherToken (1090 of 2087)
PASS: lldb-unit :: Symbol/./SymbolTests/TestTypeSystemClang.TestFunctionTemplateConstruction (1091 of 2087)
XFAIL: lldb-shell :: Register/x86-64-ymm-write.test (1092 of 2087)
PASS: lldb-unit :: Utility/./UtilityTests/StringListTest.LongestCommonPrefixEmpty (1093 of 2087)
PASS: lldb-unit :: Utility/./UtilityTests/ProcessInstanceInfo.DumpTable_invalidUID (1094 of 2087)
PASS: lldb-unit :: Utility/./UtilityTests/StringExtractorTest.DecodeHexU8_Underflow2 (1095 of 2087)
PASS: lldb-api :: commands/frame/diagnose/dereference-argument/TestDiagnoseDereferenceArgument.py (1096 of 2087)
PASS: lldb-unit :: Symbol/./SymbolTests/TestClangASTImporter.CopyDeclTagDecl (1097 of 2087)
PASS: lldb-unit :: ScriptInterpreter/Python/./ScriptInterpreterPythonTests/PythonDataObjectsTest.TestPythonTupleInitializerList2 (1098 of 2087)
PASS: lldb-shell :: Reproducer/TestWorkingDir.test (1099 of 2087)
PASS: lldb-unit :: Utility/./UtilityTests/BinaryStreamTest.PutULEB128SixBytes (1100 of 2087)
PASS: lldb-api :: functionalities/data-formatter/data-formatter-objc/TestDataFormatterObjCNSError.py (1101 of 2087)
UNSUPPORTED: lldb-api :: functionalities/darwin_log/source/info/TestDarwinLogSourceInfo.py (1102 of 2087)
PASS: lldb-unit :: Process/minidump/./LLDBMinidumpTests/MinidumpParserTest.GetPidWow64 (1103 of 2087)
PASS: lldb-api :: functionalities/data-formatter/data-formatter-objc/TestDataFormatterObjCNSContainer.py (1104 of 2087)
PASS: lldb-shell :: Commands/command-regex-unalias.test (1105 of 2087)
UNSUPPORTED: lldb-shell :: SymbolFile/PDB/pointers.test (1106 of 2087)
PASS: lldb-api :: functionalities/thread/concurrent_events/TestConcurrentBreakpointDelayBreakpointOneSignal.py (1107 of 2087)
PASS: lldb-api :: functionalities/data-formatter/hexcaps/TestDataFormatterHexCaps.py (1108 of 2087)
UNSUPPORTED: lldb-api :: functionalities/darwin_log/filter/exact_match/category/TestDarwinLogFilterMatchCategory.py (1109 of 2087)
UNSUPPORTED: lldb-shell :: Breakpoint/case-insensitive.test (1110 of 2087)
PASS: lldb-shell :: SymbolFile/DWARF/DW_OP_piece-smaller-than-struct.s (1111 of 2087)
UNSUPPORTED: lldb-api :: functionalities/darwin_log/filter/regex/subsystem/TestDarwinLogFilterRegexSubsystem.py (1112 of 2087)
PASS: lldb-unit :: Host/./HostTests/FileSystemTest.GetByteSize (1113 of 2087)
PASS: lldb-unit :: Utility/./UtilityTests/RangeTest.SetRangeBase (1114 of 2087)
PASS: lldb-shell :: SymbolFile/DWARF/limit-debug-info.s (1115 of 2087)
PASS: lldb-unit :: Utility/./UtilityTests/ConstStringTest.UpdateMangledCounterpart (1116 of 2087)
PASS: lldb-api :: functionalities/data-formatter/data-formatter-stl/libcxx/initializerlist/TestInitializerList.py (1117 of 2087)
PASS: lldb-unit :: Utility/./UtilityTests/VASprintfTest.NoBufferResize (1118 of 2087)
PASS: lldb-api :: commands/expression/import-std-module/vector-dbg-info-content/TestDbgInfoContentVectorFromStdModule.py (1119 of 2087)
PASS: lldb-unit :: Utility/./UtilityTests/StreamTest.PutBytesAsRawHex8ToLittleEndian (1120 of 2087)
PASS: lldb-api :: functionalities/data-formatter/data-formatter-objc/nsstring/TestDataFormatterNSString.py (1121 of 2087)
PASS: lldb-api :: lang/cpp/function_refs/TestFunctionRefs.py (1122 of 2087)
PASS: lldb-shell :: Commands/command-disassemble-process.yaml (1123 of 2087)
PASS: lldb-unit :: Utility/./UtilityTests/StringListTest.ForRange (1124 of 2087)
PASS: lldb-api :: functionalities/data-formatter/data-formatter-stl/libcxx/vbool/TestDataFormatterLibcxxVBool.py (1125 of 2087)
PASS: lldb-unit :: UnwindAssembly/x86/./UnwindAssemblyx86Tests/Testx86AssemblyInspectionEngine.TestPopR14 (1126 of 2087)
UNSUPPORTED: lldb-api :: functionalities/darwin_log/basic/TestDarwinLogBasic.py (1127 of 2087)
PASS: lldb-unit :: UnwindAssembly/x86/./UnwindAssemblyx86Tests/Testx86AssemblyInspectionEngine.TestDisassemblyJunkBytes (1128 of 2087)
PASS: lldb-api :: functionalities/step-avoids-no-debug/TestStepNoDebug.py (1129 of 2087)
PASS: lldb-unit :: Utility/./UtilityTests/UUIDTest.StringConverion (1130 of 2087)
PASS: lldb-api :: functionalities/thread/concurrent_events/TestConcurrentWatchpointDelayWatchpointOneBreakpoint.py (1131 of 2087)
PASS: lldb-unit :: Utility/./UtilityTests/RecordReplayTest.InstrumentedFoo (1132 of 2087)
PASS: lldb-unit :: Utility/./UtilityTests/SharedCluster.ClusterManager (1133 of 2087)
PASS: lldb-unit :: Process/minidump/./LLDBMinidumpTests/MinidumpParserTest.GetFilteredModuleList (1134 of 2087)
PASS: lldb-api :: commands/expression/import-std-module/shared_ptr-dbg-info-content/TestSharedPtrDbgInfoContentFromStdModule.py (1135 of 2087)
PASS: lldb-unit :: Utility/./UtilityTests/NameMatchesTest.Contains (1136 of 2087)
PASS: lldb-unit :: ScriptInterpreter/Python/./ScriptInterpreterPythonTests/PythonDataObjectsTest.TestResetting (1137 of 2087)
PASS: lldb-unit :: Utility/./UtilityTests/StreamTest.AddressSize (1138 of 2087)
PASS: lldb-unit :: Language/Highlighting/./HighlighterTests/HighlighterTest.ClangScalarLiterals (1139 of 2087)
PASS: lldb-shell :: SymbolFile/DWARF/debug_line-relative_path.s (1140 of 2087)
UNSUPPORTED: lldb-shell :: SymbolFile/PDB/function-level-linking.test (1141 of 2087)
PASS: lldb-shell :: SymbolFile/DWARF/debug-names-compressed.cpp (1142 of 2087)
PASS: lldb-unit :: ObjectFile/Breakpad/./ObjectFileBreakpadTests/InfoRecord.parse (1143 of 2087)
PASS: lldb-unit :: Utility/./UtilityTests/DataExtractorTest.GetCStrEmpty (1144 of 2087)
PASS: lldb-api :: functionalities/gdb_remote_client/TestIOSSimulator.py (1145 of 2087)
PASS: lldb-api :: functionalities/ubsan/basic/TestUbsanBasic.py (1146 of 2087)
PASS: lldb-api :: commands/expression/import-std-module/unique_ptr/TestUniquePtrFromStdModule.py (1147 of 2087)
PASS: lldb-unit :: Utility/./UtilityTests/OptionsWithRawTest.EmptySuffix (1148 of 2087)
PASS: lldb-api :: lang/cpp/dynamic-value/TestDynamicValue.py (1149 of 2087)
PASS: lldb-unit :: Utility/./UtilityTests/AnsiTerminal.Basic (1150 of 2087)
PASS: lldb-unit :: Utility/./UtilityTests/StreamTeeTest.DefaultConstructor (1151 of 2087)
PASS: lldb-unit :: Utility/./UtilityTests/StringListTest.GetMaxStringLengthEqualSize (1152 of 2087)
PASS: lldb-unit :: Utility/./UtilityTests/StreamTest.AddressRangeSize (1153 of 2087)
PASS: lldb-unit :: SymbolFile/DWARF/./SymbolFileDWARFTests/SymbolFileDWARFTests.TestAbbrevInvalidNULLTag (1154 of 2087)
PASS: lldb-api :: functionalities/data-formatter/data-formatter-stl/libcxx/function/TestLibCxxFunction.py (1155 of 2087)
PASS: lldb-unit :: Utility/./UtilityTests/UriParserTest.MinimalPath (1156 of 2087)
PASS: lldb-unit :: Utility/./UtilityTests/StringListTest.CopyList (1157 of 2087)
UNSUPPORTED: lldb-shell :: BuildScript/toolchain-msvc.test (1158 of 2087)
PASS: lldb-shell :: Process/TestEnvironment.test (1159 of 2087)
PASS: lldb-api :: commands/expression/import_base_class_when_class_has_derived_member/TestImportBaseClassWhenClassHasDerivedMember.py (1160 of 2087)
PASS: lldb-unit :: SymbolFile/NativePDB/./SymbolFileNativePDBTests/PDBFPOProgramToDWARFExpressionTests.MultipleIndependentAssignments (1161 of 2087)
PASS: lldb-unit :: Utility/./UtilityTests/BinaryStreamTest.PutSLEB128FourBytes (1162 of 2087)
PASS: lldb-unit :: Symbol/./SymbolTests/TestTypeSystemClang.TemplateArguments (1163 of 2087)
PASS: lldb-api :: functionalities/breakpoint/scripted_bkpt/TestScriptedResolver.py (1164 of 2087)
PASS: lldb-unit :: Utility/./UtilityTests/StringExtractorTest.GetHexBytes_OddPair2 (1165 of 2087)
PASS: lldb-unit :: Utility/./UtilityTests/ScalarTest.LongLongAssigmentOperator (1166 of 2087)
PASS: lldb-unit :: Utility/./UtilityTests/DataExtractorTest.UncommonAddressSize (1167 of 2087)
PASS: lldb-unit :: Utility/./UtilityTests/StringExtractorTest.GetHexU8_InvalidHex (1168 of 2087)
PASS: lldb-unit :: Utility/./UtilityTests/ArgsTest.TestAppendArg (1169 of 2087)
PASS: lldb-unit :: Utility/./UtilityTests/SerializationRountripTest.SerializeDeserializeCStringArrayNullptr (1170 of 2087)
UNSUPPORTED: lldb-shell :: SymbolFile/DWARF/split-dwarf-expression-eval-bug.cpp (1171 of 2087)
PASS: lldb-shell :: SymbolFile/DWARF/dir-separator-windows.s (1172 of 2087)
PASS: lldb-api :: lang/c/forward/TestForwardDeclaration.py (1173 of 2087)
PASS: lldb-unit :: Utility/./UtilityTests/StringExtractorTest.GetHexU8_Exact (1174 of 2087)
PASS: lldb-unit :: Utility/./UtilityTests/FileSpecTest.FormatFileSpec (1175 of 2087)
PASS: lldb-api :: functionalities/thread/concurrent_events/TestConcurrentBreakpointOneDelayBreakpointThreads.py (1176 of 2087)
PASS: lldb-unit :: Utility/./UtilityTests/OptionsWithRawTest.EmptyArgsOnlySuffix (1177 of 2087)
PASS: lldb-api :: lang/objcxx/objcxx-ivar-vector/TestIvarVector.py (1178 of 2087)
PASS: lldb-unit :: Expression/./ExpressionTests/CppModuleConfigurationTest.Linux (1179 of 2087)
PASS: lldb-unit :: UnwindAssembly/x86/./UnwindAssemblyx86Tests/Testx86AssemblyInspectionEngine.TestLEAVE (1180 of 2087)
PASS: lldb-unit :: UnwindAssembly/x86/./UnwindAssemblyx86Tests/Testx86AssemblyInspectionEngine.TestPopR13 (1181 of 2087)
PASS: lldb-api :: lang/objc/ivar-IMP/TestObjCiVarIMP.py (1182 of 2087)
TIMEOUT: lldb-api :: macosx/thread_suspend/TestInternalThreadSuspension.py (1183 of 2087)
******************** TEST 'lldb-api :: macosx/thread_suspend/TestInternalThreadSuspension.py' FAILED ********************
Script:
--
/usr/local/Frameworks/Python.framework/Versions/3.7/bin/python3.7 /Users/buildslave/jenkins/workspace/lldb-cmake/llvm-project/lldb/test/API/dotest.py --arch x86_64 -s /Users/buildslave/jenkins/workspace/lldb-cmake/lldb-build/lldb-test-traces -S nm -u CXXFLAGS -u CFLAGS --codesign-identity - --server /Users/buildslave/jenkins/workspace/lldb-cmake/lldb-build/./bin/debugserver --arch x86_64 --build-dir /Users/buildslave/jenkins/workspace/lldb-cmake/lldb-build/lldb-test-build.noindex -s=/Users/buildslave/jenkins/workspace/lldb-cmake/test/logs -t --env TERM=vt100 --env LLVM_LIBS_DIR=/Users/buildslave/jenkins/workspace/lldb-cmake/lldb-build/./lib --build-dir /Users/buildslave/jenkins/workspace/lldb-cmake/lldb-build/lldb-test-build.noindex --lldb-module-cache-dir /Users/buildslave/jenkins/workspace/lldb-cmake/lldb-build/lldb-test-build.noindex/module-cache-lldb/lldb-api --clang-module-cache-dir /Users/buildslave/jenkins/workspace/lldb-cmake/lldb-build/lldb-test-build.noindex/module-cache-clang/lldb-api --executable /Users/buildslave/jenkins/workspace/lldb-cmake/lldb-build/./bin/lldb --compiler /Users/buildslave/jenkins/workspace/lldb-cmake/lldb-build/./bin/clang --dsymutil /Users/buildslave/jenkins/workspace/lldb-cmake/lldb-build/./bin/dsymutil --filecheck /Users/buildslave/jenkins/workspace/lldb-cmake/lldb-build/./bin/FileCheck --yaml2obj /Users/buildslave/jenkins/workspace/lldb-cmake/lldb-build/./bin/yaml2obj --lldb-libs-dir /Users/buildslave/jenkins/workspace/lldb-cmake/lldb-build/./lib /Users/buildslave/jenkins/workspace/lldb-cmake/llvm-project/lldb/test/API/macosx/thread_suspend -p TestInternalThreadSuspension.py
--
Exit Code: -9
Timeout: Reached timeout of 600 seconds

Hide Details

Command Output (stdout): -- lldb version 11.0.99 clang revision 8a24208977c27d6ae891833b027471e187fe53a5 llvm revision 8a24208977c27d6ae891833b027471e187fe53a5

Hide Details

--

Hide Details

******************** PASS: lldb-api :: commands/expression/result_numbering/TestResultNumbering.py (1184 of 2087) UNSUPPORTED: lldb-api :: linux/add-symbols/TestTargetSymbolsAddCommand.py (1185 of 2087) PASS: lldb-shell :: SymbolFile/DWARF/debug-types-address-ranges.s (1186 of 2087) PASS: lldb-unit :: Utility/./UtilityTests/StreamTest.AddressPrefixAndSuffix (1187 of 2087) PASS: lldb-unit :: Process/minidump/./LLDBMinidumpTests/MinidumpParserTest.GetPidWindows (1188 of 2087) PASS: lldb-unit :: Utility/./UtilityTests/ScalarTest.Promotion (1189 of 2087) PASS: lldb-unit :: Expression/./ExpressionTests/DiagnosticManagerTest.PutStringSeverities (1190 of 2087) PASS: lldb-unit :: Utility/./UtilityTests/ScalarTest.GetBytes (1191 of 2087) PASS: lldb-api :: functionalities/tail_call_frames/inlining_and_tail_calls/TestInliningAndTailCalls.py (1192 of 2087) PASS: lldb-api :: lang/objc/objc-runtime-ivars/TestRuntimeIvars.py (1193 of 2087) PASS: lldb-unit :: tools/lldb-server/tests/./LLDBServerTests/TestBase.LaunchModePreservesEnvironment (1194 of 2087) PASS: lldb-unit :: Process/minidump/./LLDBMinidumpTests/MinidumpParserTest.GetLinuxProcStatus (1195 of 2087) PASS: lldb-api :: commands/watchpoints/watchpoint_disable/TestWatchpointDisable.py (1196 of 2087) PASS: lldb-api :: python_api/value/linked_list/TestValueAPILinkedList.py (1197 of 2087) UNSUPPORTED: lldb-shell :: Register/arm-fp-read.test (1198 of 2087) PASS: lldb-unit :: UnwindAssembly/x86/./UnwindAssemblyx86Tests/Testx86AssemblyInspectionEngine.TestPopR15 (1199 of 2087) PASS: lldb-api :: lang/cpp/overloaded-functions/TestOverloadedFunctions.py (1200 of 2087) PASS: lldb-api :: functionalities/data-formatter/data-formatter-objc/TestDataFormatterObjCNSDate.py (1201 of 2087) PASS: lldb-unit :: Utility/./UtilityTests/StringListTest.LongestCommonPrefix (1202 of 2087) PASS: lldb-api :: python_api/default-constructor/TestDefaultConstructorForAPIObjects.py (1203 of 2087) PASS: lldb-unit :: Utility/./UtilityTests/UUIDTest.SetFromStringRef (1204 of 2087) PASS: lldb-unit :: ScriptInterpreter/Python/./ScriptInterpreterPythonTests/PythonDataObjectsTest.TestPythonStringToStr (1205 of 2087) PASS: lldb-unit :: Utility/./UtilityTests/GeneratorTest.YamlMultiProvider (1206 of 2087) PASS: lldb-api :: commands/expression/persist_objc_pointeetype/TestPersistObjCPointeeType.py (1207 of 2087) PASS: lldb-shell :: SymbolFile/DWARF/find-method.cpp (1208 of 2087) PASS: lldb-api :: lang/objc/rdar-10967107/TestRdar10967107.py (1209 of 2087) PASS: lldb-unit :: Utility/./UtilityTests/StringListTest.SplitIntoLinesSingleTrailingCR (1210 of 2087) PASS: lldb-unit :: Language/Highlighting/./HighlighterTests/HighlighterTest.ClangIdentifiers (1211 of 2087) PASS: lldb-shell :: Unwind/trap_frame_sym_ctx.test (1212 of 2087) PASS: lldb-api :: functionalities/data-formatter/poarray/TestPrintObjectArray.py (1213 of 2087) PASS: lldb-shell :: Settings/TestLineMarkerColor.test (1214 of 2087) PASS: lldb-api :: functionalities/data-formatter/synthcapping/TestSyntheticCapping.py (1215 of 2087) PASS: lldb-api :: functionalities/pre_run_dylibs/TestPreRunDylibs.py (1216 of 2087) UNSUPPORTED: lldb-shell :: SymbolFile/DWARF/debug-types-expressions.test (1217 of 2087) PASS: lldb-api :: commands/version/TestVersion.py (1218 of 2087) PASS: lldb-unit :: Host/./HostTests/HostInfoTest.GetHostname (1219 of 2087) PASS: lldb-unit :: Utility/./UtilityTests/AnsiTerminal.Twice (1220 of 2087) PASS: lldb-unit :: UnwindAssembly/x86/./UnwindAssemblyx86Tests/Testx86AssemblyInspectionEngine.TestSimple32bitFrameFunction (1221 of 2087) PASS: lldb-unit :: Target/./TargetTests/ModuleCacheTest.GetAndPut (1222 of 2087) PASS: lldb-api :: functionalities/inferior-crashing/recursive-inferior/TestRecursiveInferior.py (1223 of 2087) PASS: lldb-api :: functionalities/data-formatter/data-formatter-objc/TestDataFormatterObjCExpr.py (1224 of 2087) XFAIL: lldb-shell :: Register/x86-mm-xmm-read.test (1225 of 2087) PASS: lldb-unit :: Host/./HostTests/MainLoopTest.UnmonitoredSignal (1226 of 2087) PASS: lldb-unit :: Process/minidump/./LLDBMinidumpTests/MinidumpParserTest.MinidumpDuplicateModuleMinAddress (1227 of 2087) PASS: lldb-shell :: Process/UnsupportedLanguage.test (1228 of 2087) PASS: lldb-shell :: SymbolFile/DWARF/module-ownership.mm (1229 of 2087) PASS: lldb-shell :: Driver/TestFile.test (1230 of 2087) PASS: lldb-unit :: Symbol/./SymbolTests/LineEntryTest.GetSameLineContiguousAddressRangeNestedInline (1231 of 2087) UNSUPPORTED: lldb-api :: functionalities/thread/state/TestThreadStates.py (1232 of 2087) PASS: lldb-unit :: Host/./HostTests/FileSystemTest.Resolve (1233 of 2087) PASS: lldb-unit :: Utility/./UtilityTests/Flags.IsClear (1234 of 2087) PASS: lldb-api :: lang/objc/objc-static-method-stripped/TestObjCStaticMethodStripped.py (1235 of 2087) PASS: lldb-api :: lang/objc/unicode-string/TestUnicodeString.py (1236 of 2087) PASS: lldb-unit :: Utility/./UtilityTests/ScalarTest.RightShiftOperator (1237 of 2087) PASS: lldb-api :: functionalities/thread/exit_during_expression/TestExitDuringExpression.py (1238 of 2087) PASS: lldb-shell :: SymbolFile/DWARF/find-basic-function.cpp (1239 of 2087) PASS: lldb-unit :: Process/gdb-remote/./ProcessGdbRemoteTests/GDBRemoteCommunicationClientTest.TestPacketSpeedJSON (1240 of 2087) PASS: lldb-unit :: ScriptInterpreter/Python/./ScriptInterpreterPythonTests/PythonDataObjectsTest.TestGlobalNameResolutionNoDot (1241 of 2087) PASS: lldb-unit :: Expression/./ExpressionTests/DiagnosticManagerTest.GetStringBasic (1242 of 2087) PASS: lldb-unit :: Utility/./UtilityTests/VASprintfTest.BufferResize (1243 of 2087) PASS: lldb-unit :: Utility/./UtilityTests/StringExtractorTest.GetHexBytesAvail (1244 of 2087) UNSUPPORTED: lldb-shell :: SymbolFile/PDB/udt-layout.test (1245 of 2087) PASS: lldb-unit :: Utility/./UtilityTests/SerializationRountripTest.SerializeDeserializeCStringArray (1246 of 2087) PASS: lldb-api :: functionalities/unwind/noreturn/TestNoreturnUnwind.py (1247 of 2087) PASS: lldb-unit :: Host/./HostTests/MainLoopTest.Signal (1248 of 2087) PASS: lldb-unit :: Utility/./UtilityTests/SerializationRountripTest.SerializeDeserializePodPointers (1249 of 2087) PASS: lldb-unit :: Utility/./UtilityTests/ListenerTest.GetEventWait (1250 of 2087) PASS: lldb-shell :: Reproducer/TestDiscard.test (1251 of 2087) PASS: lldb-unit :: Process/gdb-remote/./ProcessGdbRemoteTests/GDBRemoteCommunicationClientTest.GetModulesInfo_UUID20 (1252 of 2087) PASS: lldb-api :: functionalities/data-formatter/data-formatter-stl/libcxx/forward_list/TestDataFormatterLibcxxForwardList.py (1253 of 2087) PASS: lldb-shell :: Heap/heap-cstr.test (1254 of 2087) PASS: lldb-unit :: Symbol/./SymbolTests/TestTypeSystemClang.TestConvertAccessTypeToAccessSpecifier (1255 of 2087) PASS: lldb-unit :: SymbolFile/DWARF/./SymbolFileDWARFTests/SymbolFileDWARFTests.TestAbbrevOutOfOrder (1256 of 2087) PASS: lldb-unit :: Utility/./UtilityTests/Flags.Reset (1257 of 2087) PASS: lldb-api :: lang/objc/single-entry-dictionary/TestObjCSingleEntryDictionary.py (1258 of 2087) PASS: lldb-unit :: SymbolFile/DWARF/./SymbolFileDWARFTests/SymbolFileDWARFTests.ParseArangesNonzeroSegmentSize (1259 of 2087) PASS: lldb-unit :: Utility/./UtilityTests/ArchSpecTest.OperatorBool (1260 of 2087) PASS: lldb-api :: lang/objcxx/cxx-bridged-po/TestObjCXXBridgedPO.py (1261 of 2087) PASS: lldb-api :: functionalities/thread/num_threads/TestNumThreads.py (1262 of 2087) PASS: lldb-api :: commands/command/script/import/rdar-12586188/TestRdar12586188.py (1263 of 2087) PASS: lldb-api :: python_api/symbol-context/two-files/TestSymbolContextTwoFiles.py (1264 of 2087) PASS: lldb-api :: functionalities/data-formatter/var-in-aggregate-misuse/TestVarInAggregateMisuse.py (1265 of 2087) PASS: lldb-unit :: Expression/./ExpressionTests/DWARFExpression.DW_OP_unknown (1266 of 2087) PASS: lldb-api :: functionalities/asan/TestMemoryHistory.py (1267 of 2087) PASS: lldb-unit :: Utility/./UtilityTests/StreamTest.PutRawBytesToLittleEndian (1268 of 2087) PASS: lldb-unit :: UnwindAssembly/x86/./UnwindAssemblyx86Tests/Testx86AssemblyInspectionEngine.TestCALLNextInsn (1269 of 2087) PASS: lldb-unit :: Utility/./UtilityTests/StreamTest.PutCharWhitespace (1270 of 2087) PASS: lldb-unit :: Instruction/./EmulatorTests/TestAArch64Emulator.TestOverflow (1271 of 2087) PASS: lldb-api :: functionalities/thread/state_after_expression/TestStateAfterExpression.py (1272 of 2087) PASS: lldb-api :: functionalities/tail_call_frames/cross_dso/TestCrossDSOTailCalls.py (1273 of 2087) PASS: lldb-unit :: Expression/./ExpressionTests/ClangHostTest.ComputeClangResourceDirectory (1274 of 2087) PASS: lldb-api :: functionalities/breakpoint/dummy_target_breakpoints/TestBreakpointsWithNoTargets.py (1275 of 2087) PASS: lldb-api :: api/listeners/TestListener.py (1276 of 2087) PASS: lldb-unit :: Utility/./UtilityTests/CompletionRequest.ShiftArguments (1277 of 2087) PASS: lldb-unit :: Thread/./ThreadTests/ThreadTest.GetPrivateStopInfo (1278 of 2087) UNSUPPORTED: lldb-shell :: ScriptInterpreter/Lua/quit.test (1279 of 2087) PASS: lldb-unit :: Language/Highlighting/./HighlighterTests/HighlighterTest.ClangTrailingBackslashBeforeNewline (1280 of 2087) PASS: lldb-api :: lang/c/global_variables/TestGlobalVariables.py (1281 of 2087) PASS: lldb-shell :: ScriptInterpreter/Python/sb_address_exception.test (1282 of 2087) PASS: lldb-unit :: Utility/./UtilityTests/TimeoutTest.Format (1283 of 2087) PASS: lldb-api :: functionalities/memory-region/TestMemoryRegion.py (1284 of 2087) PASS: lldb-api :: functionalities/breakpoint/breakpoint_by_line_and_column/TestBreakpointByLineAndColumn.py (1285 of 2087) UNSUPPORTED: lldb-api :: lang/c/unicode/TestUnicodeSymbols.py (1286 of 2087) PASS: lldb-api :: python_api/watchpoint/watchlocation/TestTargetWatchAddress.py (1287 of 2087) PASS: lldb-unit :: Expression/./ExpressionTests/CppModuleConfigurationTest.AmbiguousCLib (1288 of 2087) PASS: lldb-unit :: ScriptInterpreter/Python/./ScriptInterpreterPythonTests/PythonDataObjectsTest.TestCallable (1289 of 2087) PASS: lldb-unit :: UnwindAssembly/PPC64/./PPC64InstEmulationTests/TestPPC64InstEmulation.TestMediumFunction (1290 of 2087) PASS: lldb-unit :: Process/gdb-remote/./ProcessGdbRemoteTests/GDBRemoteCommunicationClientTest.SendSignalsToIgnore (1291 of 2087) PASS: lldb-api :: functionalities/process_group/TestChangeProcessGroup.py (1292 of 2087) PASS: lldb-api :: functionalities/set-data/TestSetData.py (1293 of 2087) PASS: lldb-shell :: ObjectFile/MachO/symtab.yaml (1294 of 2087) PASS: lldb-shell :: SymbolFile/DWARF/debug-line-basic.s (1295 of 2087) PASS: lldb-api :: python_api/disassemble-raw-data/TestDisassemble_VST1_64.py (1296 of 2087) PASS: lldb-unit :: Utility/./UtilityTests/StreamTest.PutSLEB128 (1297 of 2087) PASS: lldb-unit :: Utility/./UtilityTests/BinaryStreamTest.PutSLEB128ThreeBytes (1298 of 2087) PASS: lldb-unit :: Utility/./UtilityTests/UUIDTest.Validity (1299 of 2087) XFAIL: lldb-shell :: Register/x86-mm-xmm-write.test (1300 of 2087) PASS: lldb-api :: commands/expression/import-std-module/conflicts/TestStdModuleWithConflicts.py (1301 of 2087) PASS: lldb-api :: macosx/lc-note/kern-ver-str/TestKernVerStrLCNOTE.py (1302 of 2087) PASS: lldb-api :: lang/objc/conflicting-definition/TestConflictingDefinition.py (1303 of 2087) PASS: lldb-api :: functionalities/thread/concurrent_events/TestConcurrentDelayedCrashWithBreakpointWatchpoint.py (1304 of 2087) PASS: lldb-api :: functionalities/type_lookup/TestTypeLookup.py (1305 of 2087) PASS: lldb-unit :: Utility/./UtilityTests/FileSpecTest.CopyByAppendingPathComponent (1306 of 2087) PASS: lldb-unit :: Utility/./UtilityTests/XcodeSDKTest.MergeTest (1307 of 2087) PASS: lldb-api :: python_api/watchpoint/condition/TestWatchpointConditionAPI.py (1308 of 2087) PASS: lldb-api :: commands/expression/call-function/TestCallStopAndContinue.py (1309 of 2087) PASS: lldb-unit :: Utility/./UtilityTests/BinaryStreamTest.PutSLEB128EightBytes (1310 of 2087) PASS: lldb-api :: lang/cpp/operator-overload/TestOperatorOverload.py (1311 of 2087) PASS: lldb-api :: python_api/get-value-32bit-int/TestGetValue32BitInt.py (1312 of 2087) PASS: lldb-shell :: SymbolFile/Breakpad/stack-cfi-parsing.test (1313 of 2087) PASS: lldb-api :: lang/cpp/unicode-literals/TestUnicodeLiterals.py (1314 of 2087) PASS: lldb-unit :: Process/gdb-remote/./ProcessGdbRemoteTests/GDBRemoteCommunicationClientTest.GetMemoryRegionInfo (1315 of 2087) PASS: lldb-api :: functionalities/gdb_remote_client/TestThreadSelectionBug.py (1316 of 2087) PASS: lldb-api :: commands/process/attach/TestProcessAttach.py (1317 of 2087) PASS: lldb-shell :: Host/TestCustomShell.test (1318 of 2087) PASS: lldb-unit :: Utility/./UtilityTests/RangeTest.Union (1319 of 2087) PASS: lldb-api :: lang/cpp/class-template-parameter-pack/TestClassTemplateParameterPack.py (1320 of 2087) PASS: lldb-unit :: UnwindAssembly/PPC64/./PPC64InstEmulationTests/TestPPC64InstEmulation.TestSimpleFunction (1321 of 2087) PASS: lldb-api :: python_api/lldbutil/iter/TestLLDBIterator.py (1322 of 2087) PASS: lldb-api :: commands/expression/namespace_local_var_same_name_obj_c/TestNamespaceLocalVarSameNameObjC.py (1323 of 2087) PASS: lldb-api :: functionalities/abbreviation/TestCommonShortSpellings.py (1324 of 2087) PASS: lldb-api :: functionalities/thread/concurrent_events/TestConcurrentManyBreakpoints.py (1325 of 2087) PASS: lldb-unit :: Utility/./UtilityTests/FileSpecTest.OperatorBool (1326 of 2087) PASS: lldb-unit :: Process/gdb-remote/./ProcessGdbRemoteTests/GDBRemoteCommunicationServerTest.SendErrorResponse_UnimplementedError (1327 of 2087) PASS: lldb-shell :: Driver/TestConvenienceVariables.test (1328 of 2087) PASS: lldb-api :: lang/objc/modules/TestObjCModules.py (1329 of 2087) PASS: lldb-unit :: Utility/./UtilityTests/Flags.AnyClear (1330 of 2087) PASS: lldb-api :: commands/expression/import-std-module/forward_list-dbg-info-content/TestDbgInfoContentForwardListFromStdModule.py (1331 of 2087) PASS: lldb-api :: functionalities/thread/crash_during_step/TestCrashDuringStep.py (1332 of 2087) PASS: lldb-unit :: UnwindAssembly/ARM64/./Arm64InstEmulationTests/TestArm64InstEmulation.TestMediumDarwinFunction (1333 of 2087) PASS: lldb-shell :: Reproducer/TestPythonImport.test (1334 of 2087) PASS: lldb-api :: functionalities/breakpoint/breakpoint_command/TestBreakpointCommand.py (1335 of 2087) PASS: lldb-unit :: Process/./ProcessEventDataTests/ProcessEventDataTest.DoOnRemoval (1336 of 2087) PASS: lldb-unit :: Process/gdb-remote/./ProcessGdbRemoteTests/GDBRemoteCommunicationClientTest.SendStartTracePacket (1337 of 2087) PASS: lldb-api :: functionalities/postmortem/elf-core/gcore/TestGCore.py (1338 of 2087) PASS: lldb-api :: commands/platform/process/list/TestProcessList.py (1339 of 2087) PASS: lldb-api :: functionalities/data-formatter/data-formatter-named-summaries/TestDataFormatterNamedSummaries.py (1340 of 2087) PASS: lldb-shell :: ObjectFile/ELF/PT_LOAD.yaml (1341 of 2087) PASS: lldb-unit :: Host/./HostTests/MainLoopTest.ReadObject (1342 of 2087) PASS: lldb-api :: lang/objc/modules-inline-functions/TestModulesInlineFunctions.py (1343 of 2087) PASS: lldb-unit :: Process/gdb-remote/./ProcessGdbRemoteTests/GDBRemoteCommunicationClientTest.SaveRestoreRegistersNoSuffix (1344 of 2087) PASS: lldb-unit :: Utility/./UtilityTests/RangeDataVector.FindEntryIndexesThatContain (1345 of 2087) UNSUPPORTED: lldb-shell :: SymbolFile/PDB/func-symbols.test (1346 of 2087) PASS: lldb-unit :: Utility/./UtilityTests/ArgsTest.TestSingleArg (1347 of 2087) PASS: lldb-api :: python_api/interpreter/TestRunCommandInterpreterAPI.py (1348 of 2087) PASS: lldb-unit :: Utility/./UtilityTests/FileSpecTest.Equal (1349 of 2087) PASS: lldb-api :: tools/lldb-server/TestLldbGdbServer.py (1350 of 2087) PASS: lldb-unit :: UnwindAssembly/x86/./UnwindAssemblyx86Tests/Testx86AssemblyInspectionEngine.Test32BitOnlyInstruction (1351 of 2087) PASS: lldb-unit :: Utility/./UtilityTests/StringListTest.AppendStringMove (1352 of 2087) PASS: lldb-api :: functionalities/data-formatter/data-formatter-objc/TestDataFormatterObjCPlain.py (1353 of 2087) PASS: lldb-api :: functionalities/data-formatter/varscript_formatting/TestDataFormatterVarScriptFormatting.py (1354 of 2087) PASS: lldb-api :: lang/c/find_struct_type/TestFindStructTypes.py (1355 of 2087) PASS: lldb-unit :: Utility/./UtilityTests/DeserializerTest.HasData (1356 of 2087) PASS: lldb-unit :: Utility/./UtilityTests/XcodeSDKTest.SDKSupportsModules (1357 of 2087) PASS: lldb-api :: commands/expression/formatters/TestFormatters.py (1358 of 2087) PASS: lldb-unit :: Utility/./UtilityTests/ProcessInstanceInfoList.Yaml (1359 of 2087) UNSUPPORTED: lldb-api :: arm/breakpoint-thumb-codesection/TestBreakpointThumbCodesection.py (1360 of 2087) PASS: lldb-api :: lang/c/inlines/TestRedefinitionsInInlines.py (1361 of 2087) PASS: lldb-api :: commands/platform/file/read/TestPlatformFileRead.py (1362 of 2087) PASS: lldb-api :: lang/objc/objc-foundation-dictionary-empty/TestNSDictionary0.py (1363 of 2087) PASS: lldb-api :: functionalities/data-formatter/data-formatter-caching/TestDataFormatterCaching.py (1364 of 2087) PASS: lldb-shell :: SymbolFile/NativePDB/global-classes.cpp (1365 of 2087) UNSUPPORTED: lldb-api :: functionalities/thread/concurrent_events/TestConcurrentManySignals.py (1366 of 2087) PASS: lldb-api :: functionalities/breakpoint/global_constructor/TestBreakpointInGlobalConstructor.py (1367 of 2087) PASS: lldb-api :: python_api/process/read-mem-cstring/TestReadMemCString.py (1368 of 2087) PASS: lldb-shell :: Breakpoint/debug_rnglist_basic.test (1369 of 2087) PASS: lldb-api :: commands/command/source/TestCommandSource.py (1370 of 2087) PASS: lldb-unit :: Utility/./UtilityTests/RecordReplayTest.InstrumentedBar (1371 of 2087) PASS: lldb-shell :: SymbolFile/DWARF/debug_ranges.s (1372 of 2087) PASS: lldb-api :: commands/expression/import-std-module/vector-of-vectors/TestVectorOfVectorsFromStdModule.py (1373 of 2087) PASS: lldb-unit :: debugserver/./debugserverTests/RNBSocket.LoopBackListenIPv4 (1374 of 2087) UNSUPPORTED: lldb-shell :: Register/x86-64-ymm16-write.test (1375 of 2087) PASS: lldb-api :: python_api/formatters/TestFormattersSBAPI.py (1376 of 2087) PASS: lldb-shell :: ObjectFile/ELF/build-id-case.yaml (1377 of 2087) PASS: lldb-api :: functionalities/data-formatter/data-formatter-synthtype/TestDataFormatterSynthType.py (1378 of 2087) PASS: lldb-api :: functionalities/postmortem/minidump-new/TestMiniDumpUUID.py (1379 of 2087) PASS: lldb-unit :: UnwindAssembly/x86/./UnwindAssemblyx86Tests/Testx86AssemblyInspectionEngine.TestPopEBX (1380 of 2087) PASS: lldb-api :: lang/cpp/lambdas/TestLambdas.py (1381 of 2087) PASS: lldb-api :: commands/target/stop-hook/enable/TestTargetStopHookEnable.py (1382 of 2087) UNSUPPORTED: lldb-shell :: Register/x86-ymm-write.test (1383 of 2087) PASS: lldb-api :: functionalities/breakpoint/objc/TestObjCBreakpoints.py (1384 of 2087) PASS: lldb-unit :: Utility/./UtilityTests/ConstStringTest.CompareStringRef (1385 of 2087) PASS: lldb-unit :: Utility/./UtilityTests/StreamTest.PutCString (1386 of 2087) PASS: lldb-unit :: ScriptInterpreter/Python/./ScriptInterpreterPythonTests/PythonDataObjectsTest.TestPythonDictionaryToStructuredDictionary (1387 of 2087) PASS: lldb-api :: functionalities/data-formatter/data-formatter-skip-summary/TestDataFormatterSkipSummary.py (1388 of 2087) PASS: lldb-unit :: Utility/./UtilityTests/StringExtractorTest.GetHexU8_InvalidHex_NoEof (1389 of 2087) PASS: lldb-api :: python_api/disassemble-raw-data/TestDisassembleRawData.py (1390 of 2087) PASS: lldb-api :: functionalities/data-formatter/user-format-vs-summary/TestUserFormatVsSummary.py (1391 of 2087) PASS: lldb-unit :: ScriptInterpreter/Python/./ScriptInterpreterPythonTests/PythonDataObjectsTest.TestPythonBytes (1392 of 2087) PASS: lldb-api :: python_api/sbvalue_persist/TestSBValuePersist.py (1393 of 2087) PASS: lldb-api :: macosx/dyld-trie-symbols/TestDyldTrieSymbols.py (1394 of 2087) PASS: lldb-api :: macosx/order/TestOrderFile.py (1395 of 2087) PASS: lldb-api :: lang/objc/objc-stepping/TestObjCStepping.py (1396 of 2087) PASS: lldb-api :: functionalities/data-formatter/data-formatter-objc/TestDataFormatterObjCKVO.py (1397 of 2087) PASS: lldb-unit :: ObjectFile/ELF/./ObjectFileELFTests/ObjectFileELFTest.GetSymtab_NoSymEntryPointArmAddressClass (1398 of 2087) PASS: lldb-unit :: Utility/./UtilityTests/OptionsWithRawTest.TerminatedQuote (1399 of 2087) PASS: lldb-unit :: Utility/./UtilityTests/StringLexerTest.NextIfList (1400 of 2087) PASS: lldb-shell :: Breakpoint/jitbp_elf.test (1401 of 2087) PASS: lldb-unit :: Utility/./UtilityTests/VMRange.ContainsAddr (1402 of 2087) PASS: lldb-unit :: Target/./TargetTests/ModuleCacheTest.GetAndPutStrangeHostname (1403 of 2087) PASS: lldb-unit :: Process/minidump/./LLDBMinidumpTests/RegisterContextMinidump.CheckRegisterContextMinidump_ARM (1404 of 2087) PASS: lldb-api :: functionalities/thread/backtrace_all/TestBacktraceAll.py (1405 of 2087) PASS: lldb-unit :: ObjectFile/Breakpad/./ObjectFileBreakpadTests/FuncRecord.parse (1406 of 2087) PASS: lldb-api :: functionalities/optimized_code/TestNoASanExceptionAfterEvalOP_piece.py (1407 of 2087) PASS: lldb-shell :: SymbolFile/DWARF/find-basic-variable.cpp (1408 of 2087) PASS: lldb-shell :: SymbolFile/NativePDB/disassembly.cpp (1409 of 2087) PASS: lldb-api :: lang/cpp/auto/TestCPPAuto.py (1410 of 2087) PASS: lldb-unit :: Utility/./UtilityTests/NameMatchesTest.Equals (1411 of 2087) PASS: lldb-unit :: Utility/./UtilityTests/GeneratorTest.Get (1412 of 2087) PASS: lldb-api :: macosx/version_zero/TestGetVersionZeroVersion.py (1413 of 2087) PASS: lldb-shell :: Commands/command-thread-select.test (1414 of 2087) PASS: lldb-api :: lang/objc/objc-builtin-types/TestObjCBuiltinTypes.py (1415 of 2087) PASS: lldb-api :: types/TestShortTypeExpr.py (1416 of 2087) PASS: lldb-unit :: Utility/./UtilityTests/StreamTest.PutBytesAsRawHex8ToMixedEndian (1417 of 2087) PASS: lldb-api :: functionalities/thread/concurrent_events/TestConcurrentSignalWatchBreak.py (1418 of 2087) PASS: lldb-api :: functionalities/recursion/TestValueObjectRecursion.py (1419 of 2087) PASS: lldb-api :: commands/expression/import-std-module/no-std-module/TestMissingStdModule.py (1420 of 2087) PASS: lldb-api :: tools/lldb-vscode/step/TestVSCode_step.py (1421 of 2087) PASS: lldb-api :: functionalities/thread/concurrent_events/TestConcurrentSignalDelayBreak.py (1422 of 2087) PASS: lldb-api :: commands/watchpoints/watchpoint_size/TestWatchpointSizes.py (1423 of 2087) PASS: lldb-api :: lang/cpp/accelerator-table/TestCPPAccelerator.py (1424 of 2087) PASS: lldb-unit :: Utility/./UtilityTests/StreamTest.QuotedCString (1425 of 2087) PASS: lldb-api :: functionalities/gdb_remote_client/TestTargetXMLArch.py (1426 of 2087) PASS: lldb-unit :: Utility/./UtilityTests/ArgsTest.GetArgumentArrayRef (1427 of 2087) PASS: lldb-unit :: Utility/./UtilityTests/RangeTest.Equal (1428 of 2087) PASS: lldb-api :: functionalities/tail_call_frames/ambiguous_tail_call_seq1/TestAmbiguousTailCallSeq1.py (1429 of 2087) PASS: lldb-api :: lang/objc/foundation/TestConstStrings.py (1430 of 2087) PASS: lldb-unit :: Utility/./UtilityTests/StreamTest.PutChar (1431 of 2087) PASS: lldb-unit :: Utility/./UtilityTests/RangeTest.LessThanInvalid (1432 of 2087) PASS: lldb-api :: functionalities/mtc/simple/TestMTCSimple.py (1433 of 2087) UNSUPPORTED: lldb-api :: lang/objc/bitfield_ivars/TestBitfieldIvars.py (1434 of 2087) PASS: lldb-unit :: ScriptInterpreter/Python/./ScriptInterpreterPythonTests/PythonDataObjectsTest.TestPythonTupleInitializerList (1435 of 2087) PASS: lldb-api :: lang/cpp/template/TestTemplateArgs.py (1436 of 2087) PASS: lldb-api :: functionalities/asan/TestReportData.py (1437 of 2087) UNSUPPORTED: lldb-shell :: BuildScript/toolchain-clang-cl.test (1438 of 2087) PASS: lldb-api :: functionalities/breakpoint/move_nearest/TestMoveNearest.py (1439 of 2087) PASS: lldb-shell :: SymbolFile/NativePDB/source-list.cpp (1440 of 2087) PASS: lldb-unit :: Process/./ProcessEventDataTests/ProcessEventDataTest.ShouldStop (1441 of 2087) PASS: lldb-unit :: Utility/./UtilityTests/UriParserTest.BracketedHostnameWithPortIPv6 (1442 of 2087) PASS: lldb-unit :: SymbolFile/NativePDB/./SymbolFileNativePDBTests/PDBFPOProgramToDWARFExpressionTests.InvalidAssignmentMultiple (1443 of 2087) PASS: lldb-api :: commands/target/select/TestTargetSelect.py (1444 of 2087) PASS: lldb-unit :: UnwindAssembly/x86/./UnwindAssemblyx86Tests/Testx86AssemblyInspectionEngine.TestSpillRegToStackViaMOVx86_64 (1445 of 2087) PASS: lldb-unit :: Utility/./UtilityTests/StringLexerTest.Next (1446 of 2087) UNSUPPORTED: lldb-api :: functionalities/signal/handle-segv/TestHandleSegv.py (1447 of 2087) PASS: lldb-unit :: Utility/./UtilityTests/RangeTest.Clear (1448 of 2087) PASS: lldb-unit :: ObjectFile/Breakpad/./ObjectFileBreakpadTests/ModuleRecord.parse (1449 of 2087) PASS: lldb-api :: lang/objc/objc-super/TestObjCSuper.py (1450 of 2087) PASS: lldb-api :: commands/process/attach/attach_denied/TestAttachDenied.py (1451 of 2087) PASS: lldb-api :: functionalities/data-formatter/typedef_array/TestTypedefArray.py (1452 of 2087) PASS: lldb-unit :: Platform/./LLDBPlatformTests/PlatformDarwinTest.TestParseVersionBuildDir (1453 of 2087) PASS: lldb-shell :: SymbolFile/NativePDB/ast-methods.cpp (1454 of 2087) PASS: lldb-api :: functionalities/thread/concurrent_events/TestConcurrentWatchBreak.py (1455 of 2087) PASS: lldb-unit :: Host/./HostTests/ProcessLaunchInfoTest.Constructor (1456 of 2087) PASS: lldb-unit :: Utility/./UtilityTests/StringListTest.ForRangeEmpty (1457 of 2087) PASS: lldb-unit :: Utility/./UtilityTests/UriParserTest.SchemeHostSeparator4 (1458 of 2087) PASS: lldb-api :: types/TestRecursiveTypes.py (1459 of 2087) PASS: lldb-unit :: Host/./HostTests/File.GetStreamFromDescriptor (1460 of 2087) PASS: lldb-unit :: Host/./HostTests/HostInfoTest.GetAugmentedArchSpec (1461 of 2087) PASS: lldb-shell :: SymbolFile/DWARF/split-dwarf-inlining.cpp (1462 of 2087) PASS: lldb-unit :: Utility/./UtilityTests/StringExtractorTest.GetHexBytesAvail_FullString (1463 of 2087) PASS: lldb-api :: commands/expression/dont_allow_jit/TestAllowJIT.py (1464 of 2087) PASS: lldb-unit :: UnwindAssembly/x86/./UnwindAssemblyx86Tests/Testx86AssemblyInspectionEngine.TestPushECX (1465 of 2087) PASS: lldb-api :: tools/lldb-server/TestGdbRemoteAttach.py (1466 of 2087) PASS: lldb-api :: types/TestDoubleTypesExpr.py (1467 of 2087) PASS: lldb-shell :: SymbolFile/DWARF/find-method-local-struct.cpp (1468 of 2087) PASS: lldb-api :: lang/objc/ptr_refs/TestPtrRefsObjC.py (1469 of 2087) PASS: lldb-api :: lang/cpp/function-qualifiers/TestCppFunctionQualifiers.py (1470 of 2087) UNSUPPORTED: lldb-api :: functionalities/data-formatter/data-formatter-stl/libstdcpp/unique_ptr/TestDataFormatterStdUniquePtr.py (1471 of 2087) PASS: lldb-api :: functionalities/data-formatter/data-formatter-categories/TestDataFormatterCategories.py (1472 of 2087) PASS: lldb-unit :: Utility/./UtilityTests/StringExtractorTest.GetHexU8_Exact_NoEof (1473 of 2087) PASS: lldb-unit :: Utility/./UtilityTests/ArgsTest.TestTrailingBackslash (1474 of 2087) UNSUPPORTED: lldb-api :: functionalities/data-formatter/data-formatter-stl/libstdcpp/tuple/TestDataFormatterStdTuple.py (1475 of 2087) PASS: lldb-unit :: SymbolFile/NativePDB/./SymbolFileNativePDBTests/PDBFPOProgramToDWARFExpressionTests.UnresolvedDependentCyclicRegisterAssignmentReference (1476 of 2087) PASS: lldb-unit :: UnwindAssembly/x86/./UnwindAssemblyx86Tests/Testx86AssemblyInspectionEngine.TestDisassemblyMidFunctionEpilogues (1477 of 2087) PASS: lldb-unit :: Host/./HostTests/FileSystemTest.FileAndDirectoryComponents (1478 of 2087) PASS: lldb-unit :: Language/Highlighting/./HighlighterTests/HighlighterTest.ClangCursorPos (1479 of 2087) PASS: lldb-api :: functionalities/thread/concurrent_events/TestConcurrentWatchBreakDelay.py (1480 of 2087) PASS: lldb-unit :: Symbol/./SymbolTests/TestTypeSystemClang.TestDisplayNameEmpty (1481 of 2087) PASS: lldb-unit :: Utility/./UtilityTests/FileSpecTest.Match (1482 of 2087) PASS: lldb-shell :: ObjectFile/Breakpad/breakpad-identification.test (1483 of 2087) PASS: lldb-api :: functionalities/data-formatter/data-formatter-stl/libcxx/string/TestDataFormatterLibcxxString.py (1484 of 2087) PASS: lldb-api :: commands/source/info/TestSourceInfo.py (1485 of 2087) PASS: lldb-unit :: SymbolFile/DWARF/./SymbolFileDWARFTests/SymbolFileDWARFTests.TestAbbrevOrder1Start1 (1486 of 2087) PASS: lldb-unit :: UnwindAssembly/x86/./UnwindAssemblyx86Tests/Testx86AssemblyInspectionEngine.TestPopRBP (1487 of 2087) UNSUPPORTED: lldb-api :: commands/expression/macros/TestMacros.py (1488 of 2087) PASS: lldb-unit :: Utility/./UtilityTests/StringListTest.ShiftCString (1489 of 2087) PASS: lldb-unit :: Utility/./UtilityTests/StringExtractorTest.GetU64BigEndian (1490 of 2087) PASS: lldb-api :: functionalities/breakpoint/breakpoint_names/TestBreakpointNames.py (1491 of 2087) PASS: lldb-unit :: Utility/./UtilityTests/StreamTest.PutMaxHex64ByteOrderBig (1492 of 2087) PASS: lldb-api :: commands/expression/radar_8638051/Test8638051.py (1493 of 2087) PASS: lldb-unit :: Utility/./UtilityTests/PassiveReplayTest.InstrumentedBar (1494 of 2087) PASS: lldb-unit :: Utility/./UtilityTests/StreamTest.PutNHex8 (1495 of 2087) PASS: lldb-unit :: Process/gdb-remote/./ProcessGdbRemoteTests/GDBRemoteClientBaseTest.SendContinueAndLateInterrupt (1496 of 2087) PASS: lldb-api :: tools/lldb-server/TestGdbRemoteExitCode.py (1497 of 2087) UNSUPPORTED: lldb-shell :: Unwind/eh-frame-small-fde.test (1498 of 2087) PASS: lldb-unit :: Symbol/./SymbolTests/TestClangASTImporter.CanImportInvalidType (1499 of 2087) PASS: lldb-unit :: DataFormatter/./LLDBFormatterTests/StringPrinterTests.CxxUTF8 (1500 of 2087) PASS: lldb-unit :: Expression/./ExpressionTests/ClangHostTest.MacOSX (1501 of 2087) PASS: lldb-unit :: Utility/./UtilityTests/FileSpecTest.EqualSeparator (1502 of 2087) PASS: lldb-api :: functionalities/tail_call_frames/unambiguous_sequence/TestUnambiguousTailCalls.py (1503 of 2087) PASS: lldb-api :: tools/lldb-server/TestGdbRemote_qThreadStopInfo.py (1504 of 2087) PASS: lldb-unit :: Utility/./UtilityTests/StateTest.Formatv (1505 of 2087) PASS: lldb-unit :: ScriptInterpreter/Python/./ScriptInterpreterPythonTests/PythonDataObjectsTest.TestScript (1506 of 2087) UNSUPPORTED: lldb-api :: tools/lldb-server/TestGdbRemoteModuleInfo.py (1507 of 2087) PASS: lldb-api :: functionalities/thread/thread_specific_break/TestThreadSpecificBreakpoint.py (1508 of 2087) PASS: lldb-unit :: UnwindAssembly/x86/./UnwindAssemblyx86Tests/Testx86AssemblyInspectionEngine.TestPushR12 (1509 of 2087) PASS: lldb-api :: functionalities/inline-stepping/TestInlineStepping.py (1510 of 2087) PASS: lldb-api :: commands/expression/po_verbosity/TestPoVerbosity.py (1511 of 2087) PASS: lldb-shell :: Minidump/dump-all.test (1512 of 2087) PASS: lldb-unit :: Utility/./UtilityTests/UriParserTest.MinimalPort (1513 of 2087) PASS: lldb-shell :: SymbolFile/DWARF/apple-index-is-used.cpp (1514 of 2087) PASS: lldb-api :: commands/register/register/register_command/TestRegisters.py (1515 of 2087) PASS: lldb-api :: functionalities/data-formatter/ostypeformatting/TestFormattersOsType.py (1516 of 2087) PASS: lldb-api :: python_api/name_lookup/TestNameLookup.py (1517 of 2087) UNSUPPORTED: lldb-api :: lang/cpp/static_members/TestCPPStaticMembers.py (1518 of 2087) XFAIL: lldb-shell :: Register/x86-64-write.test (1519 of 2087) PASS: lldb-unit :: Utility/./UtilityTests/FileSpecTest.EqualDotsPosixRoot (1520 of 2087) PASS: lldb-shell :: Minidump/disassemble-no-module.yaml (1521 of 2087) PASS: lldb-api :: commands/expression/invalid-args/TestInvalidArgsExpression.py (1522 of 2087) UNSUPPORTED: lldb-shell :: SymbolFile/PDB/expressions.test (1523 of 2087) PASS: lldb-api :: functionalities/thread/step_out/TestThreadStepOut.py (1524 of 2087) PASS: lldb-shell :: Minidump/Windows/find-module.test (1525 of 2087) UNSUPPORTED: lldb-shell :: ScriptInterpreter/Lua/lua.test (1526 of 2087) PASS: lldb-api :: functionalities/ubsan/user-expression/TestUbsanUserExpression.py (1527 of 2087) PASS: lldb-api :: commands/expression/persistent_types/TestNestedPersistentTypes.py (1528 of 2087) PASS: lldb-unit :: ScriptInterpreter/Python/./ScriptInterpreterPythonTests/PythonDataObjectsTest.TestPythonListValueEquality (1529 of 2087) PASS: lldb-shell :: Commands/command-target-modules-dump-sections.yaml (1530 of 2087) PASS: lldb-shell :: SymbolFile/NativePDB/ast-functions.cpp (1531 of 2087) PASS: lldb-shell :: ObjectFile/ELF/section-overlap.yaml (1532 of 2087) PASS: lldb-api :: functionalities/data-formatter/dump_dynamic/TestDumpDynamic.py (1533 of 2087) PASS: lldb-api :: commands/process/attach-resume/TestAttachResume.py (1534 of 2087) PASS: lldb-unit :: Core/./LLDBCoreTests/MangledTest.ResultForBlockInvocation (1535 of 2087) PASS: lldb-shell :: SymbolFile/DWARF/find-basic-namespace.cpp (1536 of 2087) UNSUPPORTED: lldb-shell :: ScriptInterpreter/Lua/persistent_state.test (1537 of 2087) PASS: lldb-unit :: Utility/./UtilityTests/ScalarTest.Getters (1538 of 2087) UNSUPPORTED: lldb-api :: functionalities/process_save_core/TestProcessSaveCore.py (1539 of 2087) PASS: lldb-unit :: Utility/./UtilityTests/StreamTest.PutBytesAsRawHex8ToBigEndian (1540 of 2087) PASS: lldb-unit :: Utility/./UtilityTests/UriParserTest.SchemeHostSeparator (1541 of 2087) XFAIL: lldb-shell :: SymbolFile/DWARF/find-type-in-function.cpp (1542 of 2087) UNSUPPORTED: lldb-shell :: SymbolFile/PDB/ast-restore.test (1543 of 2087) PASS: lldb-unit :: Language/Highlighting/./HighlighterTests/HighlighterTest.FallbackHighlighter (1544 of 2087) PASS: lldb-unit :: Host/./HostTests/SocketAddressTest.Set (1545 of 2087) PASS: lldb-api :: functionalities/abbreviation/TestAbbreviations.py (1546 of 2087) PASS: lldb-api :: commands/frame/diagnose/dereference-this/TestDiagnoseDereferenceThis.py (1547 of 2087) PASS: lldb-unit :: Utility/./UtilityTests/ArgsTest.TestOverwriteArgs (1548 of 2087) PASS: lldb-unit :: ScriptInterpreter/Python/./ScriptInterpreterPythonTests/PythonDataObjectsTest.TestBorrowedReferences (1549 of 2087) PASS: lldb-api :: functionalities/breakpoint/breakpoint_set_restart/TestBreakpointSetRestart.py (1550 of 2087) PASS: lldb-api :: functionalities/breakpoint/comp_dir_symlink/TestCompDirSymLink.py (1551 of 2087) PASS: lldb-api :: arm/emulation/TestEmulations.py (1552 of 2087) PASS: lldb-unit :: Utility/./UtilityTests/RecordReplayTest.InstrumentedFooSameThis (1553 of 2087) PASS: lldb-shell :: Commands/command-regex-delete.test (1554 of 2087) PASS: lldb-unit :: Expression/./ExpressionTests/DiagnosticManagerTest.AddDiagnostic (1555 of 2087) PASS: lldb-api :: functionalities/thread/concurrent_events/TestConcurrentCrashWithWatchpoint.py (1556 of 2087) PASS: lldb-unit :: Host/./HostTests/SocketTest.UDPConnect (1557 of 2087) PASS: lldb-api :: functionalities/data-formatter/format-propagation/TestFormatPropagation.py (1558 of 2087) PASS: lldb-api :: functionalities/breakpoint/cpp_exception/TestCPPExceptionBreakpoint.py (1559 of 2087) PASS: lldb-unit :: Utility/./UtilityTests/DataExtractorTest.GetBitfield (1560 of 2087) PASS: lldb-api :: lang/objc/print-obj/TestPrintObj.py (1561 of 2087) PASS: lldb-unit :: Utility/./UtilityTests/StringListTest.JoinSingle (1562 of 2087) PASS: lldb-shell :: Driver/TestRepl.test (1563 of 2087) PASS: lldb-api :: functionalities/breakpoint/breakpoint_conditions/TestBreakpointConditions.py (1564 of 2087) PASS: lldb-api :: lang/objc/hidden-ivars/TestHiddenIvars.py (1565 of 2087) PASS: lldb-shell :: BuildScript/toolchain-clang.test (1566 of 2087) PASS: lldb-unit :: ObjectFile/PECOFF/./ObjectFilePECOFFTests/PECallFrameInfoTest.Chained_eh (1567 of 2087) UNSUPPORTED: lldb-shell :: Register/x86-gp-write.test (1568 of 2087) PASS: lldb-api :: commands/expression/rdar42038760/TestScalarURem.py (1569 of 2087) PASS: lldb-unit :: Utility/./UtilityTests/StreamTest.AddressRange (1570 of 2087) PASS: lldb-unit :: Utility/./UtilityTests/StringListTest.AppendStringCString (1571 of 2087) PASS: lldb-api :: lang/objc/objc-new-syntax/TestObjCNewSyntaxLiteral.py (1572 of 2087) PASS: lldb-unit :: UnwindAssembly/x86/./UnwindAssemblyx86Tests/Testx86AssemblyInspectionEngine.TestPopESI (1573 of 2087) PASS: lldb-api :: lang/cpp/exceptions/TestCPPExceptionBreakpoints.py (1574 of 2087) PASS: lldb-unit :: Symbol/./SymbolTests/TestTypeSystemClang.AddMethodToObjCObjectType (1575 of 2087) PASS: lldb-api :: python_api/hello_world/TestHelloWorld.py (1576 of 2087) PASS: lldb-unit :: Utility/./UtilityTests/UriParserTest.BadPort (1577 of 2087) PASS: lldb-unit :: Utility/./UtilityTests/StatusTest.ErrorCodeConstructor (1578 of 2087) PASS: lldb-api :: functionalities/gdb_remote_client/TestWasm.py (1579 of 2087) PASS: lldb-api :: functionalities/data-formatter/data-formatter-stl/libcxx/queue/TestDataFormatterLibcxxQueue.py (1580 of 2087) PASS: lldb-unit :: Language/Highlighting/./HighlighterTests/HighlighterTest.ClangEmptyInput (1581 of 2087) PASS: lldb-unit :: Expression/./ExpressionTests/DWARFExpression.DW_OP_pick (1582 of 2087) PASS: lldb-unit :: Host/./HostTests/SocketTest.UDPGetConnectURI (1583 of 2087) UNSUPPORTED: lldb-shell :: Unwind/eh-frame-augment-noop.test (1584 of 2087) PASS: lldb-api :: commands/frame/select/TestFrameSelect.py (1585 of 2087) XFAIL: lldb-shell :: Unwind/prefer-debug-over-eh-frame.test (1586 of 2087) PASS: lldb-unit :: Symbol/./SymbolTests/TestClangASTImporter.MetadataPropagation (1587 of 2087) PASS: lldb-unit :: Utility/./UtilityTests/StreamTest.PutHex64ByteOrderBig (1588 of 2087) PASS: lldb-unit :: Utility/./UtilityTests/RangeTest.SizeTypes (1589 of 2087) PASS: lldb-unit :: Utility/./UtilityTests/UriParserTest.Minimal (1590 of 2087) PASS: lldb-unit :: Process/gdb-remote/./ProcessGdbRemoteTests/GDBRemoteCommunicationClientTest.GetMemoryRegionInfoInvalidResponse (1591 of 2087) PASS: lldb-unit :: ScriptInterpreter/Python/./ScriptInterpreterPythonTests/PythonDataObjectsTest.TestPythonListToStructuredList (1592 of 2087) PASS: lldb-unit :: Utility/./UtilityTests/StringListTest.Clear (1593 of 2087) UNSUPPORTED: lldb-api :: functionalities/breakpoint/breakpoint_in_delayslot/TestAvoidBreakpointInDelaySlot.py (1594 of 2087) PASS: lldb-api :: functionalities/lazy-loading/TestLazyLoading.py (1595 of 2087) PASS: lldb-shell :: ObjectFile/ELF/avr-basic-info.yaml (1596 of 2087) PASS: lldb-api :: python_api/frame/inlines/TestInlinedFrame.py (1597 of 2087) PASS: lldb-api :: python_api/section/TestSectionAPI.py (1598 of 2087) PASS: lldb-unit :: Utility/./UtilityTests/StringListTest.InsertStringAtIndexOutOfBounds (1599 of 2087) PASS: lldb-unit :: Utility/./UtilityTests/ArgsTest.ReplaceArgumentAtIndexLonger (1600 of 2087) UNSUPPORTED: lldb-api :: tools/intel-features/intel-pt/test/TestIntelPTSimpleBinary.py (1601 of 2087) PASS: lldb-unit :: Utility/./UtilityTests/DataExtractorTest.GetULEB128_bit63 (1602 of 2087) PASS: lldb-api :: commands/frame/var/TestFrameVar.py (1603 of 2087) PASS: lldb-unit :: Utility/./UtilityTests/StringListTest.Assignment (1604 of 2087) PASS: lldb-shell :: Settings/TestEchoCommands.test (1605 of 2087) PASS: lldb-api :: commands/watchpoints/watchpoint_commands/condition/TestWatchpointConditionCmd.py (1606 of 2087) PASS: lldb-shell :: Settings/TestDisassemblyFormat.test (1607 of 2087) PASS: lldb-api :: functionalities/data-formatter/data-formatter-objc/TestDataFormatterObjCCF.py (1608 of 2087) PASS: lldb-api :: lang/cpp/namespace/TestNamespaceLookup.py (1609 of 2087) PASS: lldb-api :: functionalities/gdb_remote_client/TestGDBRemoteClient.py (1610 of 2087) PASS: lldb-api :: commands/expression/save_jit_objects/TestSaveJITObjects.py (1611 of 2087) PASS: lldb-api :: lang/cpp/offsetof/TestOffsetofCpp.py (1612 of 2087) PASS: lldb-shell :: SymbolFile/DWARF/dir-separator-no-comp-dir-relative-name.s (1613 of 2087) PASS: lldb-unit :: Utility/./UtilityTests/Predicate.WaitForValueNotEqualTo (1614 of 2087) PASS: lldb-api :: lang/objc/objc_direct-methods/TestObjCDirectMethods.py (1615 of 2087) PASS: lldb-shell :: SymbolFile/DWARF/anon_class_w_and_wo_export_symbols.ll (1616 of 2087) PASS: lldb-unit :: Expression/./ExpressionTests/DWARFExpression.DW_OP_piece (1617 of 2087) PASS: lldb-unit :: Utility/./UtilityTests/ArchSpecTest.TestSetTriple (1618 of 2087) PASS: lldb-unit :: Utility/./UtilityTests/StreamTest.PutHex64ByteOrderLittle (1619 of 2087) PASS: lldb-unit :: Process/gdb-remote/./ProcessGdbRemoteTests/GDBRemoteClientBaseTest.SendContinueAndAsyncPacket (1620 of 2087) PASS: lldb-api :: lang/c/anonymous/TestAnonymous.py (1621 of 2087) PASS: lldb-api :: iohandler/unicode/TestUnicode.py (1622 of 2087) PASS: lldb-api :: commands/expression/anonymous-struct/TestCallUserAnonTypedef.py (1623 of 2087) PASS: lldb-api :: commands/target/modules/search-paths/insert/TestTargetModulesSearchpathsInsert.py (1624 of 2087) PASS: lldb-unit :: Utility/./UtilityTests/StreamTeeTest.AppendStream (1625 of 2087) PASS: lldb-api :: python_api/process/TestProcessAPI.py (1626 of 2087) PASS: lldb-unit :: SymbolFile/DWARF/./SymbolFileDWARFTests/XcodeSDKModuleTests.TestModuleGetXcodeSDK (1627 of 2087) PASS: lldb-unit :: ScriptInterpreter/Python/./ScriptInterpreterPythonTests/PythonDataObjectsTest.TestDictionaryResolutionWithDot (1628 of 2087) PASS: lldb-unit :: Expression/./ExpressionTests/DiagnosticManagerTest.HasFixits (1629 of 2087) PASS: lldb-shell :: Breakpoint/single-file-split-dwarf.test (1630 of 2087) PASS: lldb-unit :: DataFormatter/./LLDBFormatterTests/StringPrinterTests.SwiftUTF8 (1631 of 2087) PASS: lldb-unit :: Utility/./UtilityTests/ArgsTest.ReplaceArgumentAtIndexEqual (1632 of 2087) PASS: lldb-unit :: Host/./HostTests/HostInfoTest.GetXcodeSDK (1633 of 2087) PASS: lldb-api :: api/multithreaded/TestMultithreaded.py (1634 of 2087) PASS: lldb-unit :: Process/minidump/./LLDBMinidumpTests/MinidumpParserTest.InvalidMinidump (1635 of 2087) PASS: lldb-api :: functionalities/thread/ignore_suspended/TestIgnoreSuspendedThread.py (1636 of 2087) PASS: lldb-api :: python_api/sbplatform/TestSBPlatform.py (1637 of 2087) PASS: lldb-api :: terminal/TestSTTYBeforeAndAfter.py (1638 of 2087) PASS: lldb-api :: functionalities/breakpoint/hardware_breakpoints/hardware_breakpoint_on_multiple_threads/TestHWBreakMultiThread.py (1639 of 2087) PASS: lldb-unit :: Expression/./ExpressionTests/DWARFExpression.DW_OP_convert (1640 of 2087) PASS: lldb-api :: functionalities/breakpoint/serialize/TestBreakpointSerialization.py (1641 of 2087) UNSUPPORTED: lldb-api :: benchmarks/libcxxmap/TestBenchmarkLibcxxMap.py (1642 of 2087) PASS: lldb-api :: functionalities/thread/thread_exit/TestThreadExit.py (1643 of 2087) PASS: lldb-api :: python_api/value_var_update/TestValueVarUpdate.py (1644 of 2087) PASS: lldb-unit :: Utility/./UtilityTests/StringListTest.RemoveBlankLines (1645 of 2087) PASS: lldb-unit :: Utility/./UtilityTests/StringExtractorTest.GetNameColonValueContainsColon (1646 of 2087) PASS: lldb-unit :: Language/Highlighting/./HighlighterTests/HighlighterTest.ClangPPDirectives (1647 of 2087) PASS: lldb-unit :: Utility/./UtilityTests/StringExtractorTest.GetHexBytesAvail_Underflow (1648 of 2087) PASS: lldb-api :: lang/cpp/global_variables/TestCPPGlobalVariables.py (1649 of 2087) PASS: lldb-api :: tools/lldb-vscode/breakpoint/TestVSCode_setFunctionBreakpoints.py (1650 of 2087) PASS: lldb-api :: python_api/frame/get-variables/TestGetVariables.py (1651 of 2087) PASS: lldb-shell :: Commands/command-source.test (1652 of 2087) PASS: lldb-api :: functionalities/data-formatter/data-formatter-synth/TestDataFormatterSynth.py (1653 of 2087) PASS: lldb-api :: functionalities/thread/concurrent_events/TestConcurrentDelayedCrashWithBreakpointSignal.py (1654 of 2087) PASS: lldb-api :: lang/c/complex/TestComplexC99.py (1655 of 2087) PASS: lldb-api :: python_api/sbstructureddata/TestStructuredDataAPI.py (1656 of 2087) PASS: lldb-api :: commands/watchpoints/multiple_threads/TestWatchpointMultipleThreads.py (1657 of 2087) PASS: lldb-unit :: UnwindAssembly/x86/./UnwindAssemblyx86Tests/Testx86AssemblyInspectionEngine.TestPushEDX (1658 of 2087) PASS: lldb-unit :: Utility/./UtilityTests/BinaryStreamTest.PutULEB128OneByte (1659 of 2087) PASS: lldb-api :: functionalities/thread/concurrent_events/TestConcurrentSignalWatch.py (1660 of 2087) PASS: lldb-unit :: Host/./HostTests/File.GetWaitableHandleFileno (1661 of 2087) UNSUPPORTED: lldb-shell :: Expr/TestIRMemoryMapWindows.test (1662 of 2087) PASS: lldb-unit :: Utility/./UtilityTests/GeneratorTest.Create (1663 of 2087) PASS: lldb-api :: python_api/file_handle/TestFileHandle.py (1664 of 2087) PASS: lldb-api :: macosx/save_crashlog/TestSaveCrashlog.py (1665 of 2087) UNSUPPORTED: lldb-api :: lang/objc/modules-app-update/TestClangModulesAppUpdate.py (1666 of 2087) PASS: lldb-shell :: ScriptInterpreter/Python/crashlog.test (1667 of 2087) PASS: lldb-shell :: ObjectFile/ELF/section-permissions.yaml (1668 of 2087) PASS: lldb-api :: functionalities/stats_api/TestStatisticsAPI.py (1669 of 2087) PASS: lldb-api :: functionalities/thread/concurrent_events/TestConcurrentTwoBreakpointThreads.py (1670 of 2087) PASS: lldb-unit :: Utility/./UtilityTests/ReproducerTest.SetReplay (1671 of 2087) PASS: lldb-api :: driver/batch_mode/TestBatchMode.py (1672 of 2087) PASS: lldb-unit :: Expression/./ExpressionTests/CppModuleConfigurationTest.MissingLibCpp (1673 of 2087) PASS: lldb-api :: types/TestFloatTypesExpr.py (1674 of 2087) PASS: lldb-api :: commands/target/stop-hook/delete/TestTargetStopHookDelete.py (1675 of 2087) PASS: lldb-api :: commands/apropos/with-process/TestAproposWithProcess.py (1676 of 2087) PASS: lldb-shell :: Quit/TestQuitExitCode-30.test (1677 of 2087) PASS: lldb-unit :: Utility/./UtilityTests/OptionsWithRawTest.LeadingSpaceArgs (1678 of 2087) PASS: lldb-unit :: Utility/./UtilityTests/BinaryStreamTest.PutSLEB128One (1679 of 2087) UNSUPPORTED: lldb-api :: functionalities/darwin_log/filter/exact_match/activity/TestDarwinLogFilterMatchActivity.py (1680 of 2087) PASS: lldb-shell :: Breakpoint/ppc64-localentry.test (1681 of 2087) PASS: lldb-api :: functionalities/plugins/python_os_plugin/TestPythonOSPlugin.py (1682 of 2087) PASS: lldb-api :: commands/target/stop-hooks/TestStopHooks.py (1683 of 2087) PASS: lldb-api :: functionalities/dead-strip/TestDeadStrip.py (1684 of 2087) PASS: lldb-unit :: Utility/./UtilityTests/LogChannelTest.List (1685 of 2087) PASS: lldb-unit :: Core/./LLDBCoreTests/SourceFileCache.FindSourceFileFound (1686 of 2087) UNSUPPORTED: lldb-shell :: SymbolFile/PDB/compilands.test (1687 of 2087) PASS: lldb-api :: functionalities/plugins/command_plugin/TestPluginCommands.py (1688 of 2087) PASS: lldb-api :: functionalities/data-formatter/summary-string-onfail/Test-rdar-9974002.py (1689 of 2087) UNSUPPORTED: lldb-api :: android/platform/TestDefaultCacheLineSize.py (1690 of 2087) PASS: lldb-api :: python_api/value/TestValueAPI.py (1691 of 2087) PASS: lldb-shell :: Reproducer/TestVersionCheck.test (1692 of 2087) PASS: lldb-unit :: Utility/./UtilityTests/StatusTest.ErrorConstructor (1693 of 2087) PASS: lldb-api :: macosx/add-dsym/TestAddDsymMidExecutionCommand.py (1694 of 2087) PASS: lldb-api :: lang/c/shared_lib_stripped_symbols/TestSharedLibStrippedSymbols.py (1695 of 2087) PASS: lldb-api :: tools/lldb-server/commandline/TestStubReverseConnect.py (1696 of 2087) PASS: lldb-api :: lang/cpp/chained-calls/TestCppChainedCalls.py (1697 of 2087) PASS: lldb-api :: functionalities/multidebugger_commands/TestMultipleDebuggersCommands.py (1698 of 2087) UNSUPPORTED: lldb-api :: lang/cpp/printf/TestPrintf.py (1699 of 2087) PASS: lldb-unit :: Utility/./UtilityTests/ArgsTest.TestSingleArgWithQuotedSpace (1700 of 2087) PASS: lldb-unit :: Symbol/./SymbolTests/TestTypeSystemClang.TestUnifyAccessSpecifiers (1701 of 2087) PASS: lldb-api :: functionalities/thread/concurrent_events/TestConcurrentTwoBreakpointsOneWatchpoint.py (1702 of 2087) PASS: lldb-unit :: Utility/./UtilityTests/FileSpecTest.AppendPathComponent (1703 of 2087) PASS: lldb-shell :: SymbolFile/DWARF/DW_AT_loclists_base.s (1704 of 2087) PASS: lldb-shell :: ObjectFile/Breakpad/uuid-matching-mac.test (1705 of 2087) PASS: lldb-unit :: Utility/./UtilityTests/OptionsWithRawTest.WhitespaceSuffix (1706 of 2087) PASS: lldb-api :: lang/cpp/typedef/TestCppTypedef.py (1707 of 2087) UNSUPPORTED: lldb-api :: tools/lldb-server/TestGdbRemoteAuxvSupport.py (1708 of 2087) PASS: lldb-api :: commands/expression/timeout/TestCallWithTimeout.py (1709 of 2087) PASS: lldb-api :: source-manager/TestSourceManager.py (1710 of 2087) PASS: lldb-unit :: UnwindAssembly/x86/./UnwindAssemblyx86Tests/Testx86AssemblyInspectionEngine.Testi386IgnoredRegisters (1711 of 2087) PASS: lldb-unit :: Utility/./UtilityTests/VMRange.SetEndAddress (1712 of 2087) PASS: lldb-unit :: Host/./HostTests/SocketTest.DomainGetConnectURI (1713 of 2087) PASS: lldb-unit :: SymbolFile/DWARF/./SymbolFileDWARFTests/DWARFASTParserClangTests.EnsureAllDIEsInDeclContextHaveBeenParsedParsesOnlyMatchingEntries (1714 of 2087) PASS: lldb-unit :: Utility/./UtilityTests/CompletionRequest.TestCompletionOwnership (1715 of 2087) PASS: lldb-unit :: ScriptInterpreter/Python/./ScriptInterpreterPythonTests/PythonDataObjectsTest.TestOwnedReferences (1716 of 2087) UNSUPPORTED: lldb-api :: macosx/simulator/TestSimulatorPlatform.py (1717 of 2087) PASS: lldb-shell :: ObjectFile/ELF/section-types-edgecases.yaml (1718 of 2087) PASS: lldb-api :: commands/watchpoints/watchpoint_on_vectors/TestValueOfVectorVariable.py (1719 of 2087) PASS: lldb-api :: functionalities/value_md5_crash/TestValueMD5Crash.py (1720 of 2087) PASS: lldb-api :: functionalities/data-formatter/nsarraysynth/TestNSArraySynthetic.py (1721 of 2087) PASS: lldb-unit :: Target/./TargetTests/ExecutionContextTest.GetByteOrderProcess (1722 of 2087) PASS: lldb-api :: functionalities/signal/TestSendSignal.py (1723 of 2087) PASS: lldb-api :: commands/expression/import_builtin_fileid/TestImportBuiltinFileID.py (1724 of 2087) PASS: lldb-api :: lang/cpp/signed_types/TestSignedTypes.py (1725 of 2087) PASS: lldb-unit :: UnwindAssembly/x86/./UnwindAssemblyx86Tests/Testx86AssemblyInspectionEngine.TestPopEBP (1726 of 2087) PASS: lldb-unit :: Expression/./ExpressionTests/DiagnosticManagerTest.AppendMessageAttachToLastDiag (1727 of 2087) UNSUPPORTED: lldb-shell :: ObjectFile/ELF/minidebuginfo-set-and-hit-breakpoint.test (1728 of 2087) PASS: lldb-shell :: SymbolFile/DWARF/childless-compile-unit.s (1729 of 2087) PASS: lldb-api :: commands/expression/import-std-module/list-dbg-info-content/TestDbgInfoContentListFromStdModule.py (1730 of 2087) UNSUPPORTED: lldb-shell :: ScriptInterpreter/Lua/bindings.test (1731 of 2087) PASS: lldb-api :: commands/expression/ir-interpreter/TestIRInterpreter.py (1732 of 2087) UNSUPPORTED: lldb-api :: lang/objc/modules-update/TestClangModulesUpdate.py (1733 of 2087) PASS: lldb-shell :: ObjectFile/ELF/base-address.yaml (1734 of 2087) PASS: lldb-unit :: Utility/./UtilityTests/UriParserTest.BracketedHostnameWithColon (1735 of 2087) PASS: lldb-unit :: Utility/./UtilityTests/LogTest.Unregister (1736 of 2087) PASS: lldb-unit :: Utility/./UtilityTests/DataExtractorTest.GetMaxU64 (1737 of 2087) PASS: lldb-unit :: Utility/./UtilityTests/RangeDataVector.FindEntryIndexesThatContain_Overlap (1738 of 2087) PASS: lldb-shell :: SymbolFile/DWARF/debug-types-signature-loop.s (1739 of 2087) PASS: lldb-api :: macosx/function-starts/TestFunctionStarts.py (1740 of 2087) PASS: lldb-unit :: Utility/./UtilityTests/StringListTest.LongestCommonPrefixDuplicateElement (1741 of 2087) PASS: lldb-unit :: Target/./TargetTests/MCBasedABI.MapRegisterName (1742 of 2087) PASS: lldb-unit :: UnwindAssembly/x86/./UnwindAssemblyx86Tests/Testx86AssemblyInspectionEngine.TestPushRBP (1743 of 2087) PASS: lldb-api :: lang/c/modules/TestCModules.py (1744 of 2087) PASS: lldb-unit :: Process/gdb-remote/./ProcessGdbRemoteTests/GDBRemoteClientBaseTest.SendContinueAndInterrupt2PacketBug (1745 of 2087) PASS: lldb-api :: lang/cpp/stl/TestSTL.py (1746 of 2087) PASS: lldb-shell :: SymbolFile/DWARF/find-function-regex.cpp (1747 of 2087) PASS: lldb-unit :: Symbol/./SymbolTests/DWARFCallFrameInfoTest.Basic_dwarf3 (1748 of 2087) PASS: lldb-api :: commands/command/script_alias/TestCommandScriptAlias.py (1749 of 2087) UNSUPPORTED: lldb-api :: commands/register/register/intel_xtended_registers/TestMPXRegisters.py (1750 of 2087) PASS: lldb-api :: commands/expression/namespace_local_var_same_name_cpp_and_c/TestNamespaceLocalVarSameNameCppAndC.py (1751 of 2087) PASS: lldb-api :: functionalities/thread/concurrent_events/TestConcurrentCrashWithSignal.py (1752 of 2087) PASS: lldb-api :: functionalities/data-formatter/data-formatter-stl/libcxx/tuple/TestDataFormatterLibcxxTuple.py (1753 of 2087) PASS: lldb-unit :: Utility/./UtilityTests/UriParserTest.BadPort2 (1754 of 2087) PASS: lldb-api :: python_api/sbtype_typeclass/TestSBTypeTypeClass.py (1755 of 2087) UNSUPPORTED: lldb-api :: benchmarks/frame_variable/TestFrameVariableResponse.py (1756 of 2087) PASS: lldb-shell :: ObjectFile/Breakpad/sections.test (1757 of 2087) PASS: lldb-api :: commands/gui/basic/TestGuiBasic.py (1758 of 2087) PASS: lldb-shell :: SymbolFile/DWARF/find-basic-type.cpp (1759 of 2087) UNSUPPORTED: lldb-shell :: SymbolFile/PDB/enums-layout.test (1760 of 2087) PASS: lldb-api :: functionalities/tsan/cpp_global_location/TestTsanCPPGlobalLocation.py (1761 of 2087) PASS: lldb-api :: python_api/sbdata/TestSBData.py (1762 of 2087) PASS: lldb-unit :: Utility/./UtilityTests/RangeTest.ContainsAddrInvalid (1763 of 2087) PASS: lldb-api :: functionalities/thread/backtrace_limit/TestBacktraceLimit.py (1764 of 2087) PASS: lldb-api :: tools/lldb-server/TestGdbRemote_vCont.py (1765 of 2087) PASS: lldb-api :: lang/objc/modules-cache/TestClangModulesCache.py (1766 of 2087) PASS: lldb-api :: lang/objc/objc-static-method/TestObjCStaticMethod.py (1767 of 2087) PASS: lldb-shell :: ObjectFile/MachO/lc_build_version_notools.yaml (1768 of 2087) PASS: lldb-api :: functionalities/breakpoint/inlined_breakpoints/TestInlinedBreakpoints.py (1769 of 2087) PASS: lldb-api :: commands/watchpoints/watchpoint_set_command/TestWatchLocationWithWatchSet.py (1770 of 2087) PASS: lldb-unit :: Utility/./UtilityTests/BroadcasterTest.EventTypeHasListeners (1771 of 2087) PASS: lldb-unit :: Utility/./UtilityTests/RangeTest.Slide (1772 of 2087) PASS: lldb-unit :: UnwindAssembly/x86/./UnwindAssemblyx86Tests/Testx86AssemblyInspectionEngine.TestSimplex86_64Augmented (1773 of 2087) PASS: lldb-api :: lang/cpp/class_static/TestStaticVariables.py (1774 of 2087) PASS: lldb-api :: lang/cpp/this_class_type_mixing/TestThisClassTypeMixing.py (1775 of 2087) PASS: lldb-unit :: Utility/./UtilityTests/Flags.AnySet (1776 of 2087) PASS: lldb-api :: lang/objc/objc-new-syntax/TestObjCNewSyntaxArray.py (1777 of 2087) PASS: lldb-shell :: ObjectFile/PECOFF/dep-modules.yaml (1778 of 2087) PASS: lldb-unit :: UnwindAssembly/x86/./UnwindAssemblyx86Tests/Testx86AssemblyInspectionEngine.TestStackRealign32BitDisp_x86_64 (1779 of 2087) UNSUPPORTED: lldb-api :: lang/c/typedef/Testtypedef.py (1780 of 2087) UNSUPPORTED: lldb-shell :: ScriptInterpreter/Lua/independent_state.test (1781 of 2087) PASS: lldb-unit :: ScriptInterpreter/Python/./ScriptInterpreterPythonTests/PythonDataObjectsTest.TestPythonTupleToStructuredList (1782 of 2087) PASS: lldb-shell :: ObjectFile/MachO/lc_build_version.yaml (1783 of 2087) PASS: lldb-unit :: Thread/./ThreadTests/ThreadTest.SetStopInfo (1784 of 2087) PASS: lldb-api :: commands/settings/quoting/TestQuoting.py (1785 of 2087) PASS: lldb-api :: lang/c/offsetof/TestOffsetof.py (1786 of 2087) PASS: lldb-unit :: Utility/./UtilityTests/BinaryStreamTest.PutSLEB128OneByte (1787 of 2087) PASS: lldb-api :: commands/expression/import-std-module/weak_ptr/TestWeakPtrFromStdModule.py (1788 of 2087) PASS: lldb-shell :: SymbolFile/DWARF/dwp-debug-types.s (1789 of 2087) PASS: lldb-unit :: UnwindAssembly/x86/./UnwindAssemblyx86Tests/Testx86AssemblyInspectionEngine.TestPushExtended (1790 of 2087) PASS: lldb-unit :: Utility/./UtilityTests/DataExtractorTest.GetSLEB128_bit63 (1791 of 2087) UNSUPPORTED: lldb-shell :: Register/x86-64-zmm-read.test (1792 of 2087) PASS: lldb-unit :: Utility/./UtilityTests/ConstStringTest.format_provider (1793 of 2087) PASS: lldb-api :: functionalities/breakpoint/breakpoint_language/TestBreakpointLanguage.py (1794 of 2087) PASS: lldb-shell :: ObjectFile/ELF/aarch64-relocations.yaml (1795 of 2087) PASS: lldb-api :: functionalities/thread/concurrent_events/TestConcurrentWatchpointWithDelayWatchpointThreads.py (1796 of 2087) PASS: lldb-api :: lang/objc/exceptions/TestObjCExceptions.py (1797 of 2087) PASS: lldb-shell :: ObjectFile/ELF/PT_LOAD-overlap-section.yaml (1798 of 2087) PASS: lldb-api :: functionalities/gdb_remote_client/TestqOffsets.py (1799 of 2087) UNSUPPORTED: lldb-shell :: Unwind/unwind-plan-dwarf-dump.test (1800 of 2087) PASS: lldb-shell :: SymbolFile/DWARF/dwarf5-index-is-used.cpp (1801 of 2087) PASS: lldb-unit :: Expression/./ExpressionTests/DiagnosticManagerTest.GetStringNoDiags (1802 of 2087) PASS: lldb-shell :: Register/x86-64-gp-read.test (1803 of 2087) PASS: lldb-api :: lang/cpp/llvm-style/TestLLVMStyle.py (1804 of 2087) UNSUPPORTED: lldb-api :: tools/lldb-server/thread-name/TestGdbRemoteThreadName.py (1805 of 2087) UNSUPPORTED: lldb-shell :: ScriptInterpreter/Lua/convenience_variables.test (1806 of 2087) PASS: lldb-unit :: Platform/Android/./AdbClientTests/AdbClientTest.CreateByDeviceId_ByEnvVar (1807 of 2087) PASS: lldb-api :: functionalities/data-formatter/data-formatter-stl/libcxx/unordered/TestDataFormatterUnordered.py (1808 of 2087) PASS: lldb-api :: lang/cpp/diamond/TestDiamond.py (1809 of 2087) PASS: lldb-unit :: Utility/./UtilityTests/ReproducerTest.SetCapture (1810 of 2087) PASS: lldb-unit :: SymbolFile/DWARF/./SymbolFileDWARFTests/SymbolFileDWARFTests.TestAbbrevOrder1Start5 (1811 of 2087) PASS: lldb-api :: lang/cpp/class_types/TestClassTypesDisassembly.py (1812 of 2087) PASS: lldb-unit :: Utility/./UtilityTests/VMRange.IsValid (1813 of 2087) PASS: lldb-unit :: Language/Highlighting/./HighlighterTests/HighlighterTest.HighlighterSelectionPath (1814 of 2087) PASS: lldb-unit :: Utility/./UtilityTests/StreamTest.PutMaxHex64ByteOrderLittle (1815 of 2087) PASS: lldb-api :: lang/objc/forward-decl/TestForwardDecl.py (1816 of 2087) PASS: lldb-api :: lang/cpp/rvalue-references/TestRvalueReferences.py (1817 of 2087) PASS: lldb-unit :: ScriptInterpreter/Python/./ScriptInterpreterPythonTests/PythonDataObjectsTest.TestPythonListManipulation (1818 of 2087) PASS: lldb-unit :: Core/./LLDBCoreTests/SourceFileCache.FindSourceFileNotFound (1819 of 2087) PASS: lldb-api :: tools/lldb-vscode/console/TestVSCode_console.py (1820 of 2087) PASS: lldb-api :: lang/cpp/member-and-local-vars-with-same-name/TestMembersAndLocalsWithSameName.py (1821 of 2087) PASS: lldb-shell :: ObjectFile/PECOFF/sections.yaml (1822 of 2087) PASS: lldb-unit :: Utility/./UtilityTests/StreamTest.PutHex32ByteOrderBig (1823 of 2087) PASS: lldb-api :: functionalities/tail_call_frames/cross_object/TestCrossObjectTailCalls.py (1824 of 2087) PASS: lldb-api :: commands/frame/diagnose/inheritance/TestDiagnoseInheritance.py (1825 of 2087) PASS: lldb-unit :: Target/./TargetTests/PathMappingListTest.RemapRoot (1826 of 2087) PASS: lldb-unit :: Utility/./UtilityTests/StreamTest.PutRawBytesToBigEndian (1827 of 2087) PASS: lldb-unit :: Utility/./UtilityTests/OptionsWithRawTest.ArgsButNoDelimiter (1828 of 2087) PASS: lldb-unit :: Utility/./UtilityTests/AnsiTerminal.Unknown (1829 of 2087) PASS: lldb-api :: lang/objc/self/TestObjCSelf.py (1830 of 2087) PASS: lldb-unit :: SymbolFile/NativePDB/./SymbolFileNativePDBTests/PDBFPOProgramToDWARFExpressionTests.UnresolvedRegisterReference (1831 of 2087) PASS: lldb-api :: functionalities/data-formatter/data-formatter-smart-array/TestDataFormatterSmartArray.py (1832 of 2087) PASS: lldb-api :: lang/cpp/limit-debug-info/TestWithLimitDebugInfo.py (1833 of 2087) PASS: lldb-unit :: Symbol/./SymbolTests/TestClangASTImporter.DeportTypeTagDecl (1834 of 2087) PASS: lldb-shell :: Reproducer/Modules/TestModuleCXX.test (1835 of 2087) PASS: lldb-unit :: ObjectFile/ELF/./ObjectFileELFTests/ObjectFileELFTest.GetSymtab_NoSymEntryPointArmThumbAddressClass (1836 of 2087) UNSUPPORTED: lldb-api :: tools/lldb-server/platform-process-connect/TestPlatformProcessConnect.py (1837 of 2087) PASS: lldb-unit :: Utility/./UtilityTests/StringExtractorTest.GetU32BigEndian (1838 of 2087) PASS: lldb-shell :: SymbolFile/DWARF/DW_TAG_basic_type_DW_ATE_UTF_nonC.ll (1839 of 2087) PASS: lldb-shell :: SymbolFile/Breakpad/symtab-macho.test (1840 of 2087) PASS: lldb-unit :: Utility/./UtilityTests/StreamTeeTest.GetStreamAtIndexOutOfBoundsEmpty (1841 of 2087) PASS: lldb-api :: functionalities/data-formatter/data-formatter-ptr-to-array/TestPtrToArrayFormatting.py (1842 of 2087) PASS: lldb-api :: macosx/profile_vrs_detach/TestDetachVrsProfile.py (1843 of 2087) PASS: lldb-unit :: Utility/./UtilityTests/StringListTest.InsertStringAtIndexMove (1844 of 2087) PASS: lldb-unit :: Expression/./ExpressionTests/ClangExpressionDeclMapTest.TestUnknownIdentifierLookup (1845 of 2087) PASS: lldb-shell :: ObjectFile/PECOFF/invalid-export-table.yaml (1846 of 2087) PASS: lldb-unit :: Utility/./UtilityTests/RangeTest.NotEqualInvalid (1847 of 2087) PASS: lldb-shell :: Breakpoint/implicit_const_form_support.test (1848 of 2087) PASS: lldb-unit :: Expression/./ExpressionTests/DiagnosticManagerTest.GetStringSeverityLabels (1849 of 2087) PASS: lldb-unit :: Symbol/./SymbolTests/TestClangASTImporter.RecordLayout (1850 of 2087) PASS: lldb-api :: commands/target/stop-hook/disable/TestTargetStopHookDisable.py (1851 of 2087) PASS: lldb-unit :: UnwindAssembly/x86/./UnwindAssemblyx86Tests/Testx86AssemblyInspectionEngine.TestAddRSP (1852 of 2087) PASS: lldb-unit :: Symbol/./SymbolTests/TestTypeSystemClang.TestRecordHasFields (1853 of 2087) PASS: lldb-api :: lang/c/tls_globals/TestTlsGlobals.py (1854 of 2087) PASS: lldb-unit :: Utility/./UtilityTests/StreamTeeTest.Flush (1855 of 2087) PASS: lldb-unit :: ScriptInterpreter/Python/./ScriptInterpreterPythonTests/PythonDataObjectsTest.TestPythonBoolean (1856 of 2087) PASS: lldb-shell :: SymbolFile/DWARF/DW_OP_piece-struct.s (1857 of 2087) PASS: lldb-api :: functionalities/thread/exit_during_break/TestExitDuringBreak.py (1858 of 2087) PASS: lldb-shell :: SymbolFile/Breakpad/symtab.test (1859 of 2087) PASS: lldb-unit :: Utility/./UtilityTests/SerializationRountripTest.SerializeDeserializeCStringNull (1860 of 2087) PASS: lldb-api :: commands/expression/import-std-module/unique_ptr-dbg-info-content/TestUniquePtrDbgInfoContent.py (1861 of 2087) PASS: lldb-api :: lang/c/enum_types/TestEnumTypes.py (1862 of 2087) PASS: lldb-unit :: Utility/./UtilityTests/BinaryStreamTest.PutULEB128FiveBytes (1863 of 2087) PASS: lldb-unit :: Utility/./UtilityTests/FileSpecTest.RemoveLastPathComponent (1864 of 2087) PASS: lldb-unit :: SymbolFile/DWARF/./SymbolFileDWARFTests/SymbolFileDWARFTests.TestAbbrevMissingTerminator (1865 of 2087) PASS: lldb-shell :: Minidump/Windows/Sigsegv/sigsegv.test (1866 of 2087) PASS: lldb-unit :: SymbolFile/NativePDB/./SymbolFileNativePDBTests/PDBFPOProgramToDWARFExpressionTests.DependencyChain (1867 of 2087) PASS: lldb-unit :: Symbol/./SymbolTests/TestTypeSystemClang.TestGetBasicTypeFromEnum (1868 of 2087) PASS: lldb-shell :: SymbolFile/DWARF/debug-types-dwo-cross-reference.cpp (1869 of 2087) PASS: lldb-api :: lang/cpp/unique-types/TestUniqueTypes.py (1870 of 2087) PASS: lldb-api :: functionalities/memory/cache/TestMemoryCache.py (1871 of 2087) PASS: lldb-unit :: Utility/./UtilityTests/StringExtractorTest.GetNameColonValueNoColon (1872 of 2087) PASS: lldb-shell :: Expr/TestTypeOfDeclTypeExpr.test (1873 of 2087) PASS: lldb-unit :: Symbol/./SymbolTests/TestTypeSystemClang.TestGetTypeClassDeclType (1874 of 2087) UNSUPPORTED: lldb-api :: tools/lldb-server/TestGdbRemote_vContThreads.py (1875 of 2087) PASS: lldb-unit :: SymbolFile/DWARF/./SymbolFileDWARFTests/SymbolFileDWARFTests.TestAbbrevValidAttrNullForm (1876 of 2087) PASS: lldb-shell :: SymbolFile/DWARF/dir-separator-no-comp-dir.s (1877 of 2087) PASS: lldb-unit :: Core/./LLDBCoreTests/RichManglingContextTest.SwitchProvider (1878 of 2087) PASS: lldb-api :: python_api/value/change_values/TestChangeValueAPI.py (1879 of 2087) PASS: lldb-api :: lang/objc/objc-struct-argument/TestObjCStructArgument.py (1880 of 2087) PASS: lldb-shell :: Commands/CommandScriptImmediateOutput/CommandScriptImmediateOutputFile.test (1881 of 2087) PASS: lldb-unit :: Process/gdb-remote/./ProcessGdbRemoteTests/GDBRemoteCommunicationClientTest.WriteRegisterNoSuffix (1882 of 2087) PASS: lldb-unit :: Utility/./UtilityTests/AnsiTerminal.AtStart (1883 of 2087) PASS: lldb-api :: tools/lldb-server/TestGdbRemoteRegisterState.py (1884 of 2087) PASS: lldb-api :: functionalities/gdb_remote_client/TestGDBRemoteLoad.py (1885 of 2087) PASS: lldb-api :: functionalities/unwind/noreturn/module-end/TestNoReturnModuleEnd.py (1886 of 2087) PASS: lldb-api :: tools/lldb-server/TestAppleSimulatorOSType.py (1887 of 2087) PASS: lldb-api :: tools/lldb-server/TestGdbRemoteProcessInfo.py (1888 of 2087) PASS: lldb-unit :: Utility/./UtilityTests/StructuredDataTest.ParseJSONFromFile (1889 of 2087) UNSUPPORTED: lldb-shell :: Register/aarch64-gp-read.test (1890 of 2087) PASS: lldb-api :: lang/cpp/trivial_abi/TestTrivialABI.py (1891 of 2087) PASS: lldb-unit :: Target/./TargetTests/PathMappingListTest.AbsoluteTests (1892 of 2087) PASS: lldb-unit :: tools/lldb-server/tests/./LLDBServerTests/StandardStartupTest.TestStopReplyContainsThreadPcs (1893 of 2087) PASS: lldb-unit :: Utility/./UtilityTests/StreamTest.AddressSuffix (1894 of 2087) PASS: lldb-unit :: Host/./HostTests/ConnectionFileDescriptorTest.TCPGetURIv4 (1895 of 2087) PASS: lldb-api :: python_api/target/TestTargetAPI.py (1896 of 2087) PASS: lldb-api :: python_api/function_symbol/TestSymbolAPI.py (1897 of 2087) PASS: lldb-api :: lang/c/stepping/TestStepAndBreakpoints.py (1898 of 2087) PASS: lldb-api :: functionalities/breakpoint/source_regexp/TestSourceRegexBreakpoints.py (1899 of 2087) PASS: lldb-api :: functionalities/object-file/TestImageListMultiArchitecture.py (1900 of 2087) UNSUPPORTED: lldb-api :: commands/expression/completion-crash-invalid-iterator/TestInvalidIteratorCompletionCrash.py (1901 of 2087) PASS: lldb-unit :: UnwindAssembly/x86/./UnwindAssemblyx86Tests/Testx86AssemblyInspectionEngine.TestSubESP (1902 of 2087) PASS: lldb-api :: functionalities/signal/raise/TestRaise.py (1903 of 2087) PASS: lldb-api :: lang/objc/objc-dyn-sbtype/TestObjCDynamicSBType.py (1904 of 2087) PASS: lldb-api :: commands/expression/inline-namespace/TestInlineNamespace.py (1905 of 2087) PASS: lldb-unit :: Core/./LLDBCoreTests/RichManglingContextTest.Basic (1906 of 2087) PASS: lldb-unit :: Utility/./UtilityTests/Predicate.WaitForValueEqualTo (1907 of 2087) PASS: lldb-unit :: Utility/./UtilityTests/ConstStringTest.MangledCounterpart (1908 of 2087) PASS: lldb-shell :: ObjectFile/wasm/unified-debug-sections.yaml (1909 of 2087) PASS: lldb-api :: lang/objc/direct-dispatch-step/TestObjCDirectDispatchStepping.py (1910 of 2087) PASS: lldb-api :: functionalities/unwind/zeroth_frame/TestZerothFrame.py (1911 of 2087) UNSUPPORTED: lldb-shell :: ScriptInterpreter/Lua/watchpoint_callback.test (1912 of 2087) PASS: lldb-api :: macosx/safe-to-func-call/TestSafeFuncCalls.py (1913 of 2087) PASS: lldb-api :: functionalities/thread/concurrent_events/TestConcurrentManyWatchpoints.py (1914 of 2087) PASS: lldb-shell :: BuildScript/compiler-full-path.test (1915 of 2087) PASS: lldb-unit :: Utility/./UtilityTests/DataExtractorTest.GetMaxU64_unchecked (1916 of 2087) PASS: lldb-unit :: Expression/./ExpressionTests/CppModuleConfigurationTest.UnknownLibCppFile (1917 of 2087) PASS: lldb-api :: lang/objc/radar-9691614/TestObjCMethodReturningBOOL.py (1918 of 2087) PASS: lldb-unit :: Interpreter/./InterpreterTests/OptionArgParserTest.toBoolean (1919 of 2087) PASS: lldb-api :: commands/command/script/import/TestImport.py (1920 of 2087) PASS: lldb-unit :: UnwindAssembly/x86/./UnwindAssemblyx86Tests/Testx86AssemblyInspectionEngine.Test32bitFramelessBigStackFrame (1921 of 2087) UNSUPPORTED: lldb-shell :: SymbolFile/PDB/typedefs.test (1922 of 2087) PASS: lldb-unit :: Host/./HostTests/SocketTest.TCPGetConnectURI (1923 of 2087) PASS: lldb-shell :: ObjectFile/ELF/gnu-debuglink.yaml (1924 of 2087) PASS: lldb-shell :: ObjectFile/wasm/basic.yaml (1925 of 2087) UNSUPPORTED: lldb-shell :: Register/arm-gp-read.test (1926 of 2087) PASS: lldb-unit :: Interpreter/./InterpreterTests/OptionArgParserTest.toScriptLanguage (1927 of 2087) PASS: lldb-unit :: Utility/./UtilityTests/EventTest.DumpEventDataBytes (1928 of 2087) PASS: lldb-shell :: Quit/TestQuitExitCodeNonInt.test (1929 of 2087) PASS: lldb-api :: linux/builtin_trap/TestBuiltinTrap.py (1930 of 2087) PASS: lldb-api :: api/multiple-targets/TestMultipleTargets.py (1931 of 2087) PASS: lldb-shell :: Reproducer/Functionalities/TestImageList.test (1932 of 2087) PASS: lldb-shell :: Register/x86-64-ymm-read.test (1933 of 2087) PASS: lldb-api :: functionalities/breakpoint/require_hw_breakpoints/TestRequireHWBreakpoints.py (1934 of 2087) PASS: lldb-unit :: Utility/./UtilityTests/StringExtractorTest.GetU64LittleEndian (1935 of 2087) PASS: lldb-unit :: Utility/./UtilityTests/ConstStringTest.CompareConstString (1936 of 2087) PASS: lldb-api :: tools/lldb-server/inferior-crash/TestGdbRemoteAbort.py (1937 of 2087) PASS: lldb-unit :: Utility/./UtilityTests/TimerTest.CategoryTimes (1938 of 2087) PASS: lldb-api :: lang/cpp/static_methods/TestCPPStaticMethods.py (1939 of 2087) PASS: lldb-shell :: SymbolFile/DWARF/debug-types-dwarf5.s (1940 of 2087) PASS: lldb-unit :: Utility/./UtilityTests/StringListTest.InsertStringAtIndexEnd (1941 of 2087) PASS: lldb-unit :: Utility/./UtilityTests/StreamTeeTest.Assignment (1942 of 2087) PASS: lldb-unit :: Utility/./UtilityTests/VMRange.Ordering (1943 of 2087) PASS: lldb-unit :: Utility/./UtilityTests/RangeDataVector.FindEntryThatContains_Overlap (1944 of 2087) PASS: lldb-unit :: Utility/./UtilityTests/TimerTest.CategoryTimesNested (1945 of 2087) PASS: lldb-unit :: Process/gdb-remote/./ProcessGdbRemoteTests/GDBRemoteClientBaseTest.InterruptNoResponse (1946 of 2087) PASS: lldb-unit :: ObjectFile/Breakpad/./ObjectFileBreakpadTests/StackCFIRecord.parse (1947 of 2087) UNSUPPORTED: lldb-api :: functionalities/data-formatter/data-formatter-stl/libstdcpp/smart_ptr/TestDataFormatterStdSmartPtr.py (1948 of 2087) PASS: lldb-shell :: Quit/TestQuitExitCode0.test (1949 of 2087) PASS: lldb-unit :: Utility/./UtilityTests/LogTest.LLDB_LOG_nullptr (1950 of 2087) PASS: lldb-unit :: Process/minidump/./LLDBMinidumpTests/MinidumpParserTest.GetMemoryRegionInfo (1951 of 2087) PASS: lldb-api :: functionalities/tail_call_frames/sbapi_support/TestTailCallFrameSBAPI.py (1952 of 2087) PASS: lldb-unit :: API/./APITests/SBCommandInterpreterTest.SingleWordCommand (1953 of 2087) PASS: lldb-api :: commands/expression/vector_of_enums/TestVectorOfEnums.py (1954 of 2087) PASS: lldb-api :: python_api/module_section/TestModuleAndSection.py (1955 of 2087) PASS: lldb-api :: functionalities/thread/concurrent_events/TestConcurrentTwoWatchpointThreads.py (1956 of 2087) UNSUPPORTED: lldb-api :: tools/lldb-server/signal-filtering/TestGdbRemote_QPassSignals.py (1957 of 2087) PASS: lldb-api :: lang/cpp/alignas_base_class/TestAlignAsBaseClass.py (1958 of 2087) PASS: lldb-api :: commands/command/nested_alias/TestNestedAlias.py (1959 of 2087) PASS: lldb-api :: functionalities/tail_call_frames/thread_step_out_message/TestArtificialFrameStepOutMessage.py (1960 of 2087) PASS: lldb-unit :: Utility/./UtilityTests/FileSpecTest.FileAndDirectoryComponents (1961 of 2087) PASS: lldb-api :: commands/expression/unicode-in-variable/TestUnicodeInVariable.py (1962 of 2087) PASS: lldb-shell :: ObjectFile/ELF/PT_TLS-overlap-PT_LOAD.yaml (1963 of 2087) PASS: lldb-unit :: Language/Highlighting/./HighlighterTests/HighlighterTest.ClangStringLiterals (1964 of 2087) PASS: lldb-api :: commands/expression/no-deadlock/TestExprDoesntBlock.py (1965 of 2087) PASS: lldb-unit :: UnwindAssembly/ARM64/./Arm64InstEmulationTests/TestArm64InstEmulation.TestSimpleDarwinFunction (1966 of 2087) PASS: lldb-api :: lang/cpp/incomplete-types/TestCppIncompleteTypes.py (1967 of 2087) PASS: lldb-shell :: Minidump/memory-region-from-module.yaml (1968 of 2087) PASS: lldb-api :: macosx/nslog/TestDarwinNSLogOutput.py (1969 of 2087) PASS: lldb-api :: python_api/breakpoint/TestBreakpointAPI.py (1970 of 2087) PASS: lldb-unit :: SymbolFile/NativePDB/./SymbolFileNativePDBTests/PDBFPOProgramToDWARFExpressionTests.MissingTargetRegister (1971 of 2087) PASS: lldb-unit :: UnwindAssembly/ARM64/./Arm64InstEmulationTests/TestArm64InstEmulation.TestRegisterSavedTwice (1972 of 2087) UNSUPPORTED: lldb-api :: lang/objc/objc-dynamic-value/TestObjCDynamicValue.py (1973 of 2087) PASS: lldb-api :: functionalities/target_var/TestTargetVar.py (1974 of 2087) UNSUPPORTED: lldb-api :: functionalities/longjmp/TestLongjmp.py (1975 of 2087) PASS: lldb-api :: commands/expression/import-std-module/empty-module/TestEmptyStdModule.py (1976 of 2087) PASS: lldb-api :: functionalities/pointer_num_children/TestPointerNumChildren.py (1977 of 2087) PASS: lldb-shell :: SymbolFile/DWARF/debug_loc.s (1978 of 2087) PASS: lldb-api :: commands/expression/test/TestExprs.py (1979 of 2087) PASS: lldb-unit :: Utility/./UtilityTests/AnsiTerminal.Incomplete (1980 of 2087) PASS: lldb-unit :: Utility/./UtilityTests/ArgsTest.EscapeLLDBCommandArgument (1981 of 2087) PASS: lldb-unit :: Utility/./UtilityTests/StringListTest.ShiftStdString (1982 of 2087) PASS: lldb-unit :: Utility/./UtilityTests/StreamTest.PutHex32ByteOrderLittle (1983 of 2087) PASS: lldb-shell :: Driver/TestTarget.test (1984 of 2087) PASS: lldb-api :: python_api/objc_type/TestObjCType.py (1985 of 2087) PASS: lldb-unit :: Utility/./UtilityTests/ArgsTest.ReplaceArgumentAtIndexFarOutOfRange (1986 of 2087) PASS: lldb-unit :: Utility/./UtilityTests/RecordReplayTest.InstrumentedBarPtr (1987 of 2087) PASS: lldb-api :: commands/target/basic/TestTargetCommand.py (1988 of 2087) PASS: lldb-api :: functionalities/signal/handle-abrt/TestHandleAbort.py (1989 of 2087) PASS: lldb-api :: functionalities/data-formatter/boolreference/TestFormattersBoolRefPtr.py (1990 of 2087) PASS: lldb-unit :: Utility/./UtilityTests/UriParserTest.LongPath (1991 of 2087) PASS: lldb-unit :: Host/./HostTests/NativeProcessProtocolTest.SetBreakpointFailVerify (1992 of 2087) PASS: lldb-unit :: Utility/./UtilityTests/TimerTest.CategoryTimesStats (1993 of 2087) PASS: lldb-unit :: Utility/./UtilityTests/AnsiTerminal.AtEnd (1994 of 2087) PASS: lldb-unit :: Utility/./UtilityTests/SerializationRountripTest.SerializeDeserializeObjectReference (1995 of 2087) PASS: lldb-api :: lang/cpp/covariant-return-types/TestCovariantReturnTypes.py (1996 of 2087) UNSUPPORTED: lldb-api :: benchmarks/startup/TestStartupDelays.py (1997 of 2087) UNSUPPORTED: lldb-api :: linux/sepdebugsymlink/TestTargetSymbolsSepDebugSymlink.py (1998 of 2087) PASS: lldb-unit :: Process/minidump/./LLDBMinidumpTests/MinidumpParserTest.GetArchitecture (1999 of 2087) PASS: lldb-unit :: UnwindAssembly/ARM64/./Arm64InstEmulationTests/TestArm64InstEmulation.TestFramelessThreeEpilogueFunction (2000 of 2087) PASS: lldb-shell :: SymbolFile/NativePDB/tag-types.cpp (2001 of 2087) PASS: lldb-api :: functionalities/breakpoint/breakpoint_locations/TestBreakpointLocations.py (2002 of 2087) PASS: lldb-unit :: Process/gdb-remote/./ProcessGdbRemoteTests/GDBRemoteCommunicationServerTest.SendErrorResponse_StringError (2003 of 2087) PASS: lldb-shell :: SymbolFile/DWARF/find-qualified-variable.cpp (2004 of 2087) PASS: lldb-unit :: Language/Highlighting/./HighlighterTests/HighlighterTest.DefaultHighlighter (2005 of 2087) PASS: lldb-api :: functionalities/postmortem/minidump/TestMiniDump.py (2006 of 2087) PASS: lldb-api :: lang/c/struct_types/TestStructTypes.py (2007 of 2087) PASS: lldb-shell :: ObjectFile/PECOFF/uuid.yaml (2008 of 2087) PASS: lldb-api :: functionalities/data-formatter/compactvectors/TestCompactVectors.py (2009 of 2087) PASS: lldb-unit :: Symbol/./SymbolTests/TestTypeSystemClang.TestDisplayName (2010 of 2087) PASS: lldb-shell :: ScriptInterpreter/None/none.test (2011 of 2087) UNSUPPORTED: lldb-api :: functionalities/darwin_log/filter/regex/message/TestDarwinLogFilterRegexMessage.py (2012 of 2087) PASS: lldb-unit :: Host/./HostTests/SocketAddressTest.GetAddressInfo (2013 of 2087) PASS: lldb-api :: functionalities/thread/exit_during_step/TestExitDuringStep.py (2014 of 2087) PASS: lldb-api :: commands/process/launch/TestProcessLaunch.py (2015 of 2087) PASS: lldb-api :: commands/platform/file/close/TestPlatformFileClose.py (2016 of 2087) UNSUPPORTED: lldb-api :: functionalities/darwin_log/format/TestDarwinLogMessageFormat.py (2017 of 2087) PASS: lldb-unit :: Utility/./UtilityTests/RangeTest.ContainsRangeStartingFromZero (2018 of 2087) PASS: lldb-unit :: Utility/./UtilityTests/StreamTest.PutHex16ByteOrderBig (2019 of 2087) PASS: lldb-api :: lang/cpp/wchar_t/TestCxxWCharT.py (2020 of 2087) PASS: lldb-shell :: Driver/TestPositionalArgs.test (2021 of 2087) PASS: lldb-unit :: Utility/./UtilityTests/BinaryStreamTest.PutULEB128TwoBytes (2022 of 2087) PASS: lldb-api :: python_api/sblaunchinfo/TestSBLaunchInfo.py (2023 of 2087) PASS: lldb-unit :: Utility/./UtilityTests/OptionsWithRawTest.UnterminatedQuote (2024 of 2087) PASS: lldb-shell :: Commands/command-script-import.test (2025 of 2087) PASS: lldb-unit :: Utility/./UtilityTests/BinaryStreamTest.PutSLEB128TwoBytes (2026 of 2087) PASS: lldb-unit :: Core/./LLDBCoreTests/RichManglingContextTest.FromCxxMethodName (2027 of 2087) UNSUPPORTED: lldb-shell :: Reproducer/TestLuaImport.test (2028 of 2087) PASS: lldb-api :: iohandler/resize/TestIOHandlerResize.py (2029 of 2087) PASS: lldb-unit :: Utility/./UtilityTests/OptionsWithRawTest.SingleWhitespaceInput (2030 of 2087) PASS: lldb-api :: lang/c/bitfields/TestBitfields.py (2031 of 2087) PASS: lldb-unit :: Utility/./UtilityTests/VMRange.Clear (2032 of 2087) PASS: lldb-api :: functionalities/data-formatter/vector-types/TestVectorTypesFormatting.py (2033 of 2087) PASS: lldb-api :: functionalities/thread/jump/TestThreadJump.py (2034 of 2087) PASS: lldb-shell :: Minidump/no-process-id.yaml (2035 of 2087) PASS: lldb-api :: lang/c/local_variables/TestLocalVariables.py (2036 of 2087) PASS: lldb-unit :: Utility/./UtilityTests/PassiveReplayTest.InstrumentedBarRef (2037 of 2087) PASS: lldb-unit :: Utility/./UtilityTests/LogTest.Register (2038 of 2087) PASS: lldb-api :: lang/cpp/gmodules-templates/TestGModules.py (2039 of 2087) PASS: lldb-api :: functionalities/thread/concurrent_events/TestConcurrentSignalNWatchNBreak.py (2040 of 2087) PASS: lldb-api :: functionalities/tsan/basic/TestTsanBasic.py (2041 of 2087) PASS: lldb-unit :: Symbol/./SymbolTests/SymbolsTest.LocateExecutableSymbolFileForUnknownExecutableAndMissingSymbolFile (2042 of 2087) PASS: lldb-unit :: Process/minidump/./LLDBMinidumpTests/MinidumpParserTest.GetExceptionStream (2043 of 2087) PASS: lldb-unit :: Language/Highlighting/./HighlighterTests/HighlighterTest.ClangTrailingBackslashMissingNewLine (2044 of 2087) PASS: lldb-shell :: Settings/TestFrameFormatMangling.test (2045 of 2087) PASS: lldb-api :: lang/cpp/dynamic-value/TestCppValueCast.py (2046 of 2087) UNSUPPORTED: lldb-shell :: SymbolFile/DWARF/DW_TAG_GNU_call_site-DW_AT_low_pc.s (2047 of 2087) PASS: lldb-api :: lang/objc/modules-compile-error/TestModulesCompileError.py (2048 of 2087) PASS: lldb-unit :: UnwindAssembly/x86/./UnwindAssemblyx86Tests/Testx86AssemblyInspectionEngine.TestPushEBP (2049 of 2087) PASS: lldb-unit :: Utility/./UtilityTests/UriParserTest.BracketedHostnamePort (2050 of 2087) PASS: lldb-unit :: Utility/./UtilityTests/VMRange.Reset (2051 of 2087) PASS: lldb-shell :: BuildScript/modes.test (2052 of 2087) PASS: lldb-api :: commands/expression/multiline-navigation/TestMultilineNavigation.py (2053 of 2087) PASS: lldb-shell :: SymbolFile/Breakpad/unwind-via-stack-win-no-memory-info.yaml (2054 of 2087) PASS: lldb-unit :: Core/./LLDBCoreTests/MangledTest.EmptyForInvalidName (2055 of 2087) PASS: lldb-shell :: SymbolFile/Breakpad/line-table-missing-file.test (2056 of 2087) PASS: lldb-unit :: Utility/./UtilityTests/StreamTeeTest.CopyConstructor (2057 of 2087) PASS: lldb-api :: commands/frame/diagnose/complicated-expression/TestComplicatedExpression.py (2058 of 2087) PASS: lldb-unit :: Utility/./UtilityTests/StringLexerTest.AdvanceIf (2059 of 2087) PASS: lldb-api :: python_api/lldbutil/iter/TestRegistersIterator.py (2060 of 2087) PASS: lldb-unit :: Utility/./UtilityTests/StreamTest.PutHex16ByteOrderLittle (2061 of 2087) PASS: lldb-unit :: Utility/./UtilityTests/StringListTest.GetMaxStringLengthIncreasingSize (2062 of 2087) PASS: lldb-unit :: Host/./HostTests/FileActionTest.Open (2063 of 2087) PASS: lldb-unit :: Utility/./UtilityTests/RegularExpression.Invalid (2064 of 2087) PASS: lldb-api :: functionalities/thread/concurrent_events/TestConcurrentCrashWithWatchpointBreakpointSignal.py (2065 of 2087) PASS: lldb-unit :: ScriptInterpreter/Python/./ScriptInterpreterPythonTests/PythonDataObjectsTest.TestPythonTupleSize (2066 of 2087) PASS: lldb-api :: lang/mixed/TestMixedLanguages.py (2067 of 2087) PASS: lldb-unit :: Utility/./UtilityTests/SubsystemRAIITest.SubsystemWithErrorSuccess (2068 of 2087) PASS: lldb-unit :: Utility/./UtilityTests/FileSpecTest.Yaml (2069 of 2087) PASS: lldb-unit :: UnwindAssembly/x86/./UnwindAssemblyx86Tests/Testx86AssemblyInspectionEngine.TestPushR14 (2070 of 2087) PASS: lldb-api :: lang/c/conflicting-symbol/TestConflictingSymbol.py (2071 of 2087) PASS: lldb-unit :: Utility/./UtilityTests/FileSpecTest.IsRelative (2072 of 2087) PASS: lldb-unit :: Utility/./UtilityTests/BinaryStreamTest.PutULEB128FourBytes (2073 of 2087) PASS: lldb-api :: functionalities/tsan/thread_leak/TestTsanThreadLeak.py (2074 of 2087) PASS: lldb-unit :: Symbol/./SymbolTests/TestClangASTImporter.CopyTypeTagDecl (2075 of 2087) PASS: lldb-unit :: Utility/./UtilityTests/StringListTest.InsertStringAtIndexStdString (2076 of 2087) PASS: lldb-api :: functionalities/thread/concurrent_events/TestConcurrentDelaySignalWatch.py (2077 of 2087) PASS: lldb-shell :: ObjectFile/ELF/PT_LOAD-overlap-PT_INTERP.yaml (2078 of 2087) PASS: lldb-api :: lang/cpp/namespace_conflicts/TestNamespaceConflicts.py (2079 of 2087) PASS: lldb-shell :: SymbolFile/DWARF/dwarf5-partial-index.cpp (2080 of 2087) PASS: lldb-api :: commands/target/dump-symtab-demangle/TestDumpSymtabDemangle.py (2081 of 2087) PASS: lldb-api :: lang/objc/foundation/TestObjCMethodsString.py (2082 of 2087) PASS: lldb-api :: tools/lldb-vscode/breakpoint/TestVSCode_setBreakpoints.py (2083 of 2087) PASS: lldb-api :: lang/cpp/namespace/TestNamespace.py (2084 of 2087) PASS: lldb-api :: lang/objc/foundation/TestFoundationDisassembly.py (2085 of 2087) PASS: lldb-api :: types/TestIntegerTypeExpr.py (2086 of 2087) PASS: lldb-api :: tools/lldb-server/TestGdbRemoteThreadsInStopReply.py (2087 of 2087) Slowest Tests: -------------------------------------------------------------------------- 600.06s: lldb-api :: macosx/thread_suspend/TestInternalThreadSuspension.py 161.02s: lldb-api :: lang/objc/foundation/TestObjCMethods.py 127.77s: lldb-api :: lang/objc/foundation/TestObjCMethodsNSError.py 109.32s: lldb-api :: macosx/macabi/TestMacABImacOSFramework.py 97.84s: lldb-api :: tools/lldb-server/TestLldbGdbServer.py 89.59s: lldb-api :: functionalities/data-formatter/data-formatter-objc/cmtime/TestDataFormatterCMTime.py 85.56s: lldb-api :: lang/objc/foundation/TestFoundationDisassembly.py 85.55s: lldb-api :: lang/objc/hidden-ivars/TestHiddenIvars.py 81.52s: lldb-api :: lang/cpp/enum_types/TestCPP11EnumTypes.py 71.47s: lldb-api :: api/multithreaded/TestMultithreaded.py 71.32s: lldb-api :: lang/objc/exceptions/TestObjCExceptions.py 71.25s: lldb-api :: types/TestLongTypesExpr.py 69.87s: lldb-api :: functionalities/postmortem/mach-core/TestMachCore.py 63.25s: lldb-api :: lang/cpp/namespace/TestNamespaceLookup.py 58.72s: lldb-api :: lang/objc/objc-new-syntax/TestObjCNewSyntaxLiteral.py 55.36s: lldb-api :: functionalities/recursion/TestValueObjectRecursion.py 54.92s: lldb-api :: types/TestLongTypes.py 49.12s: lldb-api :: lang/objc/real-definition/TestRealDefinition.py 44.94s: lldb-api :: lang/objc/objc-new-syntax/TestObjCNewSyntaxArray.py 44.76s: lldb-api :: lang/objc/foundation/TestObjCMethodsString.py

Hide Details

Tests Times: -------------------------------------------------------------------------- [ Range ] :: [ Percentage ] :: [ Count ] -------------------------------------------------------------------------- [600s,650s) :: [ ] :: [ 1/2087] [550s,600s) :: [ ] :: [ 0/2087] [500s,550s) :: [ ] :: [ 0/2087] [450s,500s) :: [ ] :: [ 0/2087] [400s,450s) :: [ ] :: [ 0/2087] [350s,400s) :: [ ] :: [ 0/2087] [300s,350s) :: [ ] :: [ 0/2087] [250s,300s) :: [ ] :: [ 0/2087] [200s,250s) :: [ ] :: [ 0/2087] [150s,200s) :: [ ] :: [ 1/2087] [100s,150s) :: [ ] :: [ 3/2087] [ 50s,100s) :: [ ] :: [ 13/2087] [ 0s, 50s) :: [*************************************** ] :: [2069/2087] -------------------------------------------------------------------------- ******************** Timed Out Tests (1): lldb-api :: macosx/thread_suspend/TestInternalThreadSuspension.py

Hide Details

Hide Details

Testing Time: 1109.56s Unsupported : 151 Passed : 1929 Expectedly Failed: 6 Timed Out : 1 FAILED: tools/lldb/test/CMakeFiles/check-lldb-lit cd /Users/buildslave/jenkins/workspace/lldb-cmake/lldb-build/tools/lldb/test && /usr/local/Frameworks/Python.framework/Versions/3.7/bin/python3.7 /Users/buildslave/jenkins/workspace/lldb-cmake/lldb-build/./bin/llvm-lit -v --time-tests --shuffle --xunit-xml-output=/Users/buildslave/jenkins/workspace/lldb-cmake/test/results.xml -v /Users/buildslave/jenkins/workspace/lldb-cmake/lldb-build/tools/lldb/test ninja: build stopped: subcommand failed. Command failed: Command '['/usr/bin/env', 'TERM=vt100', '/usr/local/bin/ninja', '-v', 'check-lldb']' returned non-zero exit status 1 Command: ['/usr/bin/env', 'TERM=vt100', '/usr/local/bin/ninja', '-v', 'check-lldb'] [Pipeline] } [Pipeline] // timeout [Pipeline] } [Pipeline] // stage [Pipeline] stage [Pipeline] { (Declarative: Post Actions) [Pipeline] scanForIssues [Clang (LLVM based)] Sleeping for 5 seconds due to JENKINS-32191... [Clang (LLVM based)] Parsing console log (workspace: '/Users/buildslave/jenkins/workspace/lldb-cmake') [Clang (LLVM based)] Successfully parsed console log [Clang (LLVM based)] -> found 13 issues (skipped 84 duplicates) [Clang (LLVM based)] Post processing issues on 'green-dragon-10' with source code encoding 'UTF-8' [Clang (LLVM based)] Creating SCM blamer to obtain author and commit information for affected files [Clang (LLVM based)] Creating SCM miner to obtain statistics for affected repository files [Clang (LLVM based)] Resolving file names for all issues in source directory '/Users/buildslave/jenkins/workspace/lldb-cmake' [Clang (LLVM based)] -> resolved paths in source directory (9 found, 0 not found) [Clang (LLVM based)] Resolving module names from module definitions (build.xml, pom.xml, or Manifest.mf files) [Clang (LLVM based)] -> resolved module names for 13 issues [Clang (LLVM based)] Resolving package names (or namespaces) by parsing the affected files [Clang (LLVM based)] -> resolved package names of 8 affected files [Clang (LLVM based)] No filter has been set, publishing all 12 issues [Clang (LLVM based)] Creating fingerprints for all affected code blocks to track issues over different builds [Clang (LLVM based)] -> created fingerprints for 12 issues (skipped 0 issues) [Clang (LLVM based)] Copying affected files to Jenkins' build folder '/Users/Shared/Jenkins/Home/jobs/lldb-cmake/builds/22751/files-with-issues' [Clang (LLVM based)] -> 6 copied, 2 not in workspace, 0 not-found, 0 with I/O error [Pipeline] junit Recording test results [Pipeline] emailext Not sending mail to unregistered user roger.ferrer@bsc.es because your SCM claimed this was associated with a user ID ‘roger.ferrer' which your security realm does not recognize; you may need changes in your SCM plugin Not sending mail to unregistered user erich.keane@intel.com because your SCM claimed this was associated with a user ID ‘erich.keane' which your security realm does not recognize; you may need changes in your SCM plugin Not sending mail to unregistered user SourabhSingh.Tomar@amd.com because your SCM claimed this was associated with a user ID ‘SourabhSingh.Tomar' which your security realm does not recognize; you may need changes in your SCM plugin Not sending mail to unregistered user jay.foad@gmail.com because your SCM claimed this was associated with a user ID ‘jay.foad' which your security realm does not recognize; you may need changes in your SCM plugin Not sending mail to unregistered user spatel@rotateright.com because your SCM claimed this was associated with a user ID ‘spatel' which your security realm does not recognize; you may need changes in your SCM plugin Not sending mail to unregistered user grimar@accesssoftek.com because your SCM claimed this was associated with a user ID ‘grimar' which your security realm does not recognize; you may need changes in your SCM plugin Not sending mail to unregistered user sguelton@redhat.com because your SCM claimed this was associated with a user ID ‘sguelton' which your security realm does not recognize; you may need changes in your SCM plugin Not sending mail to unregistered user roger.ferrer@bsc.es because your SCM claimed this was associated with a user ID ‘roger.ferrer' which your security realm does not recognize; you may need changes in your SCM plugin Not sending mail to unregistered user erich.keane@intel.com because your SCM claimed this was associated with a user ID ‘erich.keane' which your security realm does not recognize; you may need changes in your SCM plugin Not sending mail to unregistered user SourabhSingh.Tomar@amd.com because your SCM claimed this was associated with a user ID ‘SourabhSingh.Tomar' which your security realm does not recognize; you may need changes in your SCM plugin Not sending mail to unregistered user jay.foad@gmail.com because your SCM claimed this was associated with a user ID ‘jay.foad' which your security realm does not recognize; you may need changes in your SCM plugin Not sending mail to unregistered user spatel@rotateright.com because your SCM claimed this was associated with a user ID ‘spatel' which your security realm does not recognize; you may need changes in your SCM plugin Not sending mail to unregistered user grimar@accesssoftek.com because your SCM claimed this was associated with a user ID ‘grimar' which your security realm does not recognize; you may need changes in your SCM plugin Not sending mail to unregistered user sguelton@redhat.com because your SCM claimed this was associated with a user ID ‘sguelton' which your security realm does not recognize; you may need changes in your SCM plugin

Hide Details

Begin Pre-Send Script... Sending email to: mschifer@apple.com risemann@apple.com Amara Emerson <amara@apple.com> Azhar Mohammed <azhar@apple.com>
[Pipeline] } [Pipeline] // stage [Pipeline] } [Pipeline] // withEnv [Pipeline] } [Pipeline] // node [Pipeline] End of Pipeline ERROR: script returned exit code 1 Finished: FAILURE