FailedConsole Output

Skipping 16,378 KB.. Full Log
-hidden -Werror=date-time -Werror=unguarded-availability-new -fmodules -fmodules-cache-path=/Users/buildslave/jenkins/workspace/lldb-cmake/lldb-build/module.cache -fcxx-modules -Xclang -fmodules-local-submodule-visibility -Wall -Wextra -Wno-unused-parameter -Wwrite-strings -Wcast-qual -Wmissing-field-initializers -pedantic -Wno-long-long -Wimplicit-fallthrough -Wcovered-switch-default -Wno-noexcept-type -Wnon-virtual-dtor -Wdelete-non-virtual-dtor -Wstring-conversion -fdiagnostics-color -O3  -isysroot /Applications/Xcode.app/Contents/Developer/Platforms/MacOSX.platform/Developer/SDKs/MacOSX10.15.sdk -Wl,-search_paths_first -Wl,-headerpad_max_install_names -Wl,-dead_strip tools/llvm-yaml-numeric-parser-fuzzer/CMakeFiles/llvm-yaml-numeric-parser-fuzzer.dir/DummyYAMLNumericParserFuzzer.cpp.o tools/llvm-yaml-numeric-parser-fuzzer/CMakeFiles/llvm-yaml-numeric-parser-fuzzer.dir/yaml-numeric-parser-fuzzer.cpp.o  -o bin/llvm-yaml-numeric-parser-fuzzer  -Wl,-rpath,@loader_path/../lib  lib/libLLVMSupport.a  lib/libLLVMFuzzMutate.a  lib/libLLVMBitWriter.a  lib/libLLVMScalarOpts.a  lib/libLLVMAggressiveInstCombine.a  lib/libLLVMInstCombine.a  lib/libLLVMTransformUtils.a  lib/libLLVMTarget.a  lib/libLLVMAnalysis.a  lib/libLLVMObject.a  lib/libLLVMBitReader.a  lib/libLLVMMCParser.a  lib/libLLVMTextAPI.a  lib/libLLVMProfileData.a  lib/libLLVMCore.a  lib/libLLVMRemarks.a  lib/libLLVMBitstreamReader.a  lib/libLLVMMC.a  lib/libLLVMBinaryFormat.a  lib/libLLVMDebugInfoCodeView.a  lib/libLLVMDebugInfoMSF.a  lib/libLLVMSupport.a  -lz  -lcurses  -lm  lib/libLLVMDemangle.a && :
[10319/10388] /Users/buildslave/jenkins/workspace/lldb-cmake/host-compiler/bin/clang++  -DGTEST_HAS_RTTI=0 -D_DEBUG -D__STDC_CONSTANT_MACROS -D__STDC_FORMAT_MACROS -D__STDC_LIMIT_MACROS -Itools/llvm-xray -I/Users/buildslave/jenkins/workspace/lldb-cmake/llvm-project/llvm/tools/llvm-xray -I/Applications/Xcode.app/Contents/Developer/Platforms/MacOSX.platform/Developer/SDKs/MacOSX10.15.sdk/usr/include/libxml2 -Iinclude -I/Users/buildslave/jenkins/workspace/lldb-cmake/llvm-project/llvm/include -Wdocumentation -fPIC -fvisibility-inlines-hidden -Werror=date-time -Werror=unguarded-availability-new -fmodules -fmodules-cache-path=/Users/buildslave/jenkins/workspace/lldb-cmake/lldb-build/module.cache -fcxx-modules -Xclang -fmodules-local-submodule-visibility -Wall -Wextra -Wno-unused-parameter -Wwrite-strings -Wcast-qual -Wmissing-field-initializers -pedantic -Wno-long-long -Wimplicit-fallthrough -Wcovered-switch-default -Wno-noexcept-type -Wnon-virtual-dtor -Wdelete-non-virtual-dtor -Wstring-conversion -fdiagnostics-color -O3  -isysroot /Applications/Xcode.app/Contents/Developer/Platforms/MacOSX.platform/Developer/SDKs/MacOSX10.15.sdk    -fno-exceptions -fno-rtti -UNDEBUG -std=c++14 -MD -MT tools/llvm-xray/CMakeFiles/llvm-xray.dir/xray-extract.cpp.o -MF tools/llvm-xray/CMakeFiles/llvm-xray.dir/xray-extract.cpp.o.d -o tools/llvm-xray/CMakeFiles/llvm-xray.dir/xray-extract.cpp.o -c /Users/buildslave/jenkins/workspace/lldb-cmake/llvm-project/llvm/tools/llvm-xray/xray-extract.cpp
[10320/10388] /Users/buildslave/jenkins/workspace/lldb-cmake/host-compiler/bin/clang++  -DGTEST_HAS_RTTI=0 -D_DEBUG -D__STDC_CONSTANT_MACROS -D__STDC_FORMAT_MACROS -D__STDC_LIMIT_MACROS -Itools/obj2yaml -I/Users/buildslave/jenkins/workspace/lldb-cmake/llvm-project/llvm/tools/obj2yaml -I/Applications/Xcode.app/Contents/Developer/Platforms/MacOSX.platform/Developer/SDKs/MacOSX10.15.sdk/usr/include/libxml2 -Iinclude -I/Users/buildslave/jenkins/workspace/lldb-cmake/llvm-project/llvm/include -Wdocumentation -fPIC -fvisibility-inlines-hidden -Werror=date-time -Werror=unguarded-availability-new -fmodules -fmodules-cache-path=/Users/buildslave/jenkins/workspace/lldb-cmake/lldb-build/module.cache -fcxx-modules -Xclang -fmodules-local-submodule-visibility -Wall -Wextra -Wno-unused-parameter -Wwrite-strings -Wcast-qual -Wmissing-field-initializers -pedantic -Wno-long-long -Wimplicit-fallthrough -Wcovered-switch-default -Wno-noexcept-type -Wnon-virtual-dtor -Wdelete-non-virtual-dtor -Wstring-conversion -fdiagnostics-color -O3  -isysroot /Applications/Xcode.app/Contents/Developer/Platforms/MacOSX.platform/Developer/SDKs/MacOSX10.15.sdk    -fno-exceptions -fno-rtti -UNDEBUG -std=c++14 -MD -MT tools/obj2yaml/CMakeFiles/obj2yaml.dir/obj2yaml.cpp.o -MF tools/obj2yaml/CMakeFiles/obj2yaml.dir/obj2yaml.cpp.o.d -o tools/obj2yaml/CMakeFiles/obj2yaml.dir/obj2yaml.cpp.o -c /Users/buildslave/jenkins/workspace/lldb-cmake/llvm-project/llvm/tools/obj2yaml/obj2yaml.cpp
[10321/10388] /Users/buildslave/jenkins/workspace/lldb-cmake/host-compiler/bin/clang++  -DGTEST_HAS_RTTI=0 -D_DEBUG -D__STDC_CONSTANT_MACROS -D__STDC_FORMAT_MACROS -D__STDC_LIMIT_MACROS -Itools/llvm-rtdyld -I/Users/buildslave/jenkins/workspace/lldb-cmake/llvm-project/llvm/tools/llvm-rtdyld -I/Applications/Xcode.app/Contents/Developer/Platforms/MacOSX.platform/Developer/SDKs/MacOSX10.15.sdk/usr/include/libxml2 -Iinclude -I/Users/buildslave/jenkins/workspace/lldb-cmake/llvm-project/llvm/include -Wdocumentation -fPIC -fvisibility-inlines-hidden -Werror=date-time -Werror=unguarded-availability-new -fmodules -fmodules-cache-path=/Users/buildslave/jenkins/workspace/lldb-cmake/lldb-build/module.cache -fcxx-modules -Xclang -fmodules-local-submodule-visibility -Wall -Wextra -Wno-unused-parameter -Wwrite-strings -Wcast-qual -Wmissing-field-initializers -pedantic -Wno-long-long -Wimplicit-fallthrough -Wcovered-switch-default -Wno-noexcept-type -Wnon-virtual-dtor -Wdelete-non-virtual-dtor -Wstring-conversion -fdiagnostics-color -O3  -isysroot /Applications/Xcode.app/Contents/Developer/Platforms/MacOSX.platform/Developer/SDKs/MacOSX10.15.sdk    -fno-exceptions -fno-rtti -UNDEBUG -std=c++14 -MD -MT tools/llvm-rtdyld/CMakeFiles/llvm-rtdyld.dir/llvm-rtdyld.cpp.o -MF tools/llvm-rtdyld/CMakeFiles/llvm-rtdyld.dir/llvm-rtdyld.cpp.o.d -o tools/llvm-rtdyld/CMakeFiles/llvm-rtdyld.dir/llvm-rtdyld.cpp.o -c /Users/buildslave/jenkins/workspace/lldb-cmake/llvm-project/llvm/tools/llvm-rtdyld/llvm-rtdyld.cpp
[10322/10388] : && /Users/buildslave/jenkins/workspace/lldb-cmake/host-compiler/bin/clang++  -Wdocumentation -fPIC -fvisibility-inlines-hidden -Werror=date-time -Werror=unguarded-availability-new -fmodules -fmodules-cache-path=/Users/buildslave/jenkins/workspace/lldb-cmake/lldb-build/module.cache -fcxx-modules -Xclang -fmodules-local-submodule-visibility -Wall -Wextra -Wno-unused-parameter -Wwrite-strings -Wcast-qual -Wmissing-field-initializers -pedantic -Wno-long-long -Wimplicit-fallthrough -Wcovered-switch-default -Wno-noexcept-type -Wnon-virtual-dtor -Wdelete-non-virtual-dtor -Wstring-conversion -fdiagnostics-color -O3  -isysroot /Applications/Xcode.app/Contents/Developer/Platforms/MacOSX.platform/Developer/SDKs/MacOSX10.15.sdk -Wl,-search_paths_first -Wl,-headerpad_max_install_names -Wl,-dead_strip tools/llvm-rtdyld/CMakeFiles/llvm-rtdyld.dir/llvm-rtdyld.cpp.o  -o bin/llvm-rtdyld  -Wl,-rpath,@loader_path/../lib  lib/libLLVMAArch64Disassembler.a  lib/libLLVMAMDGPUDisassembler.a  lib/libLLVMARMDisassembler.a  lib/libLLVMAVRDisassembler.a  lib/libLLVMBPFDisassembler.a  lib/libLLVMHexagonDisassembler.a  lib/libLLVMLanaiDisassembler.a  lib/libLLVMMipsDisassembler.a  lib/libLLVMMSP430Disassembler.a  lib/libLLVMPowerPCDisassembler.a  lib/libLLVMRISCVDisassembler.a  lib/libLLVMSparcDisassembler.a  lib/libLLVMSystemZDisassembler.a  lib/libLLVMWebAssemblyDisassembler.a  lib/libLLVMX86Disassembler.a  lib/libLLVMXCoreDisassembler.a  lib/libLLVMAArch64Desc.a  lib/libLLVMAMDGPUDesc.a  lib/libLLVMARMDesc.a  lib/libLLVMAVRDesc.a  lib/libLLVMBPFDesc.a  lib/libLLVMHexagonDesc.a  lib/libLLVMLanaiDesc.a  lib/libLLVMMipsDesc.a  lib/libLLVMMSP430Desc.a  lib/libLLVMNVPTXDesc.a  lib/libLLVMPowerPCDesc.a  lib/libLLVMRISCVDesc.a  lib/libLLVMSparcDesc.a  lib/libLLVMSystemZDesc.a  lib/libLLVMWebAssemblyDesc.a  lib/libLLVMX86Desc.a  lib/libLLVMXCoreDesc.a  lib/libLLVMAArch64Info.a  lib/libLLVMAMDGPUInfo.a  lib/libLLVMARMInfo.a  lib/libLLVMAVRInfo.a  lib/libLLVMBPFInfo.a  lib/libLLVMHexagonInfo.a  lib/libLLVMLanaiInfo.a  lib/libLLVMMipsInfo.a  lib/libLLVMMSP430Info.a  lib/libLLVMNVPTXInfo.a  lib/libLLVMPowerPCInfo.a  lib/libLLVMRISCVInfo.a  lib/libLLVMSparcInfo.a  lib/libLLVMSystemZInfo.a  lib/libLLVMWebAssemblyInfo.a  lib/libLLVMX86Info.a  lib/libLLVMXCoreInfo.a  lib/libLLVMDebugInfoDWARF.a  lib/libLLVMExecutionEngine.a  lib/libLLVMMC.a  lib/libLLVMObject.a  lib/libLLVMRuntimeDyld.a  lib/libLLVMSupport.a  lib/libLLVMAArch64Utils.a  lib/libLLVMAMDGPUUtils.a  lib/libLLVMARMUtils.a  lib/libLLVMRISCVUtils.a  lib/libLLVMMCDisassembler.a  lib/libLLVMTarget.a  lib/libLLVMAnalysis.a  lib/libLLVMObject.a  lib/libLLVMBitReader.a  lib/libLLVMMCParser.a  lib/libLLVMMC.a  lib/libLLVMDebugInfoCodeView.a  lib/libLLVMDebugInfoMSF.a  lib/libLLVMTextAPI.a  lib/libLLVMProfileData.a  lib/libLLVMCore.a  lib/libLLVMBinaryFormat.a  lib/libLLVMRemarks.a  lib/libLLVMBitstreamReader.a  lib/libLLVMSupport.a  -lz  -lcurses  -lm  lib/libLLVMDemangle.a && :
[10323/10388] /Users/buildslave/jenkins/workspace/lldb-cmake/host-compiler/bin/clang++  -DGTEST_HAS_RTTI=0 -D_DEBUG -D__STDC_CONSTANT_MACROS -D__STDC_FORMAT_MACROS -D__STDC_LIMIT_MACROS -Itools/llvm-xray -I/Users/buildslave/jenkins/workspace/lldb-cmake/llvm-project/llvm/tools/llvm-xray -I/Applications/Xcode.app/Contents/Developer/Platforms/MacOSX.platform/Developer/SDKs/MacOSX10.15.sdk/usr/include/libxml2 -Iinclude -I/Users/buildslave/jenkins/workspace/lldb-cmake/llvm-project/llvm/include -Wdocumentation -fPIC -fvisibility-inlines-hidden -Werror=date-time -Werror=unguarded-availability-new -fmodules -fmodules-cache-path=/Users/buildslave/jenkins/workspace/lldb-cmake/lldb-build/module.cache -fcxx-modules -Xclang -fmodules-local-submodule-visibility -Wall -Wextra -Wno-unused-parameter -Wwrite-strings -Wcast-qual -Wmissing-field-initializers -pedantic -Wno-long-long -Wimplicit-fallthrough -Wcovered-switch-default -Wno-noexcept-type -Wnon-virtual-dtor -Wdelete-non-virtual-dtor -Wstring-conversion -fdiagnostics-color -O3  -isysroot /Applications/Xcode.app/Contents/Developer/Platforms/MacOSX.platform/Developer/SDKs/MacOSX10.15.sdk    -fno-exceptions -fno-rtti -UNDEBUG -std=c++14 -MD -MT tools/llvm-xray/CMakeFiles/llvm-xray.dir/xray-converter.cpp.o -MF tools/llvm-xray/CMakeFiles/llvm-xray.dir/xray-converter.cpp.o.d -o tools/llvm-xray/CMakeFiles/llvm-xray.dir/xray-converter.cpp.o -c /Users/buildslave/jenkins/workspace/lldb-cmake/llvm-project/llvm/tools/llvm-xray/xray-converter.cpp
[10324/10388] /Users/buildslave/jenkins/workspace/lldb-cmake/host-compiler/bin/clang++  -DGTEST_HAS_RTTI=0 -D_DEBUG -D__STDC_CONSTANT_MACROS -D__STDC_FORMAT_MACROS -D__STDC_LIMIT_MACROS -Itools/obj2yaml -I/Users/buildslave/jenkins/workspace/lldb-cmake/llvm-project/llvm/tools/obj2yaml -I/Applications/Xcode.app/Contents/Developer/Platforms/MacOSX.platform/Developer/SDKs/MacOSX10.15.sdk/usr/include/libxml2 -Iinclude -I/Users/buildslave/jenkins/workspace/lldb-cmake/llvm-project/llvm/include -Wdocumentation -fPIC -fvisibility-inlines-hidden -Werror=date-time -Werror=unguarded-availability-new -fmodules -fmodules-cache-path=/Users/buildslave/jenkins/workspace/lldb-cmake/lldb-build/module.cache -fcxx-modules -Xclang -fmodules-local-submodule-visibility -Wall -Wextra -Wno-unused-parameter -Wwrite-strings -Wcast-qual -Wmissing-field-initializers -pedantic -Wno-long-long -Wimplicit-fallthrough -Wcovered-switch-default -Wno-noexcept-type -Wnon-virtual-dtor -Wdelete-non-virtual-dtor -Wstring-conversion -fdiagnostics-color -O3  -isysroot /Applications/Xcode.app/Contents/Developer/Platforms/MacOSX.platform/Developer/SDKs/MacOSX10.15.sdk    -fno-exceptions -fno-rtti -UNDEBUG -std=c++14 -MD -MT tools/obj2yaml/CMakeFiles/obj2yaml.dir/minidump2yaml.cpp.o -MF tools/obj2yaml/CMakeFiles/obj2yaml.dir/minidump2yaml.cpp.o.d -o tools/obj2yaml/CMakeFiles/obj2yaml.dir/minidump2yaml.cpp.o -c /Users/buildslave/jenkins/workspace/lldb-cmake/llvm-project/llvm/tools/obj2yaml/minidump2yaml.cpp
[10325/10388] /Users/buildslave/jenkins/workspace/lldb-cmake/host-compiler/bin/clang++  -DGTEST_HAS_RTTI=0 -D_DEBUG -D__STDC_CONSTANT_MACROS -D__STDC_FORMAT_MACROS -D__STDC_LIMIT_MACROS -Itools/llvm-xray -I/Users/buildslave/jenkins/workspace/lldb-cmake/llvm-project/llvm/tools/llvm-xray -I/Applications/Xcode.app/Contents/Developer/Platforms/MacOSX.platform/Developer/SDKs/MacOSX10.15.sdk/usr/include/libxml2 -Iinclude -I/Users/buildslave/jenkins/workspace/lldb-cmake/llvm-project/llvm/include -Wdocumentation -fPIC -fvisibility-inlines-hidden -Werror=date-time -Werror=unguarded-availability-new -fmodules -fmodules-cache-path=/Users/buildslave/jenkins/workspace/lldb-cmake/lldb-build/module.cache -fcxx-modules -Xclang -fmodules-local-submodule-visibility -Wall -Wextra -Wno-unused-parameter -Wwrite-strings -Wcast-qual -Wmissing-field-initializers -pedantic -Wno-long-long -Wimplicit-fallthrough -Wcovered-switch-default -Wno-noexcept-type -Wnon-virtual-dtor -Wdelete-non-virtual-dtor -Wstring-conversion -fdiagnostics-color -O3  -isysroot /Applications/Xcode.app/Contents/Developer/Platforms/MacOSX.platform/Developer/SDKs/MacOSX10.15.sdk    -fno-exceptions -fno-rtti -UNDEBUG -std=c++14 -MD -MT tools/llvm-xray/CMakeFiles/llvm-xray.dir/xray-graph-diff.cpp.o -MF tools/llvm-xray/CMakeFiles/llvm-xray.dir/xray-graph-diff.cpp.o.d -o tools/llvm-xray/CMakeFiles/llvm-xray.dir/xray-graph-diff.cpp.o -c /Users/buildslave/jenkins/workspace/lldb-cmake/llvm-project/llvm/tools/llvm-xray/xray-graph-diff.cpp
[10326/10388] /Users/buildslave/jenkins/workspace/lldb-cmake/host-compiler/bin/clang++  -DGTEST_HAS_RTTI=0 -D_DEBUG -D__STDC_CONSTANT_MACROS -D__STDC_FORMAT_MACROS -D__STDC_LIMIT_MACROS -Itools/obj2yaml -I/Users/buildslave/jenkins/workspace/lldb-cmake/llvm-project/llvm/tools/obj2yaml -I/Applications/Xcode.app/Contents/Developer/Platforms/MacOSX.platform/Developer/SDKs/MacOSX10.15.sdk/usr/include/libxml2 -Iinclude -I/Users/buildslave/jenkins/workspace/lldb-cmake/llvm-project/llvm/include -Wdocumentation -fPIC -fvisibility-inlines-hidden -Werror=date-time -Werror=unguarded-availability-new -fmodules -fmodules-cache-path=/Users/buildslave/jenkins/workspace/lldb-cmake/lldb-build/module.cache -fcxx-modules -Xclang -fmodules-local-submodule-visibility -Wall -Wextra -Wno-unused-parameter -Wwrite-strings -Wcast-qual -Wmissing-field-initializers -pedantic -Wno-long-long -Wimplicit-fallthrough -Wcovered-switch-default -Wno-noexcept-type -Wnon-virtual-dtor -Wdelete-non-virtual-dtor -Wstring-conversion -fdiagnostics-color -O3  -isysroot /Applications/Xcode.app/Contents/Developer/Platforms/MacOSX.platform/Developer/SDKs/MacOSX10.15.sdk    -fno-exceptions -fno-rtti -UNDEBUG -std=c++14 -MD -MT tools/obj2yaml/CMakeFiles/obj2yaml.dir/coff2yaml.cpp.o -MF tools/obj2yaml/CMakeFiles/obj2yaml.dir/coff2yaml.cpp.o.d -o tools/obj2yaml/CMakeFiles/obj2yaml.dir/coff2yaml.cpp.o -c /Users/buildslave/jenkins/workspace/lldb-cmake/llvm-project/llvm/tools/obj2yaml/coff2yaml.cpp
[10327/10388] /Users/buildslave/jenkins/workspace/lldb-cmake/host-compiler/bin/clang++  -DGTEST_HAS_RTTI=0 -D_DEBUG -D__STDC_CONSTANT_MACROS -D__STDC_FORMAT_MACROS -D__STDC_LIMIT_MACROS -Itools/obj2yaml -I/Users/buildslave/jenkins/workspace/lldb-cmake/llvm-project/llvm/tools/obj2yaml -I/Applications/Xcode.app/Contents/Developer/Platforms/MacOSX.platform/Developer/SDKs/MacOSX10.15.sdk/usr/include/libxml2 -Iinclude -I/Users/buildslave/jenkins/workspace/lldb-cmake/llvm-project/llvm/include -Wdocumentation -fPIC -fvisibility-inlines-hidden -Werror=date-time -Werror=unguarded-availability-new -fmodules -fmodules-cache-path=/Users/buildslave/jenkins/workspace/lldb-cmake/lldb-build/module.cache -fcxx-modules -Xclang -fmodules-local-submodule-visibility -Wall -Wextra -Wno-unused-parameter -Wwrite-strings -Wcast-qual -Wmissing-field-initializers -pedantic -Wno-long-long -Wimplicit-fallthrough -Wcovered-switch-default -Wno-noexcept-type -Wnon-virtual-dtor -Wdelete-non-virtual-dtor -Wstring-conversion -fdiagnostics-color -O3  -isysroot /Applications/Xcode.app/Contents/Developer/Platforms/MacOSX.platform/Developer/SDKs/MacOSX10.15.sdk    -fno-exceptions -fno-rtti -UNDEBUG -std=c++14 -MD -MT tools/obj2yaml/CMakeFiles/obj2yaml.dir/Error.cpp.o -MF tools/obj2yaml/CMakeFiles/obj2yaml.dir/Error.cpp.o.d -o tools/obj2yaml/CMakeFiles/obj2yaml.dir/Error.cpp.o -c /Users/buildslave/jenkins/workspace/lldb-cmake/llvm-project/llvm/tools/obj2yaml/Error.cpp
[10328/10388] /Users/buildslave/jenkins/workspace/lldb-cmake/host-compiler/bin/clang++  -DGTEST_HAS_RTTI=0 -D_DEBUG -D__STDC_CONSTANT_MACROS -D__STDC_FORMAT_MACROS -D__STDC_LIMIT_MACROS -Itools/obj2yaml -I/Users/buildslave/jenkins/workspace/lldb-cmake/llvm-project/llvm/tools/obj2yaml -I/Applications/Xcode.app/Contents/Developer/Platforms/MacOSX.platform/Developer/SDKs/MacOSX10.15.sdk/usr/include/libxml2 -Iinclude -I/Users/buildslave/jenkins/workspace/lldb-cmake/llvm-project/llvm/include -Wdocumentation -fPIC -fvisibility-inlines-hidden -Werror=date-time -Werror=unguarded-availability-new -fmodules -fmodules-cache-path=/Users/buildslave/jenkins/workspace/lldb-cmake/lldb-build/module.cache -fcxx-modules -Xclang -fmodules-local-submodule-visibility -Wall -Wextra -Wno-unused-parameter -Wwrite-strings -Wcast-qual -Wmissing-field-initializers -pedantic -Wno-long-long -Wimplicit-fallthrough -Wcovered-switch-default -Wno-noexcept-type -Wnon-virtual-dtor -Wdelete-non-virtual-dtor -Wstring-conversion -fdiagnostics-color -O3  -isysroot /Applications/Xcode.app/Contents/Developer/Platforms/MacOSX.platform/Developer/SDKs/MacOSX10.15.sdk    -fno-exceptions -fno-rtti -UNDEBUG -std=c++14 -MD -MT tools/obj2yaml/CMakeFiles/obj2yaml.dir/xcoff2yaml.cpp.o -MF tools/obj2yaml/CMakeFiles/obj2yaml.dir/xcoff2yaml.cpp.o.d -o tools/obj2yaml/CMakeFiles/obj2yaml.dir/xcoff2yaml.cpp.o -c /Users/buildslave/jenkins/workspace/lldb-cmake/llvm-project/llvm/tools/obj2yaml/xcoff2yaml.cpp
[10329/10388] /Users/buildslave/jenkins/workspace/lldb-cmake/host-compiler/bin/clang++  -DGTEST_HAS_RTTI=0 -D_DEBUG -D__STDC_CONSTANT_MACROS -D__STDC_FORMAT_MACROS -D__STDC_LIMIT_MACROS -Itools/obj2yaml -I/Users/buildslave/jenkins/workspace/lldb-cmake/llvm-project/llvm/tools/obj2yaml -I/Applications/Xcode.app/Contents/Developer/Platforms/MacOSX.platform/Developer/SDKs/MacOSX10.15.sdk/usr/include/libxml2 -Iinclude -I/Users/buildslave/jenkins/workspace/lldb-cmake/llvm-project/llvm/include -Wdocumentation -fPIC -fvisibility-inlines-hidden -Werror=date-time -Werror=unguarded-availability-new -fmodules -fmodules-cache-path=/Users/buildslave/jenkins/workspace/lldb-cmake/lldb-build/module.cache -fcxx-modules -Xclang -fmodules-local-submodule-visibility -Wall -Wextra -Wno-unused-parameter -Wwrite-strings -Wcast-qual -Wmissing-field-initializers -pedantic -Wno-long-long -Wimplicit-fallthrough -Wcovered-switch-default -Wno-noexcept-type -Wnon-virtual-dtor -Wdelete-non-virtual-dtor -Wstring-conversion -fdiagnostics-color -O3  -isysroot /Applications/Xcode.app/Contents/Developer/Platforms/MacOSX.platform/Developer/SDKs/MacOSX10.15.sdk    -fno-exceptions -fno-rtti -UNDEBUG -std=c++14 -MD -MT tools/obj2yaml/CMakeFiles/obj2yaml.dir/dwarf2yaml.cpp.o -MF tools/obj2yaml/CMakeFiles/obj2yaml.dir/dwarf2yaml.cpp.o.d -o tools/obj2yaml/CMakeFiles/obj2yaml.dir/dwarf2yaml.cpp.o -c /Users/buildslave/jenkins/workspace/lldb-cmake/llvm-project/llvm/tools/obj2yaml/dwarf2yaml.cpp
[10330/10388] /Users/buildslave/jenkins/workspace/lldb-cmake/host-compiler/bin/clang++  -DGTEST_HAS_RTTI=0 -D_DEBUG -D__STDC_CONSTANT_MACROS -D__STDC_FORMAT_MACROS -D__STDC_LIMIT_MACROS -Itools/opt -I/Users/buildslave/jenkins/workspace/lldb-cmake/llvm-project/llvm/tools/opt -I/Applications/Xcode.app/Contents/Developer/Platforms/MacOSX.platform/Developer/SDKs/MacOSX10.15.sdk/usr/include/libxml2 -Iinclude -I/Users/buildslave/jenkins/workspace/lldb-cmake/llvm-project/llvm/include -Wdocumentation -fPIC -fvisibility-inlines-hidden -Werror=date-time -Werror=unguarded-availability-new -fmodules -fmodules-cache-path=/Users/buildslave/jenkins/workspace/lldb-cmake/lldb-build/module.cache -fcxx-modules -Xclang -fmodules-local-submodule-visibility -Wall -Wextra -Wno-unused-parameter -Wwrite-strings -Wcast-qual -Wmissing-field-initializers -pedantic -Wno-long-long -Wimplicit-fallthrough -Wcovered-switch-default -Wno-noexcept-type -Wnon-virtual-dtor -Wdelete-non-virtual-dtor -Wstring-conversion -fdiagnostics-color -O3  -isysroot /Applications/Xcode.app/Contents/Developer/Platforms/MacOSX.platform/Developer/SDKs/MacOSX10.15.sdk    -fno-exceptions -fno-rtti -UNDEBUG -std=c++14 -MD -MT tools/opt/CMakeFiles/opt.dir/GraphPrinters.cpp.o -MF tools/opt/CMakeFiles/opt.dir/GraphPrinters.cpp.o.d -o tools/opt/CMakeFiles/opt.dir/GraphPrinters.cpp.o -c /Users/buildslave/jenkins/workspace/lldb-cmake/llvm-project/llvm/tools/opt/GraphPrinters.cpp
[10331/10388] /Users/buildslave/jenkins/workspace/lldb-cmake/host-compiler/bin/clang++  -DGTEST_HAS_RTTI=0 -D_DEBUG -D__STDC_CONSTANT_MACROS -D__STDC_FORMAT_MACROS -D__STDC_LIMIT_MACROS -Itools/opt -I/Users/buildslave/jenkins/workspace/lldb-cmake/llvm-project/llvm/tools/opt -I/Applications/Xcode.app/Contents/Developer/Platforms/MacOSX.platform/Developer/SDKs/MacOSX10.15.sdk/usr/include/libxml2 -Iinclude -I/Users/buildslave/jenkins/workspace/lldb-cmake/llvm-project/llvm/include -Wdocumentation -fPIC -fvisibility-inlines-hidden -Werror=date-time -Werror=unguarded-availability-new -fmodules -fmodules-cache-path=/Users/buildslave/jenkins/workspace/lldb-cmake/lldb-build/module.cache -fcxx-modules -Xclang -fmodules-local-submodule-visibility -Wall -Wextra -Wno-unused-parameter -Wwrite-strings -Wcast-qual -Wmissing-field-initializers -pedantic -Wno-long-long -Wimplicit-fallthrough -Wcovered-switch-default -Wno-noexcept-type -Wnon-virtual-dtor -Wdelete-non-virtual-dtor -Wstring-conversion -fdiagnostics-color -O3  -isysroot /Applications/Xcode.app/Contents/Developer/Platforms/MacOSX.platform/Developer/SDKs/MacOSX10.15.sdk    -fno-exceptions -fno-rtti -UNDEBUG -std=c++14 -MD -MT tools/opt/CMakeFiles/opt.dir/AnalysisWrappers.cpp.o -MF tools/opt/CMakeFiles/opt.dir/AnalysisWrappers.cpp.o.d -o tools/opt/CMakeFiles/opt.dir/AnalysisWrappers.cpp.o -c /Users/buildslave/jenkins/workspace/lldb-cmake/llvm-project/llvm/tools/opt/AnalysisWrappers.cpp
[10332/10388] /Users/buildslave/jenkins/workspace/lldb-cmake/host-compiler/bin/clang++  -DGTEST_HAS_RTTI=0 -D_DEBUG -D__STDC_CONSTANT_MACROS -D__STDC_FORMAT_MACROS -D__STDC_LIMIT_MACROS -Itools/llvm-xray -I/Users/buildslave/jenkins/workspace/lldb-cmake/llvm-project/llvm/tools/llvm-xray -I/Applications/Xcode.app/Contents/Developer/Platforms/MacOSX.platform/Developer/SDKs/MacOSX10.15.sdk/usr/include/libxml2 -Iinclude -I/Users/buildslave/jenkins/workspace/lldb-cmake/llvm-project/llvm/include -Wdocumentation -fPIC -fvisibility-inlines-hidden -Werror=date-time -Werror=unguarded-availability-new -fmodules -fmodules-cache-path=/Users/buildslave/jenkins/workspace/lldb-cmake/lldb-build/module.cache -fcxx-modules -Xclang -fmodules-local-submodule-visibility -Wall -Wextra -Wno-unused-parameter -Wwrite-strings -Wcast-qual -Wmissing-field-initializers -pedantic -Wno-long-long -Wimplicit-fallthrough -Wcovered-switch-default -Wno-noexcept-type -Wnon-virtual-dtor -Wdelete-non-virtual-dtor -Wstring-conversion -fdiagnostics-color -O3  -isysroot /Applications/Xcode.app/Contents/Developer/Platforms/MacOSX.platform/Developer/SDKs/MacOSX10.15.sdk    -fno-exceptions -fno-rtti -UNDEBUG -std=c++14 -MD -MT tools/llvm-xray/CMakeFiles/llvm-xray.dir/xray-graph.cpp.o -MF tools/llvm-xray/CMakeFiles/llvm-xray.dir/xray-graph.cpp.o.d -o tools/llvm-xray/CMakeFiles/llvm-xray.dir/xray-graph.cpp.o -c /Users/buildslave/jenkins/workspace/lldb-cmake/llvm-project/llvm/tools/llvm-xray/xray-graph.cpp
[10333/10388] /Users/buildslave/jenkins/workspace/lldb-cmake/host-compiler/bin/clang++  -DGTEST_HAS_RTTI=0 -D_DEBUG -D__STDC_CONSTANT_MACROS -D__STDC_FORMAT_MACROS -D__STDC_LIMIT_MACROS -Itools/opt -I/Users/buildslave/jenkins/workspace/lldb-cmake/llvm-project/llvm/tools/opt -I/Applications/Xcode.app/Contents/Developer/Platforms/MacOSX.platform/Developer/SDKs/MacOSX10.15.sdk/usr/include/libxml2 -Iinclude -I/Users/buildslave/jenkins/workspace/lldb-cmake/llvm-project/llvm/include -Wdocumentation -fPIC -fvisibility-inlines-hidden -Werror=date-time -Werror=unguarded-availability-new -fmodules -fmodules-cache-path=/Users/buildslave/jenkins/workspace/lldb-cmake/lldb-build/module.cache -fcxx-modules -Xclang -fmodules-local-submodule-visibility -Wall -Wextra -Wno-unused-parameter -Wwrite-strings -Wcast-qual -Wmissing-field-initializers -pedantic -Wno-long-long -Wimplicit-fallthrough -Wcovered-switch-default -Wno-noexcept-type -Wnon-virtual-dtor -Wdelete-non-virtual-dtor -Wstring-conversion -fdiagnostics-color -O3  -isysroot /Applications/Xcode.app/Contents/Developer/Platforms/MacOSX.platform/Developer/SDKs/MacOSX10.15.sdk    -fno-exceptions -fno-rtti -UNDEBUG -std=c++14 -MD -MT tools/opt/CMakeFiles/opt.dir/BreakpointPrinter.cpp.o -MF tools/opt/CMakeFiles/opt.dir/BreakpointPrinter.cpp.o.d -o tools/opt/CMakeFiles/opt.dir/BreakpointPrinter.cpp.o -c /Users/buildslave/jenkins/workspace/lldb-cmake/llvm-project/llvm/tools/opt/BreakpointPrinter.cpp
[10334/10388] /Users/buildslave/jenkins/workspace/lldb-cmake/host-compiler/bin/clang++  -DGTEST_HAS_RTTI=0 -D_DEBUG -D__STDC_CONSTANT_MACROS -D__STDC_FORMAT_MACROS -D__STDC_LIMIT_MACROS -Itools/opt -I/Users/buildslave/jenkins/workspace/lldb-cmake/llvm-project/llvm/tools/opt -I/Applications/Xcode.app/Contents/Developer/Platforms/MacOSX.platform/Developer/SDKs/MacOSX10.15.sdk/usr/include/libxml2 -Iinclude -I/Users/buildslave/jenkins/workspace/lldb-cmake/llvm-project/llvm/include -Wdocumentation -fPIC -fvisibility-inlines-hidden -Werror=date-time -Werror=unguarded-availability-new -fmodules -fmodules-cache-path=/Users/buildslave/jenkins/workspace/lldb-cmake/lldb-build/module.cache -fcxx-modules -Xclang -fmodules-local-submodule-visibility -Wall -Wextra -Wno-unused-parameter -Wwrite-strings -Wcast-qual -Wmissing-field-initializers -pedantic -Wno-long-long -Wimplicit-fallthrough -Wcovered-switch-default -Wno-noexcept-type -Wnon-virtual-dtor -Wdelete-non-virtual-dtor -Wstring-conversion -fdiagnostics-color -O3  -isysroot /Applications/Xcode.app/Contents/Developer/Platforms/MacOSX.platform/Developer/SDKs/MacOSX10.15.sdk    -fno-exceptions -fno-rtti -UNDEBUG -std=c++14 -MD -MT tools/opt/CMakeFiles/opt.dir/PassPrinters.cpp.o -MF tools/opt/CMakeFiles/opt.dir/PassPrinters.cpp.o.d -o tools/opt/CMakeFiles/opt.dir/PassPrinters.cpp.o -c /Users/buildslave/jenkins/workspace/lldb-cmake/llvm-project/llvm/tools/opt/PassPrinters.cpp
[10335/10388] cd /Users/buildslave/jenkins/workspace/lldb-cmake/lldb-build/tools/remarks-shlib && sed -e "s/^/_/" < /Users/buildslave/jenkins/workspace/lldb-cmake/llvm-project/llvm/tools/remarks-shlib/Remarks.exports > Remarks.exports
[10336/10388] /Users/buildslave/jenkins/workspace/lldb-cmake/host-compiler/bin/clang++  -DGTEST_HAS_RTTI=0 -D_DEBUG -D__STDC_CONSTANT_MACROS -D__STDC_FORMAT_MACROS -D__STDC_LIMIT_MACROS -Itools/remarks-shlib -I/Users/buildslave/jenkins/workspace/lldb-cmake/llvm-project/llvm/tools/remarks-shlib -I/Applications/Xcode.app/Contents/Developer/Platforms/MacOSX.platform/Developer/SDKs/MacOSX10.15.sdk/usr/include/libxml2 -Iinclude -I/Users/buildslave/jenkins/workspace/lldb-cmake/llvm-project/llvm/include -Wdocumentation -fPIC -fvisibility-inlines-hidden -Werror=date-time -Werror=unguarded-availability-new -fmodules -fmodules-cache-path=/Users/buildslave/jenkins/workspace/lldb-cmake/lldb-build/module.cache -fcxx-modules -Xclang -fmodules-local-submodule-visibility -Wall -Wextra -Wno-unused-parameter -Wwrite-strings -Wcast-qual -Wmissing-field-initializers -pedantic -Wno-long-long -Wimplicit-fallthrough -Wcovered-switch-default -Wno-noexcept-type -Wnon-virtual-dtor -Wdelete-non-virtual-dtor -Wstring-conversion -fdiagnostics-color -O3  -isysroot /Applications/Xcode.app/Contents/Developer/Platforms/MacOSX.platform/Developer/SDKs/MacOSX10.15.sdk -fPIC    -fno-exceptions -fno-rtti -UNDEBUG -std=c++14 -MD -MT tools/remarks-shlib/CMakeFiles/Remarks.dir/libremarks.cpp.o -MF tools/remarks-shlib/CMakeFiles/Remarks.dir/libremarks.cpp.o.d -o tools/remarks-shlib/CMakeFiles/Remarks.dir/libremarks.cpp.o -c /Users/buildslave/jenkins/workspace/lldb-cmake/llvm-project/llvm/tools/remarks-shlib/libremarks.cpp
[10337/10388] : && /Users/buildslave/jenkins/workspace/lldb-cmake/host-compiler/bin/clang++ -Wdocumentation -fPIC -fvisibility-inlines-hidden -Werror=date-time -Werror=unguarded-availability-new -fmodules -fmodules-cache-path=/Users/buildslave/jenkins/workspace/lldb-cmake/lldb-build/module.cache -fcxx-modules -Xclang -fmodules-local-submodule-visibility -Wall -Wextra -Wno-unused-parameter -Wwrite-strings -Wcast-qual -Wmissing-field-initializers -pedantic -Wno-long-long -Wimplicit-fallthrough -Wcovered-switch-default -Wno-noexcept-type -Wnon-virtual-dtor -Wdelete-non-virtual-dtor -Wstring-conversion -fdiagnostics-color -O3 -isysroot /Applications/Xcode.app/Contents/Developer/Platforms/MacOSX.platform/Developer/SDKs/MacOSX10.15.sdk -dynamiclib -Wl,-headerpad_max_install_names -Wl,-dead_strip -Wl,-exported_symbols_list,"/Users/buildslave/jenkins/workspace/lldb-cmake/lldb-build/tools/remarks-shlib/Remarks.exports" -compatibility_version 1 -current_version 12.0.99 -o lib/libRemarks.dylib -install_name @rpath/libRemarks.dylib tools/remarks-shlib/CMakeFiles/Remarks.dir/libremarks.cpp.o  -Wl,-rpath,@loader_path/../lib  lib/libLLVMRemarks.a  lib/libLLVMBitstreamReader.a  lib/libLLVMSupport.a  -lz  -lcurses  -lm  lib/libLLVMDemangle.a && :
[10338/10388] /Users/buildslave/jenkins/workspace/lldb-cmake/host-compiler/bin/clang++  -DGTEST_HAS_RTTI=0 -D_DEBUG -D__STDC_CONSTANT_MACROS -D__STDC_FORMAT_MACROS -D__STDC_LIMIT_MACROS -Itools/llvm-xray -I/Users/buildslave/jenkins/workspace/lldb-cmake/llvm-project/llvm/tools/llvm-xray -I/Applications/Xcode.app/Contents/Developer/Platforms/MacOSX.platform/Developer/SDKs/MacOSX10.15.sdk/usr/include/libxml2 -Iinclude -I/Users/buildslave/jenkins/workspace/lldb-cmake/llvm-project/llvm/include -Wdocumentation -fPIC -fvisibility-inlines-hidden -Werror=date-time -Werror=unguarded-availability-new -fmodules -fmodules-cache-path=/Users/buildslave/jenkins/workspace/lldb-cmake/lldb-build/module.cache -fcxx-modules -Xclang -fmodules-local-submodule-visibility -Wall -Wextra -Wno-unused-parameter -Wwrite-strings -Wcast-qual -Wmissing-field-initializers -pedantic -Wno-long-long -Wimplicit-fallthrough -Wcovered-switch-default -Wno-noexcept-type -Wnon-virtual-dtor -Wdelete-non-virtual-dtor -Wstring-conversion -fdiagnostics-color -O3  -isysroot /Applications/Xcode.app/Contents/Developer/Platforms/MacOSX.platform/Developer/SDKs/MacOSX10.15.sdk    -fno-exceptions -fno-rtti -UNDEBUG -std=c++14 -MD -MT tools/llvm-xray/CMakeFiles/llvm-xray.dir/xray-account.cpp.o -MF tools/llvm-xray/CMakeFiles/llvm-xray.dir/xray-account.cpp.o.d -o tools/llvm-xray/CMakeFiles/llvm-xray.dir/xray-account.cpp.o -c /Users/buildslave/jenkins/workspace/lldb-cmake/llvm-project/llvm/tools/llvm-xray/xray-account.cpp
[10339/10388] /Users/buildslave/jenkins/workspace/lldb-cmake/host-compiler/bin/clang++  -DGTEST_HAS_RTTI=0 -D_DEBUG -D__STDC_CONSTANT_MACROS -D__STDC_FORMAT_MACROS -D__STDC_LIMIT_MACROS -Itools/llvm-xray -I/Users/buildslave/jenkins/workspace/lldb-cmake/llvm-project/llvm/tools/llvm-xray -I/Applications/Xcode.app/Contents/Developer/Platforms/MacOSX.platform/Developer/SDKs/MacOSX10.15.sdk/usr/include/libxml2 -Iinclude -I/Users/buildslave/jenkins/workspace/lldb-cmake/llvm-project/llvm/include -Wdocumentation -fPIC -fvisibility-inlines-hidden -Werror=date-time -Werror=unguarded-availability-new -fmodules -fmodules-cache-path=/Users/buildslave/jenkins/workspace/lldb-cmake/lldb-build/module.cache -fcxx-modules -Xclang -fmodules-local-submodule-visibility -Wall -Wextra -Wno-unused-parameter -Wwrite-strings -Wcast-qual -Wmissing-field-initializers -pedantic -Wno-long-long -Wimplicit-fallthrough -Wcovered-switch-default -Wno-noexcept-type -Wnon-virtual-dtor -Wdelete-non-virtual-dtor -Wstring-conversion -fdiagnostics-color -O3  -isysroot /Applications/Xcode.app/Contents/Developer/Platforms/MacOSX.platform/Developer/SDKs/MacOSX10.15.sdk    -fno-exceptions -fno-rtti -UNDEBUG -std=c++14 -MD -MT tools/llvm-xray/CMakeFiles/llvm-xray.dir/xray-stacks.cpp.o -MF tools/llvm-xray/CMakeFiles/llvm-xray.dir/xray-stacks.cpp.o.d -o tools/llvm-xray/CMakeFiles/llvm-xray.dir/xray-stacks.cpp.o -c /Users/buildslave/jenkins/workspace/lldb-cmake/llvm-project/llvm/tools/llvm-xray/xray-stacks.cpp
[10340/10388] : && /Users/buildslave/jenkins/workspace/lldb-cmake/host-compiler/bin/clang++  -Wdocumentation -fPIC -fvisibility-inlines-hidden -Werror=date-time -Werror=unguarded-availability-new -fmodules -fmodules-cache-path=/Users/buildslave/jenkins/workspace/lldb-cmake/lldb-build/module.cache -fcxx-modules -Xclang -fmodules-local-submodule-visibility -Wall -Wextra -Wno-unused-parameter -Wwrite-strings -Wcast-qual -Wmissing-field-initializers -pedantic -Wno-long-long -Wimplicit-fallthrough -Wcovered-switch-default -Wno-noexcept-type -Wnon-virtual-dtor -Wdelete-non-virtual-dtor -Wstring-conversion -fdiagnostics-color -O3  -isysroot /Applications/Xcode.app/Contents/Developer/Platforms/MacOSX.platform/Developer/SDKs/MacOSX10.15.sdk -Wl,-search_paths_first -Wl,-headerpad_max_install_names -Wl,-dead_strip tools/llvm-xray/CMakeFiles/llvm-xray.dir/func-id-helper.cpp.o tools/llvm-xray/CMakeFiles/llvm-xray.dir/llvm-xray.cpp.o tools/llvm-xray/CMakeFiles/llvm-xray.dir/xray-account.cpp.o tools/llvm-xray/CMakeFiles/llvm-xray.dir/xray-color-helper.cpp.o tools/llvm-xray/CMakeFiles/llvm-xray.dir/xray-converter.cpp.o tools/llvm-xray/CMakeFiles/llvm-xray.dir/xray-extract.cpp.o tools/llvm-xray/CMakeFiles/llvm-xray.dir/xray-fdr-dump.cpp.o tools/llvm-xray/CMakeFiles/llvm-xray.dir/xray-graph-diff.cpp.o tools/llvm-xray/CMakeFiles/llvm-xray.dir/xray-graph.cpp.o tools/llvm-xray/CMakeFiles/llvm-xray.dir/xray-registry.cpp.o tools/llvm-xray/CMakeFiles/llvm-xray.dir/xray-stacks.cpp.o  -o bin/llvm-xray  -Wl,-rpath,@loader_path/../lib  lib/libLLVMDebugInfoDWARF.a  lib/libLLVMObject.a  lib/libLLVMSupport.a  lib/libLLVMSymbolize.a  lib/libLLVMXRay.a  lib/libLLVMDebugInfoDWARF.a  lib/libLLVMDebugInfoPDB.a  lib/libLLVMObject.a  lib/libLLVMBitReader.a  lib/libLLVMCore.a  lib/libLLVMRemarks.a  lib/libLLVMBitstreamReader.a  lib/libLLVMMCParser.a  lib/libLLVMMC.a  lib/libLLVMDebugInfoCodeView.a  lib/libLLVMDebugInfoMSF.a  lib/libLLVMTextAPI.a  lib/libLLVMBinaryFormat.a  lib/libLLVMSupport.a  -lz  -lcurses  -lm  lib/libLLVMDemangle.a && :
[10341/10388] /Users/buildslave/jenkins/workspace/lldb-cmake/host-compiler/bin/clang++  -DGTEST_HAS_RTTI=0 -D_DEBUG -D__STDC_CONSTANT_MACROS -D__STDC_FORMAT_MACROS -D__STDC_LIMIT_MACROS -Itools/opt -I/Users/buildslave/jenkins/workspace/lldb-cmake/llvm-project/llvm/tools/opt -I/Applications/Xcode.app/Contents/Developer/Platforms/MacOSX.platform/Developer/SDKs/MacOSX10.15.sdk/usr/include/libxml2 -Iinclude -I/Users/buildslave/jenkins/workspace/lldb-cmake/llvm-project/llvm/include -Wdocumentation -fPIC -fvisibility-inlines-hidden -Werror=date-time -Werror=unguarded-availability-new -fmodules -fmodules-cache-path=/Users/buildslave/jenkins/workspace/lldb-cmake/lldb-build/module.cache -fcxx-modules -Xclang -fmodules-local-submodule-visibility -Wall -Wextra -Wno-unused-parameter -Wwrite-strings -Wcast-qual -Wmissing-field-initializers -pedantic -Wno-long-long -Wimplicit-fallthrough -Wcovered-switch-default -Wno-noexcept-type -Wnon-virtual-dtor -Wdelete-non-virtual-dtor -Wstring-conversion -fdiagnostics-color -O3  -isysroot /Applications/Xcode.app/Contents/Developer/Platforms/MacOSX.platform/Developer/SDKs/MacOSX10.15.sdk    -fno-exceptions -fno-rtti -UNDEBUG -std=c++14 -MD -MT tools/opt/CMakeFiles/opt.dir/PrintSCC.cpp.o -MF tools/opt/CMakeFiles/opt.dir/PrintSCC.cpp.o.d -o tools/opt/CMakeFiles/opt.dir/PrintSCC.cpp.o -c /Users/buildslave/jenkins/workspace/lldb-cmake/llvm-project/llvm/tools/opt/PrintSCC.cpp
[10342/10388] /Users/buildslave/jenkins/workspace/lldb-cmake/host-compiler/bin/clang++  -DGTEST_HAS_RTTI=0 -D_DEBUG -D__STDC_CONSTANT_MACROS -D__STDC_FORMAT_MACROS -D__STDC_LIMIT_MACROS -Itools/obj2yaml -I/Users/buildslave/jenkins/workspace/lldb-cmake/llvm-project/llvm/tools/obj2yaml -I/Applications/Xcode.app/Contents/Developer/Platforms/MacOSX.platform/Developer/SDKs/MacOSX10.15.sdk/usr/include/libxml2 -Iinclude -I/Users/buildslave/jenkins/workspace/lldb-cmake/llvm-project/llvm/include -Wdocumentation -fPIC -fvisibility-inlines-hidden -Werror=date-time -Werror=unguarded-availability-new -fmodules -fmodules-cache-path=/Users/buildslave/jenkins/workspace/lldb-cmake/lldb-build/module.cache -fcxx-modules -Xclang -fmodules-local-submodule-visibility -Wall -Wextra -Wno-unused-parameter -Wwrite-strings -Wcast-qual -Wmissing-field-initializers -pedantic -Wno-long-long -Wimplicit-fallthrough -Wcovered-switch-default -Wno-noexcept-type -Wnon-virtual-dtor -Wdelete-non-virtual-dtor -Wstring-conversion -fdiagnostics-color -O3  -isysroot /Applications/Xcode.app/Contents/Developer/Platforms/MacOSX.platform/Developer/SDKs/MacOSX10.15.sdk    -fno-exceptions -fno-rtti -UNDEBUG -std=c++14 -MD -MT tools/obj2yaml/CMakeFiles/obj2yaml.dir/wasm2yaml.cpp.o -MF tools/obj2yaml/CMakeFiles/obj2yaml.dir/wasm2yaml.cpp.o.d -o tools/obj2yaml/CMakeFiles/obj2yaml.dir/wasm2yaml.cpp.o -c /Users/buildslave/jenkins/workspace/lldb-cmake/llvm-project/llvm/tools/obj2yaml/wasm2yaml.cpp
[10343/10388] /Users/buildslave/jenkins/workspace/lldb-cmake/host-compiler/bin/clang++  -DGTEST_HAS_RTTI=0 -D_DEBUG -D__STDC_CONSTANT_MACROS -D__STDC_FORMAT_MACROS -D__STDC_LIMIT_MACROS -Itools/sanstats -I/Users/buildslave/jenkins/workspace/lldb-cmake/llvm-project/llvm/tools/sanstats -I/Applications/Xcode.app/Contents/Developer/Platforms/MacOSX.platform/Developer/SDKs/MacOSX10.15.sdk/usr/include/libxml2 -Iinclude -I/Users/buildslave/jenkins/workspace/lldb-cmake/llvm-project/llvm/include -Wdocumentation -fPIC -fvisibility-inlines-hidden -Werror=date-time -Werror=unguarded-availability-new -fmodules -fmodules-cache-path=/Users/buildslave/jenkins/workspace/lldb-cmake/lldb-build/module.cache -fcxx-modules -Xclang -fmodules-local-submodule-visibility -Wall -Wextra -Wno-unused-parameter -Wwrite-strings -Wcast-qual -Wmissing-field-initializers -pedantic -Wno-long-long -Wimplicit-fallthrough -Wcovered-switch-default -Wno-noexcept-type -Wnon-virtual-dtor -Wdelete-non-virtual-dtor -Wstring-conversion -fdiagnostics-color -O3  -isysroot /Applications/Xcode.app/Contents/Developer/Platforms/MacOSX.platform/Developer/SDKs/MacOSX10.15.sdk    -fno-exceptions -fno-rtti -UNDEBUG -std=c++14 -MD -MT tools/sanstats/CMakeFiles/sanstats.dir/sanstats.cpp.o -MF tools/sanstats/CMakeFiles/sanstats.dir/sanstats.cpp.o.d -o tools/sanstats/CMakeFiles/sanstats.dir/sanstats.cpp.o -c /Users/buildslave/jenkins/workspace/lldb-cmake/llvm-project/llvm/tools/sanstats/sanstats.cpp
[10344/10388] : && /Users/buildslave/jenkins/workspace/lldb-cmake/host-compiler/bin/clang++  -Wdocumentation -fPIC -fvisibility-inlines-hidden -Werror=date-time -Werror=unguarded-availability-new -fmodules -fmodules-cache-path=/Users/buildslave/jenkins/workspace/lldb-cmake/lldb-build/module.cache -fcxx-modules -Xclang -fmodules-local-submodule-visibility -Wall -Wextra -Wno-unused-parameter -Wwrite-strings -Wcast-qual -Wmissing-field-initializers -pedantic -Wno-long-long -Wimplicit-fallthrough -Wcovered-switch-default -Wno-noexcept-type -Wnon-virtual-dtor -Wdelete-non-virtual-dtor -Wstring-conversion -fdiagnostics-color -O3  -isysroot /Applications/Xcode.app/Contents/Developer/Platforms/MacOSX.platform/Developer/SDKs/MacOSX10.15.sdk -Wl,-search_paths_first -Wl,-headerpad_max_install_names -Wl,-dead_strip tools/sanstats/CMakeFiles/sanstats.dir/sanstats.cpp.o  -o bin/sanstats  -Wl,-rpath,@loader_path/../lib  lib/libLLVMSupport.a  lib/libLLVMSymbolize.a  lib/libLLVMDebugInfoDWARF.a  lib/libLLVMDebugInfoPDB.a  lib/libLLVMObject.a  lib/libLLVMBitReader.a  lib/libLLVMCore.a  lib/libLLVMRemarks.a  lib/libLLVMBitstreamReader.a  lib/libLLVMMCParser.a  lib/libLLVMMC.a  lib/libLLVMDebugInfoCodeView.a  lib/libLLVMDebugInfoMSF.a  lib/libLLVMTextAPI.a  lib/libLLVMBinaryFormat.a  lib/libLLVMSupport.a  -lz  -lcurses  -lm  lib/libLLVMDemangle.a && :
[10345/10388] /Users/buildslave/jenkins/workspace/lldb-cmake/host-compiler/bin/clang++  -DGTEST_HAS_RTTI=0 -D_DEBUG -D__STDC_CONSTANT_MACROS -D__STDC_FORMAT_MACROS -D__STDC_LIMIT_MACROS -Itools/obj2yaml -I/Users/buildslave/jenkins/workspace/lldb-cmake/llvm-project/llvm/tools/obj2yaml -I/Applications/Xcode.app/Contents/Developer/Platforms/MacOSX.platform/Developer/SDKs/MacOSX10.15.sdk/usr/include/libxml2 -Iinclude -I/Users/buildslave/jenkins/workspace/lldb-cmake/llvm-project/llvm/include -Wdocumentation -fPIC -fvisibility-inlines-hidden -Werror=date-time -Werror=unguarded-availability-new -fmodules -fmodules-cache-path=/Users/buildslave/jenkins/workspace/lldb-cmake/lldb-build/module.cache -fcxx-modules -Xclang -fmodules-local-submodule-visibility -Wall -Wextra -Wno-unused-parameter -Wwrite-strings -Wcast-qual -Wmissing-field-initializers -pedantic -Wno-long-long -Wimplicit-fallthrough -Wcovered-switch-default -Wno-noexcept-type -Wnon-virtual-dtor -Wdelete-non-virtual-dtor -Wstring-conversion -fdiagnostics-color -O3  -isysroot /Applications/Xcode.app/Contents/Developer/Platforms/MacOSX.platform/Developer/SDKs/MacOSX10.15.sdk    -fno-exceptions -fno-rtti -UNDEBUG -std=c++14 -MD -MT tools/obj2yaml/CMakeFiles/obj2yaml.dir/macho2yaml.cpp.o -MF tools/obj2yaml/CMakeFiles/obj2yaml.dir/macho2yaml.cpp.o.d -o tools/obj2yaml/CMakeFiles/obj2yaml.dir/macho2yaml.cpp.o -c /Users/buildslave/jenkins/workspace/lldb-cmake/llvm-project/llvm/tools/obj2yaml/macho2yaml.cpp
[10346/10388] /Users/buildslave/jenkins/workspace/lldb-cmake/host-compiler/bin/clang++  -DGTEST_HAS_RTTI=0 -D_DEBUG -D__STDC_CONSTANT_MACROS -D__STDC_FORMAT_MACROS -D__STDC_LIMIT_MACROS -Itools/yaml2obj -I/Users/buildslave/jenkins/workspace/lldb-cmake/llvm-project/llvm/tools/yaml2obj -I/Applications/Xcode.app/Contents/Developer/Platforms/MacOSX.platform/Developer/SDKs/MacOSX10.15.sdk/usr/include/libxml2 -Iinclude -I/Users/buildslave/jenkins/workspace/lldb-cmake/llvm-project/llvm/include -Wdocumentation -fPIC -fvisibility-inlines-hidden -Werror=date-time -Werror=unguarded-availability-new -fmodules -fmodules-cache-path=/Users/buildslave/jenkins/workspace/lldb-cmake/lldb-build/module.cache -fcxx-modules -Xclang -fmodules-local-submodule-visibility -Wall -Wextra -Wno-unused-parameter -Wwrite-strings -Wcast-qual -Wmissing-field-initializers -pedantic -Wno-long-long -Wimplicit-fallthrough -Wcovered-switch-default -Wno-noexcept-type -Wnon-virtual-dtor -Wdelete-non-virtual-dtor -Wstring-conversion -fdiagnostics-color -O3  -isysroot /Applications/Xcode.app/Contents/Developer/Platforms/MacOSX.platform/Developer/SDKs/MacOSX10.15.sdk    -fno-exceptions -fno-rtti -UNDEBUG -std=c++14 -MD -MT tools/yaml2obj/CMakeFiles/yaml2obj.dir/yaml2obj.cpp.o -MF tools/yaml2obj/CMakeFiles/yaml2obj.dir/yaml2obj.cpp.o.d -o tools/yaml2obj/CMakeFiles/yaml2obj.dir/yaml2obj.cpp.o -c /Users/buildslave/jenkins/workspace/lldb-cmake/llvm-project/llvm/tools/yaml2obj/yaml2obj.cpp
[10347/10388] /Users/buildslave/jenkins/workspace/lldb-cmake/host-compiler/bin/clang++  -DGTEST_HAS_RTTI=0 -D_DEBUG -D__STDC_CONSTANT_MACROS -D__STDC_FORMAT_MACROS -D__STDC_LIMIT_MACROS -Itools/verify-uselistorder -I/Users/buildslave/jenkins/workspace/lldb-cmake/llvm-project/llvm/tools/verify-uselistorder -I/Applications/Xcode.app/Contents/Developer/Platforms/MacOSX.platform/Developer/SDKs/MacOSX10.15.sdk/usr/include/libxml2 -Iinclude -I/Users/buildslave/jenkins/workspace/lldb-cmake/llvm-project/llvm/include -Wdocumentation -fPIC -fvisibility-inlines-hidden -Werror=date-time -Werror=unguarded-availability-new -fmodules -fmodules-cache-path=/Users/buildslave/jenkins/workspace/lldb-cmake/lldb-build/module.cache -fcxx-modules -Xclang -fmodules-local-submodule-visibility -Wall -Wextra -Wno-unused-parameter -Wwrite-strings -Wcast-qual -Wmissing-field-initializers -pedantic -Wno-long-long -Wimplicit-fallthrough -Wcovered-switch-default -Wno-noexcept-type -Wnon-virtual-dtor -Wdelete-non-virtual-dtor -Wstring-conversion -fdiagnostics-color -O3  -isysroot /Applications/Xcode.app/Contents/Developer/Platforms/MacOSX.platform/Developer/SDKs/MacOSX10.15.sdk    -fno-exceptions -fno-rtti -UNDEBUG -std=c++14 -MD -MT tools/verify-uselistorder/CMakeFiles/verify-uselistorder.dir/verify-uselistorder.cpp.o -MF tools/verify-uselistorder/CMakeFiles/verify-uselistorder.dir/verify-uselistorder.cpp.o.d -o tools/verify-uselistorder/CMakeFiles/verify-uselistorder.dir/verify-uselistorder.cpp.o -c /Users/buildslave/jenkins/workspace/lldb-cmake/llvm-project/llvm/tools/verify-uselistorder/verify-uselistorder.cpp
[10348/10388] : && /Users/buildslave/jenkins/workspace/lldb-cmake/host-compiler/bin/clang++  -Wdocumentation -fPIC -fvisibility-inlines-hidden -Werror=date-time -Werror=unguarded-availability-new -fmodules -fmodules-cache-path=/Users/buildslave/jenkins/workspace/lldb-cmake/lldb-build/module.cache -fcxx-modules -Xclang -fmodules-local-submodule-visibility -Wall -Wextra -Wno-unused-parameter -Wwrite-strings -Wcast-qual -Wmissing-field-initializers -pedantic -Wno-long-long -Wimplicit-fallthrough -Wcovered-switch-default -Wno-noexcept-type -Wnon-virtual-dtor -Wdelete-non-virtual-dtor -Wstring-conversion -fdiagnostics-color -O3  -isysroot /Applications/Xcode.app/Contents/Developer/Platforms/MacOSX.platform/Developer/SDKs/MacOSX10.15.sdk -Wl,-search_paths_first -Wl,-headerpad_max_install_names -Wl,-dead_strip tools/yaml2obj/CMakeFiles/yaml2obj.dir/yaml2obj.cpp.o  -o bin/yaml2obj  -Wl,-rpath,@loader_path/../lib  lib/libLLVMObjectYAML.a  lib/libLLVMSupport.a  lib/libLLVMObject.a  lib/libLLVMBitReader.a  lib/libLLVMCore.a  lib/libLLVMRemarks.a  lib/libLLVMBitstreamReader.a  lib/libLLVMMCParser.a  lib/libLLVMMC.a  lib/libLLVMDebugInfoCodeView.a  lib/libLLVMDebugInfoMSF.a  lib/libLLVMTextAPI.a  lib/libLLVMBinaryFormat.a  lib/libLLVMSupport.a  -lz  -lcurses  -lm  lib/libLLVMDemangle.a && :
[10349/10388] : && /Users/buildslave/jenkins/workspace/lldb-cmake/host-compiler/bin/clang++  -Wdocumentation -fPIC -fvisibility-inlines-hidden -Werror=date-time -Werror=unguarded-availability-new -fmodules -fmodules-cache-path=/Users/buildslave/jenkins/workspace/lldb-cmake/lldb-build/module.cache -fcxx-modules -Xclang -fmodules-local-submodule-visibility -Wall -Wextra -Wno-unused-parameter -Wwrite-strings -Wcast-qual -Wmissing-field-initializers -pedantic -Wno-long-long -Wimplicit-fallthrough -Wcovered-switch-default -Wno-noexcept-type -Wnon-virtual-dtor -Wdelete-non-virtual-dtor -Wstring-conversion -fdiagnostics-color -O3  -isysroot /Applications/Xcode.app/Contents/Developer/Platforms/MacOSX.platform/Developer/SDKs/MacOSX10.15.sdk -Wl,-search_paths_first -Wl,-headerpad_max_install_names -Wl,-dead_strip tools/verify-uselistorder/CMakeFiles/verify-uselistorder.dir/verify-uselistorder.cpp.o  -o bin/verify-uselistorder  -Wl,-rpath,@loader_path/../lib  lib/libLLVMAsmParser.a  lib/libLLVMBitReader.a  lib/libLLVMBitWriter.a  lib/libLLVMCore.a  lib/libLLVMIRReader.a  lib/libLLVMSupport.a  lib/libLLVMAnalysis.a  lib/libLLVMProfileData.a  lib/libLLVMObject.a  lib/libLLVMMCParser.a  lib/libLLVMMC.a  lib/libLLVMDebugInfoCodeView.a  lib/libLLVMDebugInfoMSF.a  lib/libLLVMTextAPI.a  lib/libLLVMAsmParser.a  lib/libLLVMBitReader.a  lib/libLLVMCore.a  lib/libLLVMBinaryFormat.a  lib/libLLVMRemarks.a  lib/libLLVMBitstreamReader.a  lib/libLLVMSupport.a  -lz  -lcurses  -lm  lib/libLLVMDemangle.a && :
[10350/10388] /Users/buildslave/jenkins/workspace/lldb-cmake/host-compiler/bin/clang++  -DGTEST_HAS_RTTI=0 -D_DEBUG -D__STDC_CONSTANT_MACROS -D__STDC_FORMAT_MACROS -D__STDC_LIMIT_MACROS -Iexamples/Bye -I/Users/buildslave/jenkins/workspace/lldb-cmake/llvm-project/llvm/examples/Bye -I/Applications/Xcode.app/Contents/Developer/Platforms/MacOSX.platform/Developer/SDKs/MacOSX10.15.sdk/usr/include/libxml2 -Iinclude -I/Users/buildslave/jenkins/workspace/lldb-cmake/llvm-project/llvm/include -Wdocumentation -fPIC -fvisibility-inlines-hidden -Werror=date-time -Werror=unguarded-availability-new -fmodules -fmodules-cache-path=/Users/buildslave/jenkins/workspace/lldb-cmake/lldb-build/module.cache -fcxx-modules -Xclang -fmodules-local-submodule-visibility -Wall -Wextra -Wno-unused-parameter -Wwrite-strings -Wcast-qual -Wmissing-field-initializers -pedantic -Wno-long-long -Wimplicit-fallthrough -Wcovered-switch-default -Wno-noexcept-type -Wnon-virtual-dtor -Wdelete-non-virtual-dtor -Wstring-conversion -fdiagnostics-color -O3  -isysroot /Applications/Xcode.app/Contents/Developer/Platforms/MacOSX.platform/Developer/SDKs/MacOSX10.15.sdk -fPIC    -fno-exceptions -fno-rtti -UNDEBUG -std=c++14 -MD -MT examples/Bye/CMakeFiles/Bye.dir/Bye.cpp.o -MF examples/Bye/CMakeFiles/Bye.dir/Bye.cpp.o.d -o examples/Bye/CMakeFiles/Bye.dir/Bye.cpp.o -c /Users/buildslave/jenkins/workspace/lldb-cmake/llvm-project/llvm/examples/Bye/Bye.cpp
[10351/10388] : && /Users/buildslave/jenkins/workspace/lldb-cmake/host-compiler/bin/clang++ -Wdocumentation -fPIC -fvisibility-inlines-hidden -Werror=date-time -Werror=unguarded-availability-new -fmodules -fmodules-cache-path=/Users/buildslave/jenkins/workspace/lldb-cmake/lldb-build/module.cache -fcxx-modules -Xclang -fmodules-local-submodule-visibility -Wall -Wextra -Wno-unused-parameter -Wwrite-strings -Wcast-qual -Wmissing-field-initializers -pedantic -Wno-long-long -Wimplicit-fallthrough -Wcovered-switch-default -Wno-noexcept-type -Wnon-virtual-dtor -Wdelete-non-virtual-dtor -Wstring-conversion -fdiagnostics-color -O3 -isysroot /Applications/Xcode.app/Contents/Developer/Platforms/MacOSX.platform/Developer/SDKs/MacOSX10.15.sdk -bundle -Wl,-headerpad_max_install_names -Wl,-flat_namespace -Wl,-undefined -Wl,suppress   -Wl,-dead_strip -o lib/Bye.dylib examples/Bye/CMakeFiles/Bye.dir/Bye.cpp.o  -Wl,-rpath,@loader_path/../lib && :
[10352/10388] /Users/buildslave/jenkins/workspace/lldb-cmake/host-compiler/bin/clang++  -DGTEST_HAS_TR1_TUPLE=0 -DGTEST_LANG_CXX11=1 -DPipSqueak_EXPORTS -D_DEBUG -D__STDC_CONSTANT_MACROS -D__STDC_FORMAT_MACROS -D__STDC_LIMIT_MACROS -Iunittests/Support/DynamicLibrary -I/Users/buildslave/jenkins/workspace/lldb-cmake/llvm-project/llvm/unittests/Support/DynamicLibrary -I/Applications/Xcode.app/Contents/Developer/Platforms/MacOSX.platform/Developer/SDKs/MacOSX10.15.sdk/usr/include/libxml2 -Iinclude -I/Users/buildslave/jenkins/workspace/lldb-cmake/llvm-project/llvm/include -I/Users/buildslave/jenkins/workspace/lldb-cmake/llvm-project/llvm/utils/unittest/googletest/include -I/Users/buildslave/jenkins/workspace/lldb-cmake/llvm-project/llvm/utils/unittest/googlemock/include -Wdocumentation -fPIC -fvisibility-inlines-hidden -Werror=date-time -Werror=unguarded-availability-new -fmodules -fmodules-cache-path=/Users/buildslave/jenkins/workspace/lldb-cmake/lldb-build/module.cache -fcxx-modules -Xclang -fmodules-local-submodule-visibility -Wall -Wextra -Wno-unused-parameter -Wwrite-strings -Wcast-qual -Wmissing-field-initializers -pedantic -Wno-long-long -Wimplicit-fallthrough -Wcovered-switch-default -Wno-noexcept-type -Wnon-virtual-dtor -Wdelete-non-virtual-dtor -Wstring-conversion -fdiagnostics-color -O3  -isysroot /Applications/Xcode.app/Contents/Developer/Platforms/MacOSX.platform/Developer/SDKs/MacOSX10.15.sdk -fPIC   -UNDEBUG -std=c++14 -MD -MT unittests/Support/DynamicLibrary/CMakeFiles/PipSqueak.dir/PipSqueak.cpp.o -MF unittests/Support/DynamicLibrary/CMakeFiles/PipSqueak.dir/PipSqueak.cpp.o.d -o unittests/Support/DynamicLibrary/CMakeFiles/PipSqueak.dir/PipSqueak.cpp.o -c /Users/buildslave/jenkins/workspace/lldb-cmake/llvm-project/llvm/unittests/Support/DynamicLibrary/PipSqueak.cpp
[10353/10388] : && /Users/buildslave/jenkins/workspace/lldb-cmake/host-compiler/bin/clang++ -Wdocumentation -fPIC -fvisibility-inlines-hidden -Werror=date-time -Werror=unguarded-availability-new -fmodules -fmodules-cache-path=/Users/buildslave/jenkins/workspace/lldb-cmake/lldb-build/module.cache -fcxx-modules -Xclang -fmodules-local-submodule-visibility -Wall -Wextra -Wno-unused-parameter -Wwrite-strings -Wcast-qual -Wmissing-field-initializers -pedantic -Wno-long-long -Wimplicit-fallthrough -Wcovered-switch-default -Wno-noexcept-type -Wnon-virtual-dtor -Wdelete-non-virtual-dtor -Wstring-conversion -fdiagnostics-color -O3 -isysroot /Applications/Xcode.app/Contents/Developer/Platforms/MacOSX.platform/Developer/SDKs/MacOSX10.15.sdk -dynamiclib -Wl,-headerpad_max_install_names  -o unittests/Support/DynamicLibrary/PipSqueak.dylib -install_name @rpath/PipSqueak.dylib unittests/Support/DynamicLibrary/CMakeFiles/PipSqueak.dir/PipSqueak.cpp.o   && :
[10354/10388] /Users/buildslave/jenkins/workspace/lldb-cmake/host-compiler/bin/clang++  -DGTEST_HAS_RTTI=0 -D_DEBUG -D__STDC_CONSTANT_MACROS -D__STDC_FORMAT_MACROS -D__STDC_LIMIT_MACROS -Itools/opt -I/Users/buildslave/jenkins/workspace/lldb-cmake/llvm-project/llvm/tools/opt -I/Applications/Xcode.app/Contents/Developer/Platforms/MacOSX.platform/Developer/SDKs/MacOSX10.15.sdk/usr/include/libxml2 -Iinclude -I/Users/buildslave/jenkins/workspace/lldb-cmake/llvm-project/llvm/include -Wdocumentation -fPIC -fvisibility-inlines-hidden -Werror=date-time -Werror=unguarded-availability-new -fmodules -fmodules-cache-path=/Users/buildslave/jenkins/workspace/lldb-cmake/lldb-build/module.cache -fcxx-modules -Xclang -fmodules-local-submodule-visibility -Wall -Wextra -Wno-unused-parameter -Wwrite-strings -Wcast-qual -Wmissing-field-initializers -pedantic -Wno-long-long -Wimplicit-fallthrough -Wcovered-switch-default -Wno-noexcept-type -Wnon-virtual-dtor -Wdelete-non-virtual-dtor -Wstring-conversion -fdiagnostics-color -O3  -isysroot /Applications/Xcode.app/Contents/Developer/Platforms/MacOSX.platform/Developer/SDKs/MacOSX10.15.sdk    -fno-exceptions -fno-rtti -UNDEBUG -std=c++14 -MD -MT tools/opt/CMakeFiles/opt.dir/NewPMDriver.cpp.o -MF tools/opt/CMakeFiles/opt.dir/NewPMDriver.cpp.o.d -o tools/opt/CMakeFiles/opt.dir/NewPMDriver.cpp.o -c /Users/buildslave/jenkins/workspace/lldb-cmake/llvm-project/llvm/tools/opt/NewPMDriver.cpp
[10355/10388] /Users/buildslave/jenkins/workspace/lldb-cmake/host-compiler/bin/clang++  -DGTEST_HAS_RTTI=0 -D_DEBUG -D__STDC_CONSTANT_MACROS -D__STDC_FORMAT_MACROS -D__STDC_LIMIT_MACROS -Itools/opt -I/Users/buildslave/jenkins/workspace/lldb-cmake/llvm-project/llvm/tools/opt -I/Applications/Xcode.app/Contents/Developer/Platforms/MacOSX.platform/Developer/SDKs/MacOSX10.15.sdk/usr/include/libxml2 -Iinclude -I/Users/buildslave/jenkins/workspace/lldb-cmake/llvm-project/llvm/include -Wdocumentation -fPIC -fvisibility-inlines-hidden -Werror=date-time -Werror=unguarded-availability-new -fmodules -fmodules-cache-path=/Users/buildslave/jenkins/workspace/lldb-cmake/lldb-build/module.cache -fcxx-modules -Xclang -fmodules-local-submodule-visibility -Wall -Wextra -Wno-unused-parameter -Wwrite-strings -Wcast-qual -Wmissing-field-initializers -pedantic -Wno-long-long -Wimplicit-fallthrough -Wcovered-switch-default -Wno-noexcept-type -Wnon-virtual-dtor -Wdelete-non-virtual-dtor -Wstring-conversion -fdiagnostics-color -O3  -isysroot /Applications/Xcode.app/Contents/Developer/Platforms/MacOSX.platform/Developer/SDKs/MacOSX10.15.sdk    -fno-exceptions -fno-rtti -UNDEBUG -std=c++14 -MD -MT tools/opt/CMakeFiles/opt.dir/opt.cpp.o -MF tools/opt/CMakeFiles/opt.dir/opt.cpp.o.d -o tools/opt/CMakeFiles/opt.dir/opt.cpp.o -c /Users/buildslave/jenkins/workspace/lldb-cmake/llvm-project/llvm/tools/opt/opt.cpp
[10356/10388] /Users/buildslave/jenkins/workspace/lldb-cmake/host-compiler/bin/clang++  -DGTEST_HAS_TR1_TUPLE=0 -DGTEST_LANG_CXX11=1 -D_DEBUG -D__STDC_CONSTANT_MACROS -D__STDC_FORMAT_MACROS -D__STDC_LIMIT_MACROS -Iunittests/Support/DynamicLibrary -I/Users/buildslave/jenkins/workspace/lldb-cmake/llvm-project/llvm/unittests/Support/DynamicLibrary -I/Applications/Xcode.app/Contents/Developer/Platforms/MacOSX.platform/Developer/SDKs/MacOSX10.15.sdk/usr/include/libxml2 -Iinclude -I/Users/buildslave/jenkins/workspace/lldb-cmake/llvm-project/llvm/include -I/Users/buildslave/jenkins/workspace/lldb-cmake/llvm-project/llvm/utils/unittest/googletest/include -I/Users/buildslave/jenkins/workspace/lldb-cmake/llvm-project/llvm/utils/unittest/googlemock/include -Wdocumentation -fPIC -fvisibility-inlines-hidden -Werror=date-time -Werror=unguarded-availability-new -fmodules -fmodules-cache-path=/Users/buildslave/jenkins/workspace/lldb-cmake/lldb-build/module.cache -fcxx-modules -Xclang -fmodules-local-submodule-visibility -Wall -Wextra -Wno-unused-parameter -Wwrite-strings -Wcast-qual -Wmissing-field-initializers -pedantic -Wno-long-long -Wimplicit-fallthrough -Wcovered-switch-default -Wno-noexcept-type -Wnon-virtual-dtor -Wdelete-non-virtual-dtor -Wstring-conversion -fdiagnostics-color -O3  -isysroot /Applications/Xcode.app/Contents/Developer/Platforms/MacOSX.platform/Developer/SDKs/MacOSX10.15.sdk   -UNDEBUG -std=c++14 -MD -MT unittests/Support/DynamicLibrary/CMakeFiles/DynamicLibraryLib.dir/ExportedFuncs.cpp.o -MF unittests/Support/DynamicLibrary/CMakeFiles/DynamicLibraryLib.dir/ExportedFuncs.cpp.o.d -o unittests/Support/DynamicLibrary/CMakeFiles/DynamicLibraryLib.dir/ExportedFuncs.cpp.o -c /Users/buildslave/jenkins/workspace/lldb-cmake/llvm-project/llvm/unittests/Support/DynamicLibrary/ExportedFuncs.cpp
[10357/10388] : && "/Applications/Xcode.app/Contents/Developer/Toolchains/XcodeDefault.xctoolchain/usr/bin/libtool" -static -no_warning_for_no_symbols -o lib/libDynamicLibraryLib.a  unittests/Support/DynamicLibrary/CMakeFiles/DynamicLibraryLib.dir/ExportedFuncs.cpp.o && :
[10358/10388] /Users/buildslave/jenkins/workspace/lldb-cmake/host-compiler/bin/clang++  -DGTEST_HAS_TR1_TUPLE=0 -DGTEST_LANG_CXX11=1 -DSecondLib_EXPORTS -D_DEBUG -D__STDC_CONSTANT_MACROS -D__STDC_FORMAT_MACROS -D__STDC_LIMIT_MACROS -Iunittests/Support/DynamicLibrary -I/Users/buildslave/jenkins/workspace/lldb-cmake/llvm-project/llvm/unittests/Support/DynamicLibrary -I/Applications/Xcode.app/Contents/Developer/Platforms/MacOSX.platform/Developer/SDKs/MacOSX10.15.sdk/usr/include/libxml2 -Iinclude -I/Users/buildslave/jenkins/workspace/lldb-cmake/llvm-project/llvm/include -I/Users/buildslave/jenkins/workspace/lldb-cmake/llvm-project/llvm/utils/unittest/googletest/include -I/Users/buildslave/jenkins/workspace/lldb-cmake/llvm-project/llvm/utils/unittest/googlemock/include -Wdocumentation -fPIC -fvisibility-inlines-hidden -Werror=date-time -Werror=unguarded-availability-new -fmodules -fmodules-cache-path=/Users/buildslave/jenkins/workspace/lldb-cmake/lldb-build/module.cache -fcxx-modules -Xclang -fmodules-local-submodule-visibility -Wall -Wextra -Wno-unused-parameter -Wwrite-strings -Wcast-qual -Wmissing-field-initializers -pedantic -Wno-long-long -Wimplicit-fallthrough -Wcovered-switch-default -Wno-noexcept-type -Wnon-virtual-dtor -Wdelete-non-virtual-dtor -Wstring-conversion -fdiagnostics-color -O3  -isysroot /Applications/Xcode.app/Contents/Developer/Platforms/MacOSX.platform/Developer/SDKs/MacOSX10.15.sdk -fPIC   -UNDEBUG -std=c++14 -MD -MT unittests/Support/DynamicLibrary/CMakeFiles/SecondLib.dir/PipSqueak.cpp.o -MF unittests/Support/DynamicLibrary/CMakeFiles/SecondLib.dir/PipSqueak.cpp.o.d -o unittests/Support/DynamicLibrary/CMakeFiles/SecondLib.dir/PipSqueak.cpp.o -c /Users/buildslave/jenkins/workspace/lldb-cmake/llvm-project/llvm/unittests/Support/DynamicLibrary/PipSqueak.cpp
[10359/10388] : && /Users/buildslave/jenkins/workspace/lldb-cmake/host-compiler/bin/clang++ -Wdocumentation -fPIC -fvisibility-inlines-hidden -Werror=date-time -Werror=unguarded-availability-new -fmodules -fmodules-cache-path=/Users/buildslave/jenkins/workspace/lldb-cmake/lldb-build/module.cache -fcxx-modules -Xclang -fmodules-local-submodule-visibility -Wall -Wextra -Wno-unused-parameter -Wwrite-strings -Wcast-qual -Wmissing-field-initializers -pedantic -Wno-long-long -Wimplicit-fallthrough -Wcovered-switch-default -Wno-noexcept-type -Wnon-virtual-dtor -Wdelete-non-virtual-dtor -Wstring-conversion -fdiagnostics-color -O3 -isysroot /Applications/Xcode.app/Contents/Developer/Platforms/MacOSX.platform/Developer/SDKs/MacOSX10.15.sdk -dynamiclib -Wl,-headerpad_max_install_names  -o unittests/Support/DynamicLibrary/SecondLib.dylib -install_name @rpath/SecondLib.dylib unittests/Support/DynamicLibrary/CMakeFiles/SecondLib.dir/PipSqueak.cpp.o   && :
[10360/10388] /Users/buildslave/jenkins/workspace/lldb-cmake/host-compiler/bin/clang++  -DGTEST_HAS_RTTI=0 -D_DEBUG -D__STDC_CONSTANT_MACROS -D__STDC_FORMAT_MACROS -D__STDC_LIMIT_MACROS -Itools/sancov -I/Users/buildslave/jenkins/workspace/lldb-cmake/llvm-project/llvm/tools/sancov -I/Applications/Xcode.app/Contents/Developer/Platforms/MacOSX.platform/Developer/SDKs/MacOSX10.15.sdk/usr/include/libxml2 -Iinclude -I/Users/buildslave/jenkins/workspace/lldb-cmake/llvm-project/llvm/include -Wdocumentation -fPIC -fvisibility-inlines-hidden -Werror=date-time -Werror=unguarded-availability-new -fmodules -fmodules-cache-path=/Users/buildslave/jenkins/workspace/lldb-cmake/lldb-build/module.cache -fcxx-modules -Xclang -fmodules-local-submodule-visibility -Wall -Wextra -Wno-unused-parameter -Wwrite-strings -Wcast-qual -Wmissing-field-initializers -pedantic -Wno-long-long -Wimplicit-fallthrough -Wcovered-switch-default -Wno-noexcept-type -Wnon-virtual-dtor -Wdelete-non-virtual-dtor -Wstring-conversion -fdiagnostics-color -O3  -isysroot /Applications/Xcode.app/Contents/Developer/Platforms/MacOSX.platform/Developer/SDKs/MacOSX10.15.sdk    -fno-exceptions -fno-rtti -UNDEBUG -std=c++14 -MD -MT tools/sancov/CMakeFiles/sancov.dir/sancov.cpp.o -MF tools/sancov/CMakeFiles/sancov.dir/sancov.cpp.o.d -o tools/sancov/CMakeFiles/sancov.dir/sancov.cpp.o -c /Users/buildslave/jenkins/workspace/lldb-cmake/llvm-project/llvm/tools/sancov/sancov.cpp
[10361/10388] /Users/buildslave/jenkins/workspace/lldb-cmake/host-compiler/bin/clang++  -DHAVE_POSIX_REGEX -DHAVE_STD_REGEX -DHAVE_STEADY_CLOCK -D_DEBUG -D__STDC_CONSTANT_MACROS -D__STDC_FORMAT_MACROS -D__STDC_LIMIT_MACROS -Iutils/benchmark/src -I/Users/buildslave/jenkins/workspace/lldb-cmake/llvm-project/llvm/utils/benchmark/src -I/Applications/Xcode.app/Contents/Developer/Platforms/MacOSX.platform/Developer/SDKs/MacOSX10.15.sdk/usr/include/libxml2 -Iinclude -I/Users/buildslave/jenkins/workspace/lldb-cmake/llvm-project/llvm/include -I/Users/buildslave/jenkins/workspace/lldb-cmake/llvm-project/llvm/utils/benchmark/include -I/Users/buildslave/jenkins/workspace/lldb-cmake/llvm-project/llvm/utils/benchmark/src/../include -Wdocumentation -fPIC -fvisibility-inlines-hidden -Werror=date-time -Werror=unguarded-availability-new -fmodules -fmodules-cache-path=/Users/buildslave/jenkins/workspace/lldb-cmake/lldb-build/module.cache -fcxx-modules -Xclang -fmodules-local-submodule-visibility -Wall -Wextra -Wno-unused-parameter -Wwrite-strings -Wcast-qual -Wmissing-field-initializers -pedantic -Wno-long-long -Wimplicit-fallthrough -Wcovered-switch-default -Wno-noexcept-type -Wnon-virtual-dtor -Wdelete-non-virtual-dtor -Wstring-conversion -fdiagnostics-color  -std=c++11  -Wall  -Wextra  -Wshadow  -pedantic  -pedantic-errors  -Wshorten-64-to-32  -Wfloat-equal  -fstrict-aliasing  -fno-exceptions  -Wstrict-aliasing  -Wthread-safety -O3  -isysroot /Applications/Xcode.app/Contents/Developer/Platforms/MacOSX.platform/Developer/SDKs/MacOSX10.15.sdk   -UNDEBUG -std=c++14 -MD -MT utils/benchmark/src/CMakeFiles/benchmark_main.dir/benchmark_main.cc.o -MF utils/benchmark/src/CMakeFiles/benchmark_main.dir/benchmark_main.cc.o.d -o utils/benchmark/src/CMakeFiles/benchmark_main.dir/benchmark_main.cc.o -c /Users/buildslave/jenkins/workspace/lldb-cmake/llvm-project/llvm/utils/benchmark/src/benchmark_main.cc
[10362/10388] /Users/buildslave/jenkins/workspace/lldb-cmake/host-compiler/bin/clang++  -DHAVE_POSIX_REGEX -DHAVE_STD_REGEX -DHAVE_STEADY_CLOCK -D_DEBUG -D__STDC_CONSTANT_MACROS -D__STDC_FORMAT_MACROS -D__STDC_LIMIT_MACROS -Iutils/benchmark/src -I/Users/buildslave/jenkins/workspace/lldb-cmake/llvm-project/llvm/utils/benchmark/src -I/Applications/Xcode.app/Contents/Developer/Platforms/MacOSX.platform/Developer/SDKs/MacOSX10.15.sdk/usr/include/libxml2 -Iinclude -I/Users/buildslave/jenkins/workspace/lldb-cmake/llvm-project/llvm/include -I/Users/buildslave/jenkins/workspace/lldb-cmake/llvm-project/llvm/utils/benchmark/include -I/Users/buildslave/jenkins/workspace/lldb-cmake/llvm-project/llvm/utils/benchmark/src/../include -Wdocumentation -fPIC -fvisibility-inlines-hidden -Werror=date-time -Werror=unguarded-availability-new -fmodules -fmodules-cache-path=/Users/buildslave/jenkins/workspace/lldb-cmake/lldb-build/module.cache -fcxx-modules -Xclang -fmodules-local-submodule-visibility -Wall -Wextra -Wno-unused-parameter -Wwrite-strings -Wcast-qual -Wmissing-field-initializers -pedantic -Wno-long-long -Wimplicit-fallthrough -Wcovered-switch-default -Wno-noexcept-type -Wnon-virtual-dtor -Wdelete-non-virtual-dtor -Wstring-conversion -fdiagnostics-color  -std=c++11  -Wall  -Wextra  -Wshadow  -pedantic  -pedantic-errors  -Wshorten-64-to-32  -Wfloat-equal  -fstrict-aliasing  -fno-exceptions  -Wstrict-aliasing  -Wthread-safety -O3  -isysroot /Applications/Xcode.app/Contents/Developer/Platforms/MacOSX.platform/Developer/SDKs/MacOSX10.15.sdk   -UNDEBUG -std=c++14 -MD -MT utils/benchmark/src/CMakeFiles/benchmark.dir/commandlineflags.cc.o -MF utils/benchmark/src/CMakeFiles/benchmark.dir/commandlineflags.cc.o.d -o utils/benchmark/src/CMakeFiles/benchmark.dir/commandlineflags.cc.o -c /Users/buildslave/jenkins/workspace/lldb-cmake/llvm-project/llvm/utils/benchmark/src/commandlineflags.cc
[10363/10388] /Users/buildslave/jenkins/workspace/lldb-cmake/host-compiler/bin/clang++  -DHAVE_POSIX_REGEX -DHAVE_STD_REGEX -DHAVE_STEADY_CLOCK -D_DEBUG -D__STDC_CONSTANT_MACROS -D__STDC_FORMAT_MACROS -D__STDC_LIMIT_MACROS -Iutils/benchmark/src -I/Users/buildslave/jenkins/workspace/lldb-cmake/llvm-project/llvm/utils/benchmark/src -I/Applications/Xcode.app/Contents/Developer/Platforms/MacOSX.platform/Developer/SDKs/MacOSX10.15.sdk/usr/include/libxml2 -Iinclude -I/Users/buildslave/jenkins/workspace/lldb-cmake/llvm-project/llvm/include -I/Users/buildslave/jenkins/workspace/lldb-cmake/llvm-project/llvm/utils/benchmark/include -I/Users/buildslave/jenkins/workspace/lldb-cmake/llvm-project/llvm/utils/benchmark/src/../include -Wdocumentation -fPIC -fvisibility-inlines-hidden -Werror=date-time -Werror=unguarded-availability-new -fmodules -fmodules-cache-path=/Users/buildslave/jenkins/workspace/lldb-cmake/lldb-build/module.cache -fcxx-modules -Xclang -fmodules-local-submodule-visibility -Wall -Wextra -Wno-unused-parameter -Wwrite-strings -Wcast-qual -Wmissing-field-initializers -pedantic -Wno-long-long -Wimplicit-fallthrough -Wcovered-switch-default -Wno-noexcept-type -Wnon-virtual-dtor -Wdelete-non-virtual-dtor -Wstring-conversion -fdiagnostics-color  -std=c++11  -Wall  -Wextra  -Wshadow  -pedantic  -pedantic-errors  -Wshorten-64-to-32  -Wfloat-equal  -fstrict-aliasing  -fno-exceptions  -Wstrict-aliasing  -Wthread-safety -O3  -isysroot /Applications/Xcode.app/Contents/Developer/Platforms/MacOSX.platform/Developer/SDKs/MacOSX10.15.sdk   -UNDEBUG -std=c++14 -MD -MT utils/benchmark/src/CMakeFiles/benchmark.dir/colorprint.cc.o -MF utils/benchmark/src/CMakeFiles/benchmark.dir/colorprint.cc.o.d -o utils/benchmark/src/CMakeFiles/benchmark.dir/colorprint.cc.o -c /Users/buildslave/jenkins/workspace/lldb-cmake/llvm-project/llvm/utils/benchmark/src/colorprint.cc
[10364/10388] : && /Users/buildslave/jenkins/workspace/lldb-cmake/host-compiler/bin/clang++  -Wdocumentation -fPIC -fvisibility-inlines-hidden -Werror=date-time -Werror=unguarded-availability-new -fmodules -fmodules-cache-path=/Users/buildslave/jenkins/workspace/lldb-cmake/lldb-build/module.cache -fcxx-modules -Xclang -fmodules-local-submodule-visibility -Wall -Wextra -Wno-unused-parameter -Wwrite-strings -Wcast-qual -Wmissing-field-initializers -pedantic -Wno-long-long -Wimplicit-fallthrough -Wcovered-switch-default -Wno-noexcept-type -Wnon-virtual-dtor -Wdelete-non-virtual-dtor -Wstring-conversion -fdiagnostics-color -O3  -isysroot /Applications/Xcode.app/Contents/Developer/Platforms/MacOSX.platform/Developer/SDKs/MacOSX10.15.sdk -Wl,-search_paths_first -Wl,-headerpad_max_install_names -Wl,-dead_strip tools/sancov/CMakeFiles/sancov.dir/sancov.cpp.o  -o bin/sancov  -Wl,-rpath,@loader_path/../lib  lib/libLLVMAArch64Desc.a  lib/libLLVMAMDGPUDesc.a  lib/libLLVMARMDesc.a  lib/libLLVMAVRDesc.a  lib/libLLVMBPFDesc.a  lib/libLLVMHexagonDesc.a  lib/libLLVMLanaiDesc.a  lib/libLLVMMipsDesc.a  lib/libLLVMMSP430Desc.a  lib/libLLVMNVPTXDesc.a  lib/libLLVMPowerPCDesc.a  lib/libLLVMRISCVDesc.a  lib/libLLVMSparcDesc.a  lib/libLLVMSystemZDesc.a  lib/libLLVMWebAssemblyDesc.a  lib/libLLVMX86Desc.a  lib/libLLVMXCoreDesc.a  lib/libLLVMAArch64Disassembler.a  lib/libLLVMAMDGPUDisassembler.a  lib/libLLVMARMDisassembler.a  lib/libLLVMAVRDisassembler.a  lib/libLLVMBPFDisassembler.a  lib/libLLVMHexagonDisassembler.a  lib/libLLVMLanaiDisassembler.a  lib/libLLVMMipsDisassembler.a  lib/libLLVMMSP430Disassembler.a  lib/libLLVMPowerPCDisassembler.a  lib/libLLVMRISCVDisassembler.a  lib/libLLVMSparcDisassembler.a  lib/libLLVMSystemZDisassembler.a  lib/libLLVMWebAssemblyDisassembler.a  lib/libLLVMX86Disassembler.a  lib/libLLVMXCoreDisassembler.a  lib/libLLVMAArch64Info.a  lib/libLLVMAMDGPUInfo.a  lib/libLLVMARMInfo.a  lib/libLLVMAVRInfo.a  lib/libLLVMBPFInfo.a  lib/libLLVMHexagonInfo.a  lib/libLLVMLanaiInfo.a  lib/libLLVMMipsInfo.a  lib/libLLVMMSP430Info.a  lib/libLLVMNVPTXInfo.a  lib/libLLVMPowerPCInfo.a  lib/libLLVMRISCVInfo.a  lib/libLLVMSparcInfo.a  lib/libLLVMSystemZInfo.a  lib/libLLVMWebAssemblyInfo.a  lib/libLLVMX86Info.a  lib/libLLVMXCoreInfo.a  lib/libLLVMDebugInfoDWARF.a  lib/libLLVMDebugInfoPDB.a  lib/libLLVMMC.a  lib/libLLVMMCDisassembler.a  lib/libLLVMObject.a  lib/libLLVMSupport.a  lib/libLLVMSymbolize.a  lib/libLLVMRISCVUtils.a  lib/libLLVMAArch64Desc.a  lib/libLLVMAArch64Info.a  lib/libLLVMAArch64Utils.a  lib/libLLVMAMDGPUDesc.a  lib/libLLVMAMDGPUInfo.a  lib/libLLVMAMDGPUUtils.a  lib/libLLVMARMDesc.a  lib/libLLVMARMInfo.a  lib/libLLVMARMUtils.a  lib/libLLVMHexagonDesc.a  lib/libLLVMHexagonInfo.a  lib/libLLVMLanaiDesc.a  lib/libLLVMLanaiInfo.a  lib/libLLVMSystemZDesc.a  lib/libLLVMSystemZInfo.a  lib/libLLVMWebAssemblyDesc.a  lib/libLLVMWebAssemblyInfo.a  lib/libLLVMMCDisassembler.a  lib/libLLVMDebugInfoDWARF.a  lib/libLLVMDebugInfoPDB.a  lib/libLLVMObject.a  lib/libLLVMBitReader.a  lib/libLLVMCore.a  lib/libLLVMRemarks.a  lib/libLLVMBitstreamReader.a  lib/libLLVMMCParser.a  lib/libLLVMMC.a  lib/libLLVMDebugInfoCodeView.a  lib/libLLVMDebugInfoMSF.a  lib/libLLVMTextAPI.a  lib/libLLVMBinaryFormat.a  lib/libLLVMSupport.a  -lz  -lcurses  -lm  lib/libLLVMDemangle.a && :
[10365/10388] : && /Users/buildslave/jenkins/workspace/lldb-cmake/host-compiler/bin/clang++  -Wdocumentation -fPIC -fvisibility-inlines-hidden -Werror=date-time -Werror=unguarded-availability-new -fmodules -fmodules-cache-path=/Users/buildslave/jenkins/workspace/lldb-cmake/lldb-build/module.cache -fcxx-modules -Xclang -fmodules-local-submodule-visibility -Wall -Wextra -Wno-unused-parameter -Wwrite-strings -Wcast-qual -Wmissing-field-initializers -pedantic -Wno-long-long -Wimplicit-fallthrough -Wcovered-switch-default -Wno-noexcept-type -Wnon-virtual-dtor -Wdelete-non-virtual-dtor -Wstring-conversion -fdiagnostics-color -O3  -isysroot /Applications/Xcode.app/Contents/Developer/Platforms/MacOSX.platform/Developer/SDKs/MacOSX10.15.sdk -Wl,-search_paths_first -Wl,-headerpad_max_install_names -rdynamic tools/opt/CMakeFiles/opt.dir/AnalysisWrappers.cpp.o tools/opt/CMakeFiles/opt.dir/BreakpointPrinter.cpp.o tools/opt/CMakeFiles/opt.dir/GraphPrinters.cpp.o tools/opt/CMakeFiles/opt.dir/NewPMDriver.cpp.o tools/opt/CMakeFiles/opt.dir/PassPrinters.cpp.o tools/opt/CMakeFiles/opt.dir/PrintSCC.cpp.o tools/opt/CMakeFiles/opt.dir/opt.cpp.o  -o bin/opt  -Wl,-rpath,@loader_path/../lib  lib/libLLVMAArch64AsmParser.a  lib/libLLVMAMDGPUAsmParser.a  lib/libLLVMARMAsmParser.a  lib/libLLVMAVRAsmParser.a  lib/libLLVMBPFAsmParser.a  lib/libLLVMHexagonAsmParser.a  lib/libLLVMLanaiAsmParser.a  lib/libLLVMMipsAsmParser.a  lib/libLLVMMSP430AsmParser.a  lib/libLLVMPowerPCAsmParser.a  lib/libLLVMRISCVAsmParser.a  lib/libLLVMSparcAsmParser.a  lib/libLLVMSystemZAsmParser.a  lib/libLLVMWebAssemblyAsmParser.a  lib/libLLVMX86AsmParser.a  lib/libLLVMAArch64CodeGen.a  lib/libLLVMAMDGPUCodeGen.a  lib/libLLVMARMCodeGen.a  lib/libLLVMAVRCodeGen.a  lib/libLLVMBPFCodeGen.a  lib/libLLVMHexagonCodeGen.a  lib/libLLVMLanaiCodeGen.a  lib/libLLVMMipsCodeGen.a  lib/libLLVMMSP430CodeGen.a  lib/libLLVMNVPTXCodeGen.a  lib/libLLVMPowerPCCodeGen.a  lib/libLLVMRISCVCodeGen.a  lib/libLLVMSparcCodeGen.a  lib/libLLVMSystemZCodeGen.a  lib/libLLVMWebAssemblyCodeGen.a  lib/libLLVMX86CodeGen.a  lib/libLLVMXCoreCodeGen.a  lib/libLLVMAArch64Desc.a  lib/libLLVMAMDGPUDesc.a  lib/libLLVMARMDesc.a  lib/libLLVMAVRDesc.a  lib/libLLVMBPFDesc.a  lib/libLLVMHexagonDesc.a  lib/libLLVMLanaiDesc.a  lib/libLLVMMipsDesc.a  lib/libLLVMMSP430Desc.a  lib/libLLVMNVPTXDesc.a  lib/libLLVMPowerPCDesc.a  lib/libLLVMRISCVDesc.a  lib/libLLVMSparcDesc.a  lib/libLLVMSystemZDesc.a  lib/libLLVMWebAssemblyDesc.a  lib/libLLVMX86Desc.a  lib/libLLVMXCoreDesc.a  lib/libLLVMAArch64Info.a  lib/libLLVMAMDGPUInfo.a  lib/libLLVMARMInfo.a  lib/libLLVMAVRInfo.a  lib/libLLVMBPFInfo.a  lib/libLLVMHexagonInfo.a  lib/libLLVMLanaiInfo.a  lib/libLLVMMipsInfo.a  lib/libLLVMMSP430Info.a  lib/libLLVMNVPTXInfo.a  lib/libLLVMPowerPCInfo.a  lib/libLLVMRISCVInfo.a  lib/libLLVMSparcInfo.a  lib/libLLVMSystemZInfo.a  lib/libLLVMWebAssemblyInfo.a  lib/libLLVMX86Info.a  lib/libLLVMXCoreInfo.a  lib/libLLVMAggressiveInstCombine.a  lib/libLLVMAnalysis.a  lib/libLLVMAsmParser.a  lib/libLLVMBitWriter.a  lib/libLLVMCodeGen.a  lib/libLLVMCore.a  lib/libLLVMCoroutines.a  lib/libLLVMExtensions.a  lib/libLLVMipo.a  lib/libLLVMIRReader.a  lib/libLLVMInstCombine.a  lib/libLLVMInstrumentation.a  lib/libLLVMMC.a  lib/libLLVMObjCARCOpts.a  lib/libLLVMRemarks.a  lib/libLLVMScalarOpts.a  lib/libLLVMSupport.a  lib/libLLVMTarget.a  lib/libLLVMTransformUtils.a  lib/libLLVMVectorize.a  lib/libLLVMPasses.a  lib/libLLVMAArch64Utils.a  lib/libLLVMAMDGPUUtils.a  lib/libLLVMMIRParser.a  lib/libLLVMARMUtils.a  lib/libLLVMHexagonAsmParser.a  lib/libLLVMHexagonDesc.a  lib/libLLVMHexagonInfo.a  lib/libLLVMLanaiAsmParser.a  lib/libLLVMLanaiDesc.a  lib/libLLVMLanaiInfo.a  lib/libLLVMRISCVUtils.a  lib/libLLVMMCDisassembler.a  lib/libLLVMCFGuard.a  lib/libLLVMGlobalISel.a  lib/libLLVMAsmPrinter.a  lib/libLLVMDebugInfoDWARF.a  lib/libLLVMSelectionDAG.a  lib/libLLVMCodeGen.a  lib/libLLVMCoroutines.a  lib/libLLVMipo.a  lib/libLLVMBitWriter.a  lib/libLLVMIRReader.a  lib/libLLVMAsmParser.a  lib/libLLVMFrontendOpenMP.a  lib/libLLVMLinker.a  lib/libLLVMInstrumentation.a  lib/libLLVMScalarOpts.a  lib/libLLVMAggressiveInstCombine.a  lib/libLLVMInstCombine.a  lib/libLLVMTarget.a  lib/libLLVMVectorize.a  lib/libLLVMTransformUtils.a  lib/libLLVMAnalysis.a  lib/libLLVMProfileData.a  lib/libLLVMObject.a  lib/libLLVMMCParser.a  lib/libLLVMMC.a  lib/libLLVMDebugInfoCodeView.a  lib/libLLVMDebugInfoMSF.a  lib/libLLVMBitReader.a  lib/libLLVMTextAPI.a  lib/libLLVMCore.a  lib/libLLVMRemarks.a  lib/libLLVMBitstreamReader.a  lib/libLLVMBinaryFormat.a  lib/libLLVMSupport.a  -lz  -lcurses  -lm  lib/libLLVMDemangle.a && :
[10366/10388] /Users/buildslave/jenkins/workspace/lldb-cmake/host-compiler/bin/clang++  -DHAVE_POSIX_REGEX -DHAVE_STD_REGEX -DHAVE_STEADY_CLOCK -D_DEBUG -D__STDC_CONSTANT_MACROS -D__STDC_FORMAT_MACROS -D__STDC_LIMIT_MACROS -Iutils/benchmark/src -I/Users/buildslave/jenkins/workspace/lldb-cmake/llvm-project/llvm/utils/benchmark/src -I/Applications/Xcode.app/Contents/Developer/Platforms/MacOSX.platform/Developer/SDKs/MacOSX10.15.sdk/usr/include/libxml2 -Iinclude -I/Users/buildslave/jenkins/workspace/lldb-cmake/llvm-project/llvm/include -I/Users/buildslave/jenkins/workspace/lldb-cmake/llvm-project/llvm/utils/benchmark/include -I/Users/buildslave/jenkins/workspace/lldb-cmake/llvm-project/llvm/utils/benchmark/src/../include -Wdocumentation -fPIC -fvisibility-inlines-hidden -Werror=date-time -Werror=unguarded-availability-new -fmodules -fmodules-cache-path=/Users/buildslave/jenkins/workspace/lldb-cmake/lldb-build/module.cache -fcxx-modules -Xclang -fmodules-local-submodule-visibility -Wall -Wextra -Wno-unused-parameter -Wwrite-strings -Wcast-qual -Wmissing-field-initializers -pedantic -Wno-long-long -Wimplicit-fallthrough -Wcovered-switch-default -Wno-noexcept-type -Wnon-virtual-dtor -Wdelete-non-virtual-dtor -Wstring-conversion -fdiagnostics-color  -std=c++11  -Wall  -Wextra  -Wshadow  -pedantic  -pedantic-errors  -Wshorten-64-to-32  -Wfloat-equal  -fstrict-aliasing  -fno-exceptions  -Wstrict-aliasing  -Wthread-safety -O3  -isysroot /Applications/Xcode.app/Contents/Developer/Platforms/MacOSX.platform/Developer/SDKs/MacOSX10.15.sdk   -UNDEBUG -std=c++14 -MD -MT utils/benchmark/src/CMakeFiles/benchmark.dir/console_reporter.cc.o -MF utils/benchmark/src/CMakeFiles/benchmark.dir/console_reporter.cc.o.d -o utils/benchmark/src/CMakeFiles/benchmark.dir/console_reporter.cc.o -c /Users/buildslave/jenkins/workspace/lldb-cmake/llvm-project/llvm/utils/benchmark/src/console_reporter.cc
[10367/10388] /Users/buildslave/jenkins/workspace/lldb-cmake/host-compiler/bin/clang++  -DHAVE_POSIX_REGEX -DHAVE_STD_REGEX -DHAVE_STEADY_CLOCK -D_DEBUG -D__STDC_CONSTANT_MACROS -D__STDC_FORMAT_MACROS -D__STDC_LIMIT_MACROS -Iutils/benchmark/src -I/Users/buildslave/jenkins/workspace/lldb-cmake/llvm-project/llvm/utils/benchmark/src -I/Applications/Xcode.app/Contents/Developer/Platforms/MacOSX.platform/Developer/SDKs/MacOSX10.15.sdk/usr/include/libxml2 -Iinclude -I/Users/buildslave/jenkins/workspace/lldb-cmake/llvm-project/llvm/include -I/Users/buildslave/jenkins/workspace/lldb-cmake/llvm-project/llvm/utils/benchmark/include -I/Users/buildslave/jenkins/workspace/lldb-cmake/llvm-project/llvm/utils/benchmark/src/../include -Wdocumentation -fPIC -fvisibility-inlines-hidden -Werror=date-time -Werror=unguarded-availability-new -fmodules -fmodules-cache-path=/Users/buildslave/jenkins/workspace/lldb-cmake/lldb-build/module.cache -fcxx-modules -Xclang -fmodules-local-submodule-visibility -Wall -Wextra -Wno-unused-parameter -Wwrite-strings -Wcast-qual -Wmissing-field-initializers -pedantic -Wno-long-long -Wimplicit-fallthrough -Wcovered-switch-default -Wno-noexcept-type -Wnon-virtual-dtor -Wdelete-non-virtual-dtor -Wstring-conversion -fdiagnostics-color  -std=c++11  -Wall  -Wextra  -Wshadow  -pedantic  -pedantic-errors  -Wshorten-64-to-32  -Wfloat-equal  -fstrict-aliasing  -fno-exceptions  -Wstrict-aliasing  -Wthread-safety -O3  -isysroot /Applications/Xcode.app/Contents/Developer/Platforms/MacOSX.platform/Developer/SDKs/MacOSX10.15.sdk   -UNDEBUG -std=c++14 -MD -MT utils/benchmark/src/CMakeFiles/benchmark.dir/counter.cc.o -MF utils/benchmark/src/CMakeFiles/benchmark.dir/counter.cc.o.d -o utils/benchmark/src/CMakeFiles/benchmark.dir/counter.cc.o -c /Users/buildslave/jenkins/workspace/lldb-cmake/llvm-project/llvm/utils/benchmark/src/counter.cc
[10368/10388] /Users/buildslave/jenkins/workspace/lldb-cmake/host-compiler/bin/clang++  -DHAVE_POSIX_REGEX -DHAVE_STD_REGEX -DHAVE_STEADY_CLOCK -D_DEBUG -D__STDC_CONSTANT_MACROS -D__STDC_FORMAT_MACROS -D__STDC_LIMIT_MACROS -Iutils/benchmark/src -I/Users/buildslave/jenkins/workspace/lldb-cmake/llvm-project/llvm/utils/benchmark/src -I/Applications/Xcode.app/Contents/Developer/Platforms/MacOSX.platform/Developer/SDKs/MacOSX10.15.sdk/usr/include/libxml2 -Iinclude -I/Users/buildslave/jenkins/workspace/lldb-cmake/llvm-project/llvm/include -I/Users/buildslave/jenkins/workspace/lldb-cmake/llvm-project/llvm/utils/benchmark/include -I/Users/buildslave/jenkins/workspace/lldb-cmake/llvm-project/llvm/utils/benchmark/src/../include -Wdocumentation -fPIC -fvisibility-inlines-hidden -Werror=date-time -Werror=unguarded-availability-new -fmodules -fmodules-cache-path=/Users/buildslave/jenkins/workspace/lldb-cmake/lldb-build/module.cache -fcxx-modules -Xclang -fmodules-local-submodule-visibility -Wall -Wextra -Wno-unused-parameter -Wwrite-strings -Wcast-qual -Wmissing-field-initializers -pedantic -Wno-long-long -Wimplicit-fallthrough -Wcovered-switch-default -Wno-noexcept-type -Wnon-virtual-dtor -Wdelete-non-virtual-dtor -Wstring-conversion -fdiagnostics-color  -std=c++11  -Wall  -Wextra  -Wshadow  -pedantic  -pedantic-errors  -Wshorten-64-to-32  -Wfloat-equal  -fstrict-aliasing  -fno-exceptions  -Wstrict-aliasing  -Wthread-safety -O3  -isysroot /Applications/Xcode.app/Contents/Developer/Platforms/MacOSX.platform/Developer/SDKs/MacOSX10.15.sdk   -UNDEBUG -std=c++14 -MD -MT utils/benchmark/src/CMakeFiles/benchmark.dir/complexity.cc.o -MF utils/benchmark/src/CMakeFiles/benchmark.dir/complexity.cc.o.d -o utils/benchmark/src/CMakeFiles/benchmark.dir/complexity.cc.o -c /Users/buildslave/jenkins/workspace/lldb-cmake/llvm-project/llvm/utils/benchmark/src/complexity.cc
[10369/10388] /Users/buildslave/jenkins/workspace/lldb-cmake/host-compiler/bin/clang++  -DHAVE_POSIX_REGEX -DHAVE_STD_REGEX -DHAVE_STEADY_CLOCK -D_DEBUG -D__STDC_CONSTANT_MACROS -D__STDC_FORMAT_MACROS -D__STDC_LIMIT_MACROS -Iutils/benchmark/src -I/Users/buildslave/jenkins/workspace/lldb-cmake/llvm-project/llvm/utils/benchmark/src -I/Applications/Xcode.app/Contents/Developer/Platforms/MacOSX.platform/Developer/SDKs/MacOSX10.15.sdk/usr/include/libxml2 -Iinclude -I/Users/buildslave/jenkins/workspace/lldb-cmake/llvm-project/llvm/include -I/Users/buildslave/jenkins/workspace/lldb-cmake/llvm-project/llvm/utils/benchmark/include -I/Users/buildslave/jenkins/workspace/lldb-cmake/llvm-project/llvm/utils/benchmark/src/../include -Wdocumentation -fPIC -fvisibility-inlines-hidden -Werror=date-time -Werror=unguarded-availability-new -fmodules -fmodules-cache-path=/Users/buildslave/jenkins/workspace/lldb-cmake/lldb-build/module.cache -fcxx-modules -Xclang -fmodules-local-submodule-visibility -Wall -Wextra -Wno-unused-parameter -Wwrite-strings -Wcast-qual -Wmissing-field-initializers -pedantic -Wno-long-long -Wimplicit-fallthrough -Wcovered-switch-default -Wno-noexcept-type -Wnon-virtual-dtor -Wdelete-non-virtual-dtor -Wstring-conversion -fdiagnostics-color  -std=c++11  -Wall  -Wextra  -Wshadow  -pedantic  -pedantic-errors  -Wshorten-64-to-32  -Wfloat-equal  -fstrict-aliasing  -fno-exceptions  -Wstrict-aliasing  -Wthread-safety -O3  -isysroot /Applications/Xcode.app/Contents/Developer/Platforms/MacOSX.platform/Developer/SDKs/MacOSX10.15.sdk   -UNDEBUG -std=c++14 -MD -MT utils/benchmark/src/CMakeFiles/benchmark.dir/csv_reporter.cc.o -MF utils/benchmark/src/CMakeFiles/benchmark.dir/csv_reporter.cc.o.d -o utils/benchmark/src/CMakeFiles/benchmark.dir/csv_reporter.cc.o -c /Users/buildslave/jenkins/workspace/lldb-cmake/llvm-project/llvm/utils/benchmark/src/csv_reporter.cc
[10370/10388] /Users/buildslave/jenkins/workspace/lldb-cmake/host-compiler/bin/clang++  -DHAVE_POSIX_REGEX -DHAVE_STD_REGEX -DHAVE_STEADY_CLOCK -D_DEBUG -D__STDC_CONSTANT_MACROS -D__STDC_FORMAT_MACROS -D__STDC_LIMIT_MACROS -Iutils/benchmark/src -I/Users/buildslave/jenkins/workspace/lldb-cmake/llvm-project/llvm/utils/benchmark/src -I/Applications/Xcode.app/Contents/Developer/Platforms/MacOSX.platform/Developer/SDKs/MacOSX10.15.sdk/usr/include/libxml2 -Iinclude -I/Users/buildslave/jenkins/workspace/lldb-cmake/llvm-project/llvm/include -I/Users/buildslave/jenkins/workspace/lldb-cmake/llvm-project/llvm/utils/benchmark/include -I/Users/buildslave/jenkins/workspace/lldb-cmake/llvm-project/llvm/utils/benchmark/src/../include -Wdocumentation -fPIC -fvisibility-inlines-hidden -Werror=date-time -Werror=unguarded-availability-new -fmodules -fmodules-cache-path=/Users/buildslave/jenkins/workspace/lldb-cmake/lldb-build/module.cache -fcxx-modules -Xclang -fmodules-local-submodule-visibility -Wall -Wextra -Wno-unused-parameter -Wwrite-strings -Wcast-qual -Wmissing-field-initializers -pedantic -Wno-long-long -Wimplicit-fallthrough -Wcovered-switch-default -Wno-noexcept-type -Wnon-virtual-dtor -Wdelete-non-virtual-dtor -Wstring-conversion -fdiagnostics-color  -std=c++11  -Wall  -Wextra  -Wshadow  -pedantic  -pedantic-errors  -Wshorten-64-to-32  -Wfloat-equal  -fstrict-aliasing  -fno-exceptions  -Wstrict-aliasing  -Wthread-safety -O3  -isysroot /Applications/Xcode.app/Contents/Developer/Platforms/MacOSX.platform/Developer/SDKs/MacOSX10.15.sdk   -UNDEBUG -std=c++14 -MD -MT utils/benchmark/src/CMakeFiles/benchmark.dir/sleep.cc.o -MF utils/benchmark/src/CMakeFiles/benchmark.dir/sleep.cc.o.d -o utils/benchmark/src/CMakeFiles/benchmark.dir/sleep.cc.o -c /Users/buildslave/jenkins/workspace/lldb-cmake/llvm-project/llvm/utils/benchmark/src/sleep.cc
[10371/10388] /Users/buildslave/jenkins/workspace/lldb-cmake/host-compiler/bin/clang++  -DHAVE_POSIX_REGEX -DHAVE_STD_REGEX -DHAVE_STEADY_CLOCK -D_DEBUG -D__STDC_CONSTANT_MACROS -D__STDC_FORMAT_MACROS -D__STDC_LIMIT_MACROS -Iutils/benchmark/src -I/Users/buildslave/jenkins/workspace/lldb-cmake/llvm-project/llvm/utils/benchmark/src -I/Applications/Xcode.app/Contents/Developer/Platforms/MacOSX.platform/Developer/SDKs/MacOSX10.15.sdk/usr/include/libxml2 -Iinclude -I/Users/buildslave/jenkins/workspace/lldb-cmake/llvm-project/llvm/include -I/Users/buildslave/jenkins/workspace/lldb-cmake/llvm-project/llvm/utils/benchmark/include -I/Users/buildslave/jenkins/workspace/lldb-cmake/llvm-project/llvm/utils/benchmark/src/../include -Wdocumentation -fPIC -fvisibility-inlines-hidden -Werror=date-time -Werror=unguarded-availability-new -fmodules -fmodules-cache-path=/Users/buildslave/jenkins/workspace/lldb-cmake/lldb-build/module.cache -fcxx-modules -Xclang -fmodules-local-submodule-visibility -Wall -Wextra -Wno-unused-parameter -Wwrite-strings -Wcast-qual -Wmissing-field-initializers -pedantic -Wno-long-long -Wimplicit-fallthrough -Wcovered-switch-default -Wno-noexcept-type -Wnon-virtual-dtor -Wdelete-non-virtual-dtor -Wstring-conversion -fdiagnostics-color  -std=c++11  -Wall  -Wextra  -Wshadow  -pedantic  -pedantic-errors  -Wshorten-64-to-32  -Wfloat-equal  -fstrict-aliasing  -fno-exceptions  -Wstrict-aliasing  -Wthread-safety -O3  -isysroot /Applications/Xcode.app/Contents/Developer/Platforms/MacOSX.platform/Developer/SDKs/MacOSX10.15.sdk   -UNDEBUG -std=c++14 -MD -MT utils/benchmark/src/CMakeFiles/benchmark.dir/reporter.cc.o -MF utils/benchmark/src/CMakeFiles/benchmark.dir/reporter.cc.o.d -o utils/benchmark/src/CMakeFiles/benchmark.dir/reporter.cc.o -c /Users/buildslave/jenkins/workspace/lldb-cmake/llvm-project/llvm/utils/benchmark/src/reporter.cc
[10372/10388] /Users/buildslave/jenkins/workspace/lldb-cmake/host-compiler/bin/clang++  -DHAVE_POSIX_REGEX -DHAVE_STD_REGEX -DHAVE_STEADY_CLOCK -D_DEBUG -D__STDC_CONSTANT_MACROS -D__STDC_FORMAT_MACROS -D__STDC_LIMIT_MACROS -Iutils/benchmark/src -I/Users/buildslave/jenkins/workspace/lldb-cmake/llvm-project/llvm/utils/benchmark/src -I/Applications/Xcode.app/Contents/Developer/Platforms/MacOSX.platform/Developer/SDKs/MacOSX10.15.sdk/usr/include/libxml2 -Iinclude -I/Users/buildslave/jenkins/workspace/lldb-cmake/llvm-project/llvm/include -I/Users/buildslave/jenkins/workspace/lldb-cmake/llvm-project/llvm/utils/benchmark/include -I/Users/buildslave/jenkins/workspace/lldb-cmake/llvm-project/llvm/utils/benchmark/src/../include -Wdocumentation -fPIC -fvisibility-inlines-hidden -Werror=date-time -Werror=unguarded-availability-new -fmodules -fmodules-cache-path=/Users/buildslave/jenkins/workspace/lldb-cmake/lldb-build/module.cache -fcxx-modules -Xclang -fmodules-local-submodule-visibility -Wall -Wextra -Wno-unused-parameter -Wwrite-strings -Wcast-qual -Wmissing-field-initializers -pedantic -Wno-long-long -Wimplicit-fallthrough -Wcovered-switch-default -Wno-noexcept-type -Wnon-virtual-dtor -Wdelete-non-virtual-dtor -Wstring-conversion -fdiagnostics-color  -std=c++11  -Wall  -Wextra  -Wshadow  -pedantic  -pedantic-errors  -Wshorten-64-to-32  -Wfloat-equal  -fstrict-aliasing  -fno-exceptions  -Wstrict-aliasing  -Wthread-safety -O3  -isysroot /Applications/Xcode.app/Contents/Developer/Platforms/MacOSX.platform/Developer/SDKs/MacOSX10.15.sdk   -UNDEBUG -std=c++14 -MD -MT utils/benchmark/src/CMakeFiles/benchmark.dir/json_reporter.cc.o -MF utils/benchmark/src/CMakeFiles/benchmark.dir/json_reporter.cc.o.d -o utils/benchmark/src/CMakeFiles/benchmark.dir/json_reporter.cc.o -c /Users/buildslave/jenkins/workspace/lldb-cmake/llvm-project/llvm/utils/benchmark/src/json_reporter.cc
[10373/10388] cd /Users/buildslave/jenkins/workspace/lldb-cmake/lldb-build/utils/llvm-locstats && /usr/local/Cellar/cmake/3.17.2/bin/cmake -E copy /Users/buildslave/jenkins/workspace/lldb-cmake/llvm-project/llvm/utils/llvm-locstats/llvm-locstats.py /Users/buildslave/jenkins/workspace/lldb-cmake/lldb-build/./bin/llvm-locstats
[10374/10388] /Users/buildslave/jenkins/workspace/lldb-cmake/host-compiler/bin/clang++  -DHAVE_POSIX_REGEX -DHAVE_STD_REGEX -DHAVE_STEADY_CLOCK -D_DEBUG -D__STDC_CONSTANT_MACROS -D__STDC_FORMAT_MACROS -D__STDC_LIMIT_MACROS -Iutils/benchmark/src -I/Users/buildslave/jenkins/workspace/lldb-cmake/llvm-project/llvm/utils/benchmark/src -I/Applications/Xcode.app/Contents/Developer/Platforms/MacOSX.platform/Developer/SDKs/MacOSX10.15.sdk/usr/include/libxml2 -Iinclude -I/Users/buildslave/jenkins/workspace/lldb-cmake/llvm-project/llvm/include -I/Users/buildslave/jenkins/workspace/lldb-cmake/llvm-project/llvm/utils/benchmark/include -I/Users/buildslave/jenkins/workspace/lldb-cmake/llvm-project/llvm/utils/benchmark/src/../include -Wdocumentation -fPIC -fvisibility-inlines-hidden -Werror=date-time -Werror=unguarded-availability-new -fmodules -fmodules-cache-path=/Users/buildslave/jenkins/workspace/lldb-cmake/lldb-build/module.cache -fcxx-modules -Xclang -fmodules-local-submodule-visibility -Wall -Wextra -Wno-unused-parameter -Wwrite-strings -Wcast-qual -Wmissing-field-initializers -pedantic -Wno-long-long -Wimplicit-fallthrough -Wcovered-switch-default -Wno-noexcept-type -Wnon-virtual-dtor -Wdelete-non-virtual-dtor -Wstring-conversion -fdiagnostics-color  -std=c++11  -Wall  -Wextra  -Wshadow  -pedantic  -pedantic-errors  -Wshorten-64-to-32  -Wfloat-equal  -fstrict-aliasing  -fno-exceptions  -Wstrict-aliasing  -Wthread-safety -O3  -isysroot /Applications/Xcode.app/Contents/Developer/Platforms/MacOSX.platform/Developer/SDKs/MacOSX10.15.sdk   -UNDEBUG -std=c++14 -MD -MT utils/benchmark/src/CMakeFiles/benchmark.dir/timers.cc.o -MF utils/benchmark/src/CMakeFiles/benchmark.dir/timers.cc.o.d -o utils/benchmark/src/CMakeFiles/benchmark.dir/timers.cc.o -c /Users/buildslave/jenkins/workspace/lldb-cmake/llvm-project/llvm/utils/benchmark/src/timers.cc
[10375/10388] /Users/buildslave/jenkins/workspace/lldb-cmake/host-compiler/bin/clang++  -DHAVE_POSIX_REGEX -DHAVE_STD_REGEX -DHAVE_STEADY_CLOCK -D_DEBUG -D__STDC_CONSTANT_MACROS -D__STDC_FORMAT_MACROS -D__STDC_LIMIT_MACROS -Iutils/benchmark/src -I/Users/buildslave/jenkins/workspace/lldb-cmake/llvm-project/llvm/utils/benchmark/src -I/Applications/Xcode.app/Contents/Developer/Platforms/MacOSX.platform/Developer/SDKs/MacOSX10.15.sdk/usr/include/libxml2 -Iinclude -I/Users/buildslave/jenkins/workspace/lldb-cmake/llvm-project/llvm/include -I/Users/buildslave/jenkins/workspace/lldb-cmake/llvm-project/llvm/utils/benchmark/include -I/Users/buildslave/jenkins/workspace/lldb-cmake/llvm-project/llvm/utils/benchmark/src/../include -Wdocumentation -fPIC -fvisibility-inlines-hidden -Werror=date-time -Werror=unguarded-availability-new -fmodules -fmodules-cache-path=/Users/buildslave/jenkins/workspace/lldb-cmake/lldb-build/module.cache -fcxx-modules -Xclang -fmodules-local-submodule-visibility -Wall -Wextra -Wno-unused-parameter -Wwrite-strings -Wcast-qual -Wmissing-field-initializers -pedantic -Wno-long-long -Wimplicit-fallthrough -Wcovered-switch-default -Wno-noexcept-type -Wnon-virtual-dtor -Wdelete-non-virtual-dtor -Wstring-conversion -fdiagnostics-color  -std=c++11  -Wall  -Wextra  -Wshadow  -pedantic  -pedantic-errors  -Wshorten-64-to-32  -Wfloat-equal  -fstrict-aliasing  -fno-exceptions  -Wstrict-aliasing  -Wthread-safety -O3  -isysroot /Applications/Xcode.app/Contents/Developer/Platforms/MacOSX.platform/Developer/SDKs/MacOSX10.15.sdk   -UNDEBUG -std=c++14 -MD -MT utils/benchmark/src/CMakeFiles/benchmark.dir/string_util.cc.o -MF utils/benchmark/src/CMakeFiles/benchmark.dir/string_util.cc.o.d -o utils/benchmark/src/CMakeFiles/benchmark.dir/string_util.cc.o -c /Users/buildslave/jenkins/workspace/lldb-cmake/llvm-project/llvm/utils/benchmark/src/string_util.cc
[10376/10388] /Users/buildslave/jenkins/workspace/lldb-cmake/host-compiler/bin/clang++  -DHAVE_POSIX_REGEX -DHAVE_STD_REGEX -DHAVE_STEADY_CLOCK -D_DEBUG -D__STDC_CONSTANT_MACROS -D__STDC_FORMAT_MACROS -D__STDC_LIMIT_MACROS -Iutils/benchmark/src -I/Users/buildslave/jenkins/workspace/lldb-cmake/llvm-project/llvm/utils/benchmark/src -I/Applications/Xcode.app/Contents/Developer/Platforms/MacOSX.platform/Developer/SDKs/MacOSX10.15.sdk/usr/include/libxml2 -Iinclude -I/Users/buildslave/jenkins/workspace/lldb-cmake/llvm-project/llvm/include -I/Users/buildslave/jenkins/workspace/lldb-cmake/llvm-project/llvm/utils/benchmark/include -I/Users/buildslave/jenkins/workspace/lldb-cmake/llvm-project/llvm/utils/benchmark/src/../include -Wdocumentation -fPIC -fvisibility-inlines-hidden -Werror=date-time -Werror=unguarded-availability-new -fmodules -fmodules-cache-path=/Users/buildslave/jenkins/workspace/lldb-cmake/lldb-build/module.cache -fcxx-modules -Xclang -fmodules-local-submodule-visibility -Wall -Wextra -Wno-unused-parameter -Wwrite-strings -Wcast-qual -Wmissing-field-initializers -pedantic -Wno-long-long -Wimplicit-fallthrough -Wcovered-switch-default -Wno-noexcept-type -Wnon-virtual-dtor -Wdelete-non-virtual-dtor -Wstring-conversion -fdiagnostics-color  -std=c++11  -Wall  -Wextra  -Wshadow  -pedantic  -pedantic-errors  -Wshorten-64-to-32  -Wfloat-equal  -fstrict-aliasing  -fno-exceptions  -Wstrict-aliasing  -Wthread-safety -O3  -isysroot /Applications/Xcode.app/Contents/Developer/Platforms/MacOSX.platform/Developer/SDKs/MacOSX10.15.sdk   -UNDEBUG -std=c++14 -MD -MT utils/benchmark/src/CMakeFiles/benchmark.dir/sysinfo.cc.o -MF utils/benchmark/src/CMakeFiles/benchmark.dir/sysinfo.cc.o.d -o utils/benchmark/src/CMakeFiles/benchmark.dir/sysinfo.cc.o -c /Users/buildslave/jenkins/workspace/lldb-cmake/llvm-project/llvm/utils/benchmark/src/sysinfo.cc
[10377/10388] /Users/buildslave/jenkins/workspace/lldb-cmake/host-compiler/bin/clang++  -DHAVE_POSIX_REGEX -DHAVE_STD_REGEX -DHAVE_STEADY_CLOCK -D_DEBUG -D__STDC_CONSTANT_MACROS -D__STDC_FORMAT_MACROS -D__STDC_LIMIT_MACROS -Iutils/benchmark/src -I/Users/buildslave/jenkins/workspace/lldb-cmake/llvm-project/llvm/utils/benchmark/src -I/Applications/Xcode.app/Contents/Developer/Platforms/MacOSX.platform/Developer/SDKs/MacOSX10.15.sdk/usr/include/libxml2 -Iinclude -I/Users/buildslave/jenkins/workspace/lldb-cmake/llvm-project/llvm/include -I/Users/buildslave/jenkins/workspace/lldb-cmake/llvm-project/llvm/utils/benchmark/include -I/Users/buildslave/jenkins/workspace/lldb-cmake/llvm-project/llvm/utils/benchmark/src/../include -Wdocumentation -fPIC -fvisibility-inlines-hidden -Werror=date-time -Werror=unguarded-availability-new -fmodules -fmodules-cache-path=/Users/buildslave/jenkins/workspace/lldb-cmake/lldb-build/module.cache -fcxx-modules -Xclang -fmodules-local-submodule-visibility -Wall -Wextra -Wno-unused-parameter -Wwrite-strings -Wcast-qual -Wmissing-field-initializers -pedantic -Wno-long-long -Wimplicit-fallthrough -Wcovered-switch-default -Wno-noexcept-type -Wnon-virtual-dtor -Wdelete-non-virtual-dtor -Wstring-conversion -fdiagnostics-color  -std=c++11  -Wall  -Wextra  -Wshadow  -pedantic  -pedantic-errors  -Wshorten-64-to-32  -Wfloat-equal  -fstrict-aliasing  -fno-exceptions  -Wstrict-aliasing  -Wthread-safety -O3  -isysroot /Applications/Xcode.app/Contents/Developer/Platforms/MacOSX.platform/Developer/SDKs/MacOSX10.15.sdk   -UNDEBUG -std=c++14 -MD -MT utils/benchmark/src/CMakeFiles/benchmark.dir/benchmark.cc.o -MF utils/benchmark/src/CMakeFiles/benchmark.dir/benchmark.cc.o.d -o utils/benchmark/src/CMakeFiles/benchmark.dir/benchmark.cc.o -c /Users/buildslave/jenkins/workspace/lldb-cmake/llvm-project/llvm/utils/benchmark/src/benchmark.cc
[10378/10388] /Users/buildslave/jenkins/workspace/lldb-cmake/host-compiler/bin/clang++  -DHAVE_POSIX_REGEX -DHAVE_STD_REGEX -DHAVE_STEADY_CLOCK -D_DEBUG -D__STDC_CONSTANT_MACROS -D__STDC_FORMAT_MACROS -D__STDC_LIMIT_MACROS -Iutils/benchmark/src -I/Users/buildslave/jenkins/workspace/lldb-cmake/llvm-project/llvm/utils/benchmark/src -I/Applications/Xcode.app/Contents/Developer/Platforms/MacOSX.platform/Developer/SDKs/MacOSX10.15.sdk/usr/include/libxml2 -Iinclude -I/Users/buildslave/jenkins/workspace/lldb-cmake/llvm-project/llvm/include -I/Users/buildslave/jenkins/workspace/lldb-cmake/llvm-project/llvm/utils/benchmark/include -I/Users/buildslave/jenkins/workspace/lldb-cmake/llvm-project/llvm/utils/benchmark/src/../include -Wdocumentation -fPIC -fvisibility-inlines-hidden -Werror=date-time -Werror=unguarded-availability-new -fmodules -fmodules-cache-path=/Users/buildslave/jenkins/workspace/lldb-cmake/lldb-build/module.cache -fcxx-modules -Xclang -fmodules-local-submodule-visibility -Wall -Wextra -Wno-unused-parameter -Wwrite-strings -Wcast-qual -Wmissing-field-initializers -pedantic -Wno-long-long -Wimplicit-fallthrough -Wcovered-switch-default -Wno-noexcept-type -Wnon-virtual-dtor -Wdelete-non-virtual-dtor -Wstring-conversion -fdiagnostics-color  -std=c++11  -Wall  -Wextra  -Wshadow  -pedantic  -pedantic-errors  -Wshorten-64-to-32  -Wfloat-equal  -fstrict-aliasing  -fno-exceptions  -Wstrict-aliasing  -Wthread-safety -O3  -isysroot /Applications/Xcode.app/Contents/Developer/Platforms/MacOSX.platform/Developer/SDKs/MacOSX10.15.sdk   -UNDEBUG -std=c++14 -MD -MT utils/benchmark/src/CMakeFiles/benchmark.dir/statistics.cc.o -MF utils/benchmark/src/CMakeFiles/benchmark.dir/statistics.cc.o.d -o utils/benchmark/src/CMakeFiles/benchmark.dir/statistics.cc.o -c /Users/buildslave/jenkins/workspace/lldb-cmake/llvm-project/llvm/utils/benchmark/src/statistics.cc
[10379/10388] /Users/buildslave/jenkins/workspace/lldb-cmake/host-compiler/bin/clang++  -DHAVE_POSIX_REGEX -DHAVE_STD_REGEX -DHAVE_STEADY_CLOCK -D_DEBUG -D__STDC_CONSTANT_MACROS -D__STDC_FORMAT_MACROS -D__STDC_LIMIT_MACROS -Iutils/benchmark/src -I/Users/buildslave/jenkins/workspace/lldb-cmake/llvm-project/llvm/utils/benchmark/src -I/Applications/Xcode.app/Contents/Developer/Platforms/MacOSX.platform/Developer/SDKs/MacOSX10.15.sdk/usr/include/libxml2 -Iinclude -I/Users/buildslave/jenkins/workspace/lldb-cmake/llvm-project/llvm/include -I/Users/buildslave/jenkins/workspace/lldb-cmake/llvm-project/llvm/utils/benchmark/include -I/Users/buildslave/jenkins/workspace/lldb-cmake/llvm-project/llvm/utils/benchmark/src/../include -Wdocumentation -fPIC -fvisibility-inlines-hidden -Werror=date-time -Werror=unguarded-availability-new -fmodules -fmodules-cache-path=/Users/buildslave/jenkins/workspace/lldb-cmake/lldb-build/module.cache -fcxx-modules -Xclang -fmodules-local-submodule-visibility -Wall -Wextra -Wno-unused-parameter -Wwrite-strings -Wcast-qual -Wmissing-field-initializers -pedantic -Wno-long-long -Wimplicit-fallthrough -Wcovered-switch-default -Wno-noexcept-type -Wnon-virtual-dtor -Wdelete-non-virtual-dtor -Wstring-conversion -fdiagnostics-color  -std=c++11  -Wall  -Wextra  -Wshadow  -pedantic  -pedantic-errors  -Wshorten-64-to-32  -Wfloat-equal  -fstrict-aliasing  -fno-exceptions  -Wstrict-aliasing  -Wthread-safety -O3  -isysroot /Applications/Xcode.app/Contents/Developer/Platforms/MacOSX.platform/Developer/SDKs/MacOSX10.15.sdk   -UNDEBUG -std=c++14 -MD -MT utils/benchmark/src/CMakeFiles/benchmark.dir/benchmark_register.cc.o -MF utils/benchmark/src/CMakeFiles/benchmark.dir/benchmark_register.cc.o.d -o utils/benchmark/src/CMakeFiles/benchmark.dir/benchmark_register.cc.o -c /Users/buildslave/jenkins/workspace/lldb-cmake/llvm-project/llvm/utils/benchmark/src/benchmark_register.cc
[10380/10388] : && "/Applications/Xcode.app/Contents/Developer/Toolchains/XcodeDefault.xctoolchain/usr/bin/libtool" -static -no_warning_for_no_symbols -o lib/libbenchmark.a  utils/benchmark/src/CMakeFiles/benchmark.dir/benchmark.cc.o utils/benchmark/src/CMakeFiles/benchmark.dir/benchmark_register.cc.o utils/benchmark/src/CMakeFiles/benchmark.dir/colorprint.cc.o utils/benchmark/src/CMakeFiles/benchmark.dir/commandlineflags.cc.o utils/benchmark/src/CMakeFiles/benchmark.dir/complexity.cc.o utils/benchmark/src/CMakeFiles/benchmark.dir/console_reporter.cc.o utils/benchmark/src/CMakeFiles/benchmark.dir/counter.cc.o utils/benchmark/src/CMakeFiles/benchmark.dir/csv_reporter.cc.o utils/benchmark/src/CMakeFiles/benchmark.dir/json_reporter.cc.o utils/benchmark/src/CMakeFiles/benchmark.dir/reporter.cc.o utils/benchmark/src/CMakeFiles/benchmark.dir/sleep.cc.o utils/benchmark/src/CMakeFiles/benchmark.dir/statistics.cc.o utils/benchmark/src/CMakeFiles/benchmark.dir/string_util.cc.o utils/benchmark/src/CMakeFiles/benchmark.dir/sysinfo.cc.o utils/benchmark/src/CMakeFiles/benchmark.dir/timers.cc.o && :
[10381/10388] : && "/Applications/Xcode.app/Contents/Developer/Toolchains/XcodeDefault.xctoolchain/usr/bin/libtool" -static -no_warning_for_no_symbols -o lib/libbenchmark_main.a  utils/benchmark/src/CMakeFiles/benchmark_main.dir/benchmark_main.cc.o && :
[10382/10388] /Users/buildslave/jenkins/workspace/lldb-cmake/host-compiler/bin/clang++  -DGTEST_HAS_RTTI=0 -DGTEST_HAS_TR1_TUPLE=0 -DGTEST_LANG_CXX11=1 -DLLVM_ENABLE_PLUGINS -D_DEBUG -D__STDC_CONSTANT_MACROS -D__STDC_FORMAT_MACROS -D__STDC_LIMIT_MACROS -Iunittests/Passes -I/Users/buildslave/jenkins/workspace/lldb-cmake/llvm-project/llvm/unittests/Passes -I/Applications/Xcode.app/Contents/Developer/Platforms/MacOSX.platform/Developer/SDKs/MacOSX10.15.sdk/usr/include/libxml2 -Iinclude -I/Users/buildslave/jenkins/workspace/lldb-cmake/llvm-project/llvm/include -I/Users/buildslave/jenkins/workspace/lldb-cmake/llvm-project/llvm/utils/unittest/googletest/include -I/Users/buildslave/jenkins/workspace/lldb-cmake/llvm-project/llvm/utils/unittest/googlemock/include -Wdocumentation -fPIC -fvisibility-inlines-hidden -Werror=date-time -Werror=unguarded-availability-new -fmodules -fmodules-cache-path=/Users/buildslave/jenkins/workspace/lldb-cmake/lldb-build/module.cache -fcxx-modules -Xclang -fmodules-local-submodule-visibility -Wall -Wextra -Wno-unused-parameter -Wwrite-strings -Wcast-qual -Wmissing-field-initializers -pedantic -Wno-long-long -Wimplicit-fallthrough -Wcovered-switch-default -Wno-noexcept-type -Wnon-virtual-dtor -Wdelete-non-virtual-dtor -Wstring-conversion -fdiagnostics-color -O3  -isysroot /Applications/Xcode.app/Contents/Developer/Platforms/MacOSX.platform/Developer/SDKs/MacOSX10.15.sdk -fPIC    -fno-exceptions -fno-rtti -UNDEBUG -std=c++14 -MD -MT unittests/Passes/CMakeFiles/TestPlugin.dir/TestPlugin.cpp.o -MF unittests/Passes/CMakeFiles/TestPlugin.dir/TestPlugin.cpp.o.d -o unittests/Passes/CMakeFiles/TestPlugin.dir/TestPlugin.cpp.o -c /Users/buildslave/jenkins/workspace/lldb-cmake/llvm-project/llvm/unittests/Passes/TestPlugin.cpp
[10383/10388] : && /Users/buildslave/jenkins/workspace/lldb-cmake/host-compiler/bin/clang++ -Wdocumentation -fPIC -fvisibility-inlines-hidden -Werror=date-time -Werror=unguarded-availability-new -fmodules -fmodules-cache-path=/Users/buildslave/jenkins/workspace/lldb-cmake/lldb-build/module.cache -fcxx-modules -Xclang -fmodules-local-submodule-visibility -Wall -Wextra -Wno-unused-parameter -Wwrite-strings -Wcast-qual -Wmissing-field-initializers -pedantic -Wno-long-long -Wimplicit-fallthrough -Wcovered-switch-default -Wno-noexcept-type -Wnon-virtual-dtor -Wdelete-non-virtual-dtor -Wstring-conversion -fdiagnostics-color -O3 -isysroot /Applications/Xcode.app/Contents/Developer/Platforms/MacOSX.platform/Developer/SDKs/MacOSX10.15.sdk -bundle -Wl,-headerpad_max_install_names -Wl,-flat_namespace -Wl,-undefined -Wl,suppress   -Wl,-dead_strip -o unittests/Passes/TestPlugin.dylib unittests/Passes/CMakeFiles/TestPlugin.dir/TestPlugin.cpp.o  -Wl,-rpath,@loader_path/../lib && :
[10384/10388] /Users/buildslave/jenkins/workspace/lldb-cmake/host-compiler/bin/clang++  -DGTEST_HAS_RTTI=0 -D_DEBUG -D__STDC_CONSTANT_MACROS -D__STDC_FORMAT_MACROS -D__STDC_LIMIT_MACROS -Itools/llvm-readobj -I/Users/buildslave/jenkins/workspace/lldb-cmake/llvm-project/llvm/tools/llvm-readobj -I/Applications/Xcode.app/Contents/Developer/Platforms/MacOSX.platform/Developer/SDKs/MacOSX10.15.sdk/usr/include/libxml2 -Iinclude -I/Users/buildslave/jenkins/workspace/lldb-cmake/llvm-project/llvm/include -Wdocumentation -fPIC -fvisibility-inlines-hidden -Werror=date-time -Werror=unguarded-availability-new -fmodules -fmodules-cache-path=/Users/buildslave/jenkins/workspace/lldb-cmake/lldb-build/module.cache -fcxx-modules -Xclang -fmodules-local-submodule-visibility -Wall -Wextra -Wno-unused-parameter -Wwrite-strings -Wcast-qual -Wmissing-field-initializers -pedantic -Wno-long-long -Wimplicit-fallthrough -Wcovered-switch-default -Wno-noexcept-type -Wnon-virtual-dtor -Wdelete-non-virtual-dtor -Wstring-conversion -fdiagnostics-color -O3  -isysroot /Applications/Xcode.app/Contents/Developer/Platforms/MacOSX.platform/Developer/SDKs/MacOSX10.15.sdk    -fno-exceptions -fno-rtti -UNDEBUG -std=c++14 -MD -MT tools/llvm-readobj/CMakeFiles/llvm-readobj.dir/ELFDumper.cpp.o -MF tools/llvm-readobj/CMakeFiles/llvm-readobj.dir/ELFDumper.cpp.o.d -o tools/llvm-readobj/CMakeFiles/llvm-readobj.dir/ELFDumper.cpp.o -c /Users/buildslave/jenkins/workspace/lldb-cmake/llvm-project/llvm/tools/llvm-readobj/ELFDumper.cpp
[10385/10388] /Users/buildslave/jenkins/workspace/lldb-cmake/host-compiler/bin/clang++  -DGTEST_HAS_RTTI=0 -D_DEBUG -D__STDC_CONSTANT_MACROS -D__STDC_FORMAT_MACROS -D__STDC_LIMIT_MACROS -Itools/obj2yaml -I/Users/buildslave/jenkins/workspace/lldb-cmake/llvm-project/llvm/tools/obj2yaml -I/Applications/Xcode.app/Contents/Developer/Platforms/MacOSX.platform/Developer/SDKs/MacOSX10.15.sdk/usr/include/libxml2 -Iinclude -I/Users/buildslave/jenkins/workspace/lldb-cmake/llvm-project/llvm/include -Wdocumentation -fPIC -fvisibility-inlines-hidden -Werror=date-time -Werror=unguarded-availability-new -fmodules -fmodules-cache-path=/Users/buildslave/jenkins/workspace/lldb-cmake/lldb-build/module.cache -fcxx-modules -Xclang -fmodules-local-submodule-visibility -Wall -Wextra -Wno-unused-parameter -Wwrite-strings -Wcast-qual -Wmissing-field-initializers -pedantic -Wno-long-long -Wimplicit-fallthrough -Wcovered-switch-default -Wno-noexcept-type -Wnon-virtual-dtor -Wdelete-non-virtual-dtor -Wstring-conversion -fdiagnostics-color -O3  -isysroot /Applications/Xcode.app/Contents/Developer/Platforms/MacOSX.platform/Developer/SDKs/MacOSX10.15.sdk    -fno-exceptions -fno-rtti -UNDEBUG -std=c++14 -MD -MT tools/obj2yaml/CMakeFiles/obj2yaml.dir/elf2yaml.cpp.o -MF tools/obj2yaml/CMakeFiles/obj2yaml.dir/elf2yaml.cpp.o.d -o tools/obj2yaml/CMakeFiles/obj2yaml.dir/elf2yaml.cpp.o -c /Users/buildslave/jenkins/workspace/lldb-cmake/llvm-project/llvm/tools/obj2yaml/elf2yaml.cpp
[10386/10388] : && /Users/buildslave/jenkins/workspace/lldb-cmake/host-compiler/bin/clang++  -Wdocumentation -fPIC -fvisibility-inlines-hidden -Werror=date-time -Werror=unguarded-availability-new -fmodules -fmodules-cache-path=/Users/buildslave/jenkins/workspace/lldb-cmake/lldb-build/module.cache -fcxx-modules -Xclang -fmodules-local-submodule-visibility -Wall -Wextra -Wno-unused-parameter -Wwrite-strings -Wcast-qual -Wmissing-field-initializers -pedantic -Wno-long-long -Wimplicit-fallthrough -Wcovered-switch-default -Wno-noexcept-type -Wnon-virtual-dtor -Wdelete-non-virtual-dtor -Wstring-conversion -fdiagnostics-color -O3  -isysroot /Applications/Xcode.app/Contents/Developer/Platforms/MacOSX.platform/Developer/SDKs/MacOSX10.15.sdk -Wl,-search_paths_first -Wl,-headerpad_max_install_names -Wl,-dead_strip tools/llvm-readobj/CMakeFiles/llvm-readobj.dir/ARMWinEHPrinter.cpp.o tools/llvm-readobj/CMakeFiles/llvm-readobj.dir/COFFDumper.cpp.o tools/llvm-readobj/CMakeFiles/llvm-readobj.dir/COFFImportDumper.cpp.o tools/llvm-readobj/CMakeFiles/llvm-readobj.dir/ELFDumper.cpp.o tools/llvm-readobj/CMakeFiles/llvm-readobj.dir/Error.cpp.o tools/llvm-readobj/CMakeFiles/llvm-readobj.dir/llvm-readobj.cpp.o tools/llvm-readobj/CMakeFiles/llvm-readobj.dir/MachODumper.cpp.o tools/llvm-readobj/CMakeFiles/llvm-readobj.dir/ObjDumper.cpp.o tools/llvm-readobj/CMakeFiles/llvm-readobj.dir/WasmDumper.cpp.o tools/llvm-readobj/CMakeFiles/llvm-readobj.dir/Win64EHDumper.cpp.o tools/llvm-readobj/CMakeFiles/llvm-readobj.dir/WindowsResourceDumper.cpp.o tools/llvm-readobj/CMakeFiles/llvm-readobj.dir/XCOFFDumper.cpp.o  -o bin/llvm-readobj  -Wl,-rpath,@loader_path/../lib  lib/libLLVMDebugInfoCodeView.a  lib/libLLVMDebugInfoDWARF.a  lib/libLLVMDemangle.a  lib/libLLVMObject.a  lib/libLLVMBinaryFormat.a  lib/libLLVMSupport.a  lib/libLLVMDebugInfoCodeView.a  lib/libLLVMDebugInfoMSF.a  lib/libLLVMDebugInfoPDB.a  lib/libLLVMObject.a  lib/libLLVMBitReader.a  lib/libLLVMCore.a  lib/libLLVMRemarks.a  lib/libLLVMBitstreamReader.a  lib/libLLVMMCParser.a  lib/libLLVMMC.a  lib/libLLVMDebugInfoCodeView.a  lib/libLLVMTextAPI.a  lib/libLLVMBinaryFormat.a  lib/libLLVMDebugInfoMSF.a  lib/libLLVMSupport.a  lib/libLLVMDemangle.a  -lz  -lcurses  -lm && :
[10387/10388] cd /Users/buildslave/jenkins/workspace/lldb-cmake/lldb-build/tools/llvm-readobj && /usr/local/Cellar/cmake/3.17.2/bin/cmake -E create_symlink llvm-readobj /Users/buildslave/jenkins/workspace/lldb-cmake/lldb-build/./bin/llvm-readelf
[10388/10388] : && /Users/buildslave/jenkins/workspace/lldb-cmake/host-compiler/bin/clang++  -Wdocumentation -fPIC -fvisibility-inlines-hidden -Werror=date-time -Werror=unguarded-availability-new -fmodules -fmodules-cache-path=/Users/buildslave/jenkins/workspace/lldb-cmake/lldb-build/module.cache -fcxx-modules -Xclang -fmodules-local-submodule-visibility -Wall -Wextra -Wno-unused-parameter -Wwrite-strings -Wcast-qual -Wmissing-field-initializers -pedantic -Wno-long-long -Wimplicit-fallthrough -Wcovered-switch-default -Wno-noexcept-type -Wnon-virtual-dtor -Wdelete-non-virtual-dtor -Wstring-conversion -fdiagnostics-color -O3  -isysroot /Applications/Xcode.app/Contents/Developer/Platforms/MacOSX.platform/Developer/SDKs/MacOSX10.15.sdk -Wl,-search_paths_first -Wl,-headerpad_max_install_names -Wl,-dead_strip tools/obj2yaml/CMakeFiles/obj2yaml.dir/obj2yaml.cpp.o tools/obj2yaml/CMakeFiles/obj2yaml.dir/coff2yaml.cpp.o tools/obj2yaml/CMakeFiles/obj2yaml.dir/dwarf2yaml.cpp.o tools/obj2yaml/CMakeFiles/obj2yaml.dir/elf2yaml.cpp.o tools/obj2yaml/CMakeFiles/obj2yaml.dir/macho2yaml.cpp.o tools/obj2yaml/CMakeFiles/obj2yaml.dir/minidump2yaml.cpp.o tools/obj2yaml/CMakeFiles/obj2yaml.dir/xcoff2yaml.cpp.o tools/obj2yaml/CMakeFiles/obj2yaml.dir/wasm2yaml.cpp.o tools/obj2yaml/CMakeFiles/obj2yaml.dir/Error.cpp.o  -o bin/obj2yaml  -Wl,-rpath,@loader_path/../lib  lib/libLLVMBinaryFormat.a  lib/libLLVMDebugInfoCodeView.a  lib/libLLVMDebugInfoDWARF.a  lib/libLLVMObject.a  lib/libLLVMObjectYAML.a  lib/libLLVMSupport.a  lib/libLLVMObject.a  lib/libLLVMBitReader.a  lib/libLLVMCore.a  lib/libLLVMRemarks.a  lib/libLLVMBitstreamReader.a  lib/libLLVMMCParser.a  lib/libLLVMTextAPI.a  lib/libLLVMMC.a  lib/libLLVMBinaryFormat.a  lib/libLLVMDebugInfoCodeView.a  lib/libLLVMDebugInfoMSF.a  lib/libLLVMSupport.a  -lz  -lcurses  -lm  lib/libLLVMDemangle.a && :
Completed at: 2020-07-16T05:24:50
@@@@@@
[Pipeline] }
[Pipeline] // timeout
[Pipeline] }
[Pipeline] // stage
[Pipeline] stage
[Pipeline] { (Test)
[Pipeline] timeout
Timeout set to expire in 1 hr 0 min
[Pipeline] {
[Pipeline] sh
+ set -u
+ export PATH=/usr/local/bin:/usr/local/sbin:/usr/bin:/bin:/usr/sbin:/sbin:/usr/bin:/usr/local/bin
+ PATH=/usr/local/bin:/usr/local/sbin:/usr/bin:/bin:/usr/sbin:/sbin:/usr/bin:/usr/local/bin
+ export LLDB_CAPTURE_REPRODUCER=1
+ LLDB_CAPTURE_REPRODUCER=1
+ rm -rf test/results.xml
+ python llvm-zorg/zorg/jenkins/monorepo_build.py lldb-cmake testlong
You are using pip version 18.1, however version 20.2b1 is available.
You should consider upgrading via the 'pip install --upgrade pip' command.
You are using pip version 18.1, however version 20.2b1 is available.
You should consider upgrading via the 'pip install --upgrade pip' command.
Dependency met os_version v10.15.5
Dependency met brew cmake v3.17.2
Dependency met brew ninja v1.8.2
Dependency met pip psutil v5.4.5
Dependency met pip six v1.11.0
Dependency met xcode v11.5
Clean

Hide Details

@@@ Clean @@@ Removing module cache: /Users/buildslave/jenkins/workspace/lldb-cmake/lldb-build/module.cache Completed at: 2020-07-16T05:25:27 @@@@@@
Run Debug Info Tests

Hide Details

@@@ Run Debug Info Tests @@@ cd /Users/buildslave/jenkins/workspace/lldb-cmake/lldb-build '/usr/local/bin/ninja' '-v' 'check-debuginfo' [1/3] cd /Users/buildslave/jenkins/workspace/lldb-cmake/lldb-build/tools/lldb && /usr/local/Cellar/cmake/3.17.2/bin/cmake -E make_directory /Users/buildslave/jenkins/workspace/lldb-cmake/lldb-build/./lib/python3.7/site-packages/lldb [2/3] cd /Users/buildslave/jenkins/workspace/lldb-cmake/lldb-build/tools/lldb && /usr/local/Cellar/cmake/3.17.2/bin/cmake -E copy /Users/buildslave/jenkins/workspace/lldb-cmake/llvm-project/lldb/third_party/Python/module/six/six.py /Users/buildslave/jenkins/workspace/lldb-cmake/lldb-build/./lib/python3.7/site-packages/lldb/../six.py && cd /Users/buildslave/jenkins/workspace/lldb-cmake/lldb-build/tools/lldb && /usr/local/Cellar/cmake/3.17.2/bin/cmake -E copy /Users/buildslave/jenkins/workspace/lldb-cmake/lldb-build/tools/lldb/bindings/lldb.py /Users/buildslave/jenkins/workspace/lldb-cmake/lldb-build/./lib/python3.7/site-packages/lldb/__init__.py && cd /Users/buildslave/jenkins/workspace/lldb-cmake/lldb-build/tools/lldb && /usr/local/Cellar/cmake/3.17.2/bin/cmake -E copy /Users/buildslave/jenkins/workspace/lldb-cmake/llvm-project/lldb/source/Interpreter/embedded_interpreter.py /Users/buildslave/jenkins/workspace/lldb-cmake/lldb-build/./lib/python3.7/site-packages/lldb && cd /Users/buildslave/jenkins/workspace/lldb-cmake/lldb-build/lib/python3.7/site-packages/lldb && /usr/local/Cellar/cmake/3.17.2/bin/cmake -E make_directory formatters/cpp && /usr/local/Cellar/cmake/3.17.2/bin/cmake -E copy /Users/buildslave/jenkins/workspace/lldb-cmake/llvm-project/lldb/examples/synthetic/gnu_libstdcpp.py /Users/buildslave/jenkins/workspace/lldb-cmake/llvm-project/lldb/examples/synthetic/libcxx.py formatters/cpp && /usr/local/Frameworks/Python.framework/Versions/3.7/bin/python3.7 /Users/buildslave/jenkins/workspace/lldb-cmake/llvm-project/lldb/bindings/python/createPythonInit.py formatters/cpp /Users/buildslave/jenkins/workspace/lldb-cmake/llvm-project/lldb/examples/synthetic/gnu_libstdcpp.py /Users/buildslave/jenkins/workspace/lldb-cmake/llvm-project/lldb/examples/synthetic/libcxx.py && cd /Users/buildslave/jenkins/workspace/lldb-cmake/lldb-build/lib/python3.7/site-packages/lldb && /usr/local/Cellar/cmake/3.17.2/bin/cmake -E make_directory formatters && /usr/local/Cellar/cmake/3.17.2/bin/cmake -E copy /Users/buildslave/jenkins/workspace/lldb-cmake/llvm-project/lldb/examples/summaries/cocoa/cache.py /Users/buildslave/jenkins/workspace/lldb-cmake/llvm-project/lldb/examples/summaries/synth.py /Users/buildslave/jenkins/workspace/lldb-cmake/llvm-project/lldb/examples/summaries/cocoa/metrics.py /Users/buildslave/jenkins/workspace/lldb-cmake/llvm-project/lldb/examples/summaries/cocoa/attrib_fromdict.py /Users/buildslave/jenkins/workspace/lldb-cmake/llvm-project/lldb/examples/summaries/cocoa/Logger.py formatters && /usr/local/Frameworks/Python.framework/Versions/3.7/bin/python3.7 /Users/buildslave/jenkins/workspace/lldb-cmake/llvm-project/lldb/bindings/python/createPythonInit.py formatters /Users/buildslave/jenkins/workspace/lldb-cmake/llvm-project/lldb/examples/summaries/cocoa/cache.py /Users/buildslave/jenkins/workspace/lldb-cmake/llvm-project/lldb/examples/summaries/synth.py /Users/buildslave/jenkins/workspace/lldb-cmake/llvm-project/lldb/examples/summaries/cocoa/metrics.py /Users/buildslave/jenkins/workspace/lldb-cmake/llvm-project/lldb/examples/summaries/cocoa/attrib_fromdict.py /Users/buildslave/jenkins/workspace/lldb-cmake/llvm-project/lldb/examples/summaries/cocoa/Logger.py && cd /Users/buildslave/jenkins/workspace/lldb-cmake/lldb-build/lib/python3.7/site-packages/lldb && /usr/local/Cellar/cmake/3.17.2/bin/cmake -E make_directory utils && /usr/local/Cellar/cmake/3.17.2/bin/cmake -E copy /Users/buildslave/jenkins/workspace/lldb-cmake/llvm-project/lldb/examples/python/in_call_stack.py /Users/buildslave/jenkins/workspace/lldb-cmake/llvm-project/lldb/examples/python/symbolication.py utils && /usr/local/Frameworks/Python.framework/Versions/3.7/bin/python3.7 /Users/buildslave/jenkins/workspace/lldb-cmake/llvm-project/lldb/bindings/python/createPythonInit.py utils /Users/buildslave/jenkins/workspace/lldb-cmake/llvm-project/lldb/examples/python/in_call_stack.py /Users/buildslave/jenkins/workspace/lldb-cmake/llvm-project/lldb/examples/python/symbolication.py && cd /Users/buildslave/jenkins/workspace/lldb-cmake/lldb-build/lib/python3.7/site-packages/lldb && /usr/local/Cellar/cmake/3.17.2/bin/cmake -E make_directory macosx && /usr/local/Cellar/cmake/3.17.2/bin/cmake -E copy /Users/buildslave/jenkins/workspace/lldb-cmake/llvm-project/lldb/examples/python/crashlog.py /Users/buildslave/jenkins/workspace/lldb-cmake/llvm-project/lldb/examples/darwin/heap_find/heap.py macosx && /usr/local/Frameworks/Python.framework/Versions/3.7/bin/python3.7 /Users/buildslave/jenkins/workspace/lldb-cmake/llvm-project/lldb/bindings/python/createPythonInit.py macosx /Users/buildslave/jenkins/workspace/lldb-cmake/llvm-project/lldb/examples/python/crashlog.py /Users/buildslave/jenkins/workspace/lldb-cmake/llvm-project/lldb/examples/darwin/heap_find/heap.py && cd /Users/buildslave/jenkins/workspace/lldb-cmake/lldb-build/lib/python3.7/site-packages/lldb && /usr/local/Cellar/cmake/3.17.2/bin/cmake -E make_directory macosx/heap && /usr/local/Cellar/cmake/3.17.2/bin/cmake -E copy /Users/buildslave/jenkins/workspace/lldb-cmake/llvm-project/lldb/examples/darwin/heap_find/heap/heap_find.cpp /Users/buildslave/jenkins/workspace/lldb-cmake/llvm-project/lldb/examples/darwin/heap_find/heap/Makefile macosx/heap && cd /Users/buildslave/jenkins/workspace/lldb-cmake/lldb-build/lib/python3.7/site-packages/lldb && /usr/local/Cellar/cmake/3.17.2/bin/cmake -E make_directory diagnose && /usr/local/Cellar/cmake/3.17.2/bin/cmake -E copy /Users/buildslave/jenkins/workspace/lldb-cmake/llvm-project/lldb/examples/python/diagnose_unwind.py /Users/buildslave/jenkins/workspace/lldb-cmake/llvm-project/lldb/examples/python/diagnose_nsstring.py diagnose && /usr/local/Frameworks/Python.framework/Versions/3.7/bin/python3.7 /Users/buildslave/jenkins/workspace/lldb-cmake/llvm-project/lldb/bindings/python/createPythonInit.py diagnose /Users/buildslave/jenkins/workspace/lldb-cmake/llvm-project/lldb/examples/python/diagnose_unwind.py /Users/buildslave/jenkins/workspace/lldb-cmake/llvm-project/lldb/examples/python/diagnose_nsstring.py && cd /Users/buildslave/jenkins/workspace/lldb-cmake/lldb-build/lib/python3.7/site-packages/lldb && /usr/local/Cellar/cmake/3.17.2/bin/cmake -E create_symlink ../../../liblldb.dylib _lldb.so && cd /Users/buildslave/jenkins/workspace/lldb-cmake/lldb-build/lib/python3.7/site-packages/lldb && /usr/local/Cellar/cmake/3.17.2/bin/cmake -E create_symlink ../../../../bin/lldb-argdumper lldb-argdumper [2/3] cd /Users/buildslave/jenkins/workspace/lldb-cmake/lldb-build/projects/debuginfo-tests && /usr/local/Frameworks/Python.framework/Versions/3.7/bin/python3.7 /Users/buildslave/jenkins/workspace/lldb-cmake/lldb-build/./bin/llvm-lit -v --time-tests --shuffle --xunit-xml-output=/Users/buildslave/jenkins/workspace/lldb-cmake/test/results.xml -v /Users/buildslave/jenkins/workspace/lldb-cmake/lldb-build/projects/debuginfo-tests -- Testing: 60 tests, 8 workers -- llvm-lit: /Users/buildslave/jenkins/workspace/lldb-cmake/lldb-build/bin/../../llvm-project/llvm/utils/lit/lit/llvm/config.py:345: note: using clang: /Users/buildslave/jenkins/workspace/lldb-cmake/lldb-build/bin/clang llvm-lit: /Users/buildslave/jenkins/workspace/lldb-cmake/lldb-build/bin/../../llvm-project/llvm/utils/lit/lit/llvm/config.py:345: note: using clang++: /Users/buildslave/jenkins/workspace/lldb-cmake/lldb-build/bin/clang++ llvm-lit: /Users/buildslave/jenkins/workspace/lldb-cmake/lldb-build/bin/../../llvm-project/llvm/utils/lit/lit/llvm/config.py:345: note: using clang-cl: /Users/buildslave/jenkins/workspace/lldb-cmake/lldb-build/bin/clang-cl llvm-lit: /Users/buildslave/jenkins/workspace/lldb-cmake/lldb-build/bin/../../llvm-project/llvm/utils/lit/lit/llvm/config.py:345: note: using lldb: /Users/buildslave/jenkins/workspace/lldb-cmake/lldb-build/bin/lldb llvm-lit: /Users/buildslave/jenkins/workspace/lldb-cmake/lldb-build/bin/../../llvm-project/llvm/utils/lit/lit/util.py:408: note: using SDKROOT: '/Applications/Xcode.app/Contents/Developer/Platforms/MacOSX.platform/Developer/SDKs/MacOSX10.15.sdk' UNSUPPORTED: debuginfo-tests :: llvm-prettyprinters/gdb/llvm-support.gdb (1 of 60) UNSUPPORTED: debuginfo-tests :: dexter/feature_tests/commands/penalty/expect_program_state.cpp (2 of 60) UNSUPPORTED: debuginfo-tests :: dexter/feature_tests/commands/perfect/expect_step_kind/func_external.cpp (3 of 60) UNSUPPORTED: debuginfo-tests :: dexter/feature_tests/commands/penalty/unreachable.cpp (4 of 60) UNSUPPORTED: debuginfo-tests :: dexter/feature_tests/commands/penalty/expect_step_order.cpp (5 of 60) UNSUPPORTED: debuginfo-tests :: dexter/feature_tests/commands/perfect/expect_step_kind/small_loop.cpp (6 of 60) UNSUPPORTED: debuginfo-tests :: dexter/feature_tests/commands/penalty/expect_watch_value.cpp (7 of 60) UNSUPPORTED: debuginfo-tests :: dexter/feature_tests/commands/perfect/limit_steps/limit_steps_overlapping_ranges.cpp (8 of 60) UNSUPPORTED: debuginfo-tests :: llgdb-tests/safestack.c (9 of 60) UNSUPPORTED: debuginfo-tests :: dexter/feature_tests/commands/perfect/expect_program_state.cpp (10 of 60) UNSUPPORTED: debuginfo-tests :: dexter/feature_tests/commands/perfect/limit_steps/limit_steps_expect_value.cpp (11 of 60) UNSUPPORTED: debuginfo-tests :: dexter/feature_tests/commands/perfect/limit_steps/limit_steps_same_line_conditional.cpp (12 of 60) PASS: debuginfo-tests :: dexter/feature_tests/subtools/list-debuggers/list-debuggers.test (13 of 60) PASS: debuginfo-tests :: llgdb-tests/forward-declare-class.cpp (14 of 60) UNSUPPORTED: debuginfo-tests :: dexter-tests/realigned-frame.cpp (15 of 60) PASS: debuginfo-tests :: llgdb-tests/nested-struct.cpp (16 of 60) UNSUPPORTED: debuginfo-tests :: dexter/feature_tests/commands/perfect/limit_steps/limit_steps_expect_loop.cpp (17 of 60) UNSUPPORTED: debuginfo-tests :: dexter/feature_tests/commands/perfect/expect_step_order.cpp (18 of 60) PASS: debuginfo-tests :: llgdb-tests/static-member.cpp (19 of 60) UNSUPPORTED: debuginfo-tests :: dexter/feature_tests/commands/perfect/expect_step_kind/func.cpp (20 of 60) UNSUPPORTED: debuginfo-tests :: dexter/feature_tests/commands/perfect/limit_steps/limit_steps_check_json_step_count.cpp (21 of 60) PASS: debuginfo-tests :: dexter/feature_tests/subtools/test/err_type.cpp (22 of 60) UNSUPPORTED: debuginfo-tests :: dexter/feature_tests/commands/perfect/unreachable.cpp (23 of 60) PASS: debuginfo-tests :: dexter-tests/stack-var.c (24 of 60) UNSUPPORTED: debuginfo-tests :: dexter-tests/nrvo.cpp (25 of 60) PASS: debuginfo-tests :: dexter/feature_tests/subtools/test/source-root-dir.cpp (26 of 60) PASS: debuginfo-tests :: dexter/feature_tests/subtools/view.cpp (27 of 60) UNSUPPORTED: debuginfo-tests :: dexter/feature_tests/subtools/clang-opt-bisect/clang-opt-bisect.cpp (28 of 60) PASS: debuginfo-tests :: dexter/feature_tests/subtools/test/err_paren.cpp (29 of 60) UNSUPPORTED: debuginfo-tests :: dexter-tests/global-constant.cpp (30 of 60) UNSUPPORTED: debuginfo-tests :: dexter/feature_tests/commands/perfect/expect_step_kind/recursive.cpp (31 of 60) UNSUPPORTED: debuginfo-tests :: dexter/feature_tests/commands/penalty/expect_step_kinds.cpp (32 of 60) PASS: debuginfo-tests :: dexter/feature_tests/subtools/test/err_type_mline.cpp (33 of 60) PASS: debuginfo-tests :: dexter-tests/vla.c (34 of 60) XFAIL: debuginfo-tests :: llgdb-tests/static-member-2.cpp (35 of 60) PASS: debuginfo-tests :: dexter/feature_tests/subtools/test/err_syntax_mline.cpp (36 of 60) PASS: debuginfo-tests :: llgdb-tests/asan-blocks.c (37 of 60) UNSUPPORTED: debuginfo-tests :: dexter-tests/hello.c (38 of 60) PASS: debuginfo-tests :: dexter-tests/dbg-arg.c (39 of 60) PASS: debuginfo-tests :: dexter/feature_tests/subtools/test/err_paren_mline.cpp (40 of 60) PASS: debuginfo-tests :: llgdb-tests/apple-accel.cpp (41 of 60) PASS: debuginfo-tests :: dexter-tests/ctor.cpp (42 of 60) XFAIL: debuginfo-tests :: dexter-tests/asan-deque.cpp (43 of 60) PASS: debuginfo-tests :: dexter/feature_tests/unittests/run.test (44 of 60) UNSUPPORTED: debuginfo-tests :: dexter/feature_tests/commands/perfect/expect_step_kind/direction.cpp (45 of 60) UNSUPPORTED: debuginfo-tests :: dexter/feature_tests/commands/perfect/expect_watch_type.cpp (46 of 60) PASS: debuginfo-tests :: dexter/feature_tests/subtools/help/help.test (47 of 60) PASS: debuginfo-tests :: llgdb-tests/foreach.m (48 of 60) PASS: debuginfo-tests :: llgdb-tests/block_var.m (49 of 60) UNSUPPORTED: debuginfo-tests :: dexter-tests/inline-line-gap.cpp (50 of 60) UNSUPPORTED: debuginfo-tests :: dexter/feature_tests/commands/penalty/expect_watch_type.cpp (51 of 60) PASS: debuginfo-tests :: llgdb-tests/asan.c (52 of 60) UNSUPPORTED: debuginfo-tests :: dexter/feature_tests/commands/perfect/expect_watch_value.cpp (53 of 60) PASS: debuginfo-tests :: dexter/feature_tests/subtools/test/err_syntax.cpp (54 of 60) PASS: debuginfo-tests :: dexter-tests/aggregate-indirect-arg.cpp (55 of 60) PASS: debuginfo-tests :: dexter-tests/asan.c (56 of 60) PASS: debuginfo-tests :: llgdb-tests/asan-deque.cpp (57 of 60) PASS: debuginfo-tests :: dexter-tests/nrvo-string.cpp (58 of 60) PASS: debuginfo-tests :: llgdb-tests/nrvo-string.cpp (59 of 60) FAIL: debuginfo-tests :: llgdb-tests/blocks.m (60 of 60) ******************** TEST 'debuginfo-tests :: llgdb-tests/blocks.m' FAILED ******************** Script: -- : 'RUN: at line 1'; /Users/buildslave/jenkins/workspace/lldb-cmake/lldb-build/bin/clang --target=x86_64-apple-darwin19.5.0 -O0 -g /Users/buildslave/jenkins/workspace/lldb-cmake/llvm-project/debuginfo-tests/llgdb-tests/blocks.m -c -o /Users/buildslave/jenkins/workspace/lldb-cmake/lldb-build/projects/debuginfo-tests/llgdb-tests/Output/blocks.m.tmp.o : 'RUN: at line 2'; /Users/buildslave/jenkins/workspace/lldb-cmake/lldb-build/bin/clang --target=x86_64-apple-darwin19.5.0 /Users/buildslave/jenkins/workspace/lldb-cmake/lldb-build/projects/debuginfo-tests/llgdb-tests/Output/blocks.m.tmp.o -o /Users/buildslave/jenkins/workspace/lldb-cmake/lldb-build/projects/debuginfo-tests/llgdb-tests/Output/blocks.m.tmp.out -framework Foundation : 'RUN: at line 3'; /Users/buildslave/jenkins/workspace/lldb-cmake/llvm-project/debuginfo-tests/llgdb-tests/test_debuginfo.pl /Users/buildslave/jenkins/workspace/lldb-cmake/llvm-project/debuginfo-tests/llgdb-tests/blocks.m /Users/buildslave/jenkins/workspace/lldb-cmake/lldb-build/projects/debuginfo-tests/llgdb-tests/Output/blocks.m.tmp.out -- Exit Code: 1

Hide Details

Command Output (stdout): -- Debugger output was: imported lldb from: "/Applications/Xcode.app/Contents/SharedFrameworks/LLDB.framework/Versions/A/Resources/Python" > break 31 SBBreakpoint: id = 1, file = '/Users/buildslave/jenkins/workspace/lldb-cmake/llvm-project/debuginfo-tests/llgdb-tests/blocks.m', line = 31, exact_match = 0, locations = 1 > r success > p m2 = <could not resolve type> > p dbTransaction No value > p master No value > quit

Hide Details

-- Command Output (stderr): -- /Users/buildslave/jenkins/workspace/lldb-cmake/llvm-project/debuginfo-tests/llgdb-tests/blocks.m:11:11: error: CHECK: expected string not found in input // CHECK: ${{[0-9]}} = 1 ^ /Users/buildslave/jenkins/workspace/lldb-cmake/lldb-build/projects/debuginfo-tests/llgdb-tests/Output/blocks.m.gdb.output:1:1: note: scanning from here imported lldb from: "/Applications/Xcode.app/Contents/SharedFrameworks/LLDB.framework/Versions/A/Resources/Python" ^ /Users/buildslave/jenkins/workspace/lldb-cmake/lldb-build/projects/debuginfo-tests/llgdb-tests/Output/blocks.m.gdb.output:3:8: note: possible intended match here SBBreakpoint: id = 1, file = '/Users/buildslave/jenkins/workspace/lldb-cmake/llvm-project/debuginfo-tests/llgdb-tests/blocks.m', line = 31, exact_match = 0, locations = 1 ^

Hide Details

Input file: /Users/buildslave/jenkins/workspace/lldb-cmake/lldb-build/projects/debuginfo-tests/llgdb-tests/Output/blocks.m.gdb.output Check file: /Users/buildslave/jenkins/workspace/lldb-cmake/llvm-project/debuginfo-tests/llgdb-tests/blocks.m

Hide Details

-dump-input=help explains the following input dump.

Hide Details

Input was: <<<<<< 1: imported lldb from: "/Applications/Xcode.app/Contents/SharedFrameworks/LLDB.framework/Versions/A/Resources/Python" check:11'0 X~~~~~~~~~~~~~~~~~~~~~~~~~~~~~~~~~~~~~~~~~~~~~~~~~~~~~~~~~~~~~~~~~~~~~~~~~~~~~~~~~~~~~~~~~~~~~~~~~~~~~~~~~~~~~~~~~ error: no match found 2: > break 31 check:11'0 ~~~~~~~~~~ 3: SBBreakpoint: id = 1, file = '/Users/buildslave/jenkins/workspace/lldb-cmake/llvm-project/debuginfo-tests/llgdb-tests/blocks.m', line = 31, exact_match = 0, locations = 1 check:11'0 ~~~~~~~~~~~~~~~~~~~~~~~~~~~~~~~~~~~~~~~~~~~~~~~~~~~~~~~~~~~~~~~~~~~~~~~~~~~~~~~~~~~~~~~~~~~~~~~~~~~~~~~~~~~~~~~~~~~~~~~~~~~~~~~~~~~~~~~~~~~~~~~~~~~~~~~~~~~~~~~~~~~~~~~~~~ check:11'1 ? possible intended match 4: > r check:11'0 ~~~ 5: success check:11'0 ~~~~~~~ 6: > p m2 check:11'0 ~~~~~~ 7: = <could not resolve type> check:11'0 ~~~~~~~~~~~~~~~~~~~~~~~~~~~ 8: > p dbTransaction check:11'0 ~~~~~~~~~~~~~~~~~ . . . >>>>>>

Hide Details

--

Hide Details

******************** Slowest Tests: -------------------------------------------------------------------------- 55.94s: debuginfo-tests :: llgdb-tests/blocks.m 40.29s: debuginfo-tests :: dexter-tests/asan-deque.cpp 38.61s: debuginfo-tests :: llgdb-tests/asan-blocks.c 37.68s: debuginfo-tests :: dexter-tests/vla.c 36.40s: debuginfo-tests :: dexter/feature_tests/subtools/test/source-root-dir.cpp 36.38s: debuginfo-tests :: dexter-tests/stack-var.c 21.06s: debuginfo-tests :: llgdb-tests/static-member.cpp 17.13s: debuginfo-tests :: dexter-tests/dbg-arg.c 16.98s: debuginfo-tests :: dexter/feature_tests/subtools/view.cpp 12.16s: debuginfo-tests :: dexter/feature_tests/subtools/list-debuggers/list-debuggers.test 6.96s: debuginfo-tests :: dexter-tests/nrvo-string.cpp 6.79s: debuginfo-tests :: llgdb-tests/asan.c 6.40s: debuginfo-tests :: llgdb-tests/block_var.m 5.02s: debuginfo-tests :: llgdb-tests/forward-declare-class.cpp 4.26s: debuginfo-tests :: dexter-tests/aggregate-indirect-arg.cpp 3.75s: debuginfo-tests :: llgdb-tests/foreach.m 3.34s: debuginfo-tests :: llgdb-tests/asan-deque.cpp 3.29s: debuginfo-tests :: dexter-tests/asan.c 2.72s: debuginfo-tests :: llgdb-tests/nrvo-string.cpp 2.36s: debuginfo-tests :: llgdb-tests/nested-struct.cpp

Hide Details

Tests Times: -------------------------------------------------------------------------- [ Range ] :: [ Percentage ] :: [Count] -------------------------------------------------------------------------- [55.0s,60.0s) :: [ ] :: [ 1/60] [50.0s,55.0s) :: [ ] :: [ 0/60] [45.0s,50.0s) :: [ ] :: [ 0/60] [40.0s,45.0s) :: [** ] :: [ 3/60] [35.0s,40.0s) :: [* ] :: [ 2/60] [30.0s,35.0s) :: [ ] :: [ 0/60] [25.0s,30.0s) :: [ ] :: [ 0/60] [20.0s,25.0s) :: [ ] :: [ 1/60] [15.0s,20.0s) :: [* ] :: [ 2/60] [10.0s,15.0s) :: [ ] :: [ 1/60] [ 5.0s,10.0s) :: [** ] :: [ 4/60] [ 0.0s, 5.0s) :: [****************************** ] :: [46/60] -------------------------------------------------------------------------- ******************** Failed Tests (1): debuginfo-tests :: llgdb-tests/blocks.m

Hide Details

Hide Details

Testing Time: 56.24s Unsupported : 29 Passed : 28 Expectedly Failed: 2 Failed : 1 FAILED: projects/debuginfo-tests/CMakeFiles/check-debuginfo cd /Users/buildslave/jenkins/workspace/lldb-cmake/lldb-build/projects/debuginfo-tests && /usr/local/Frameworks/Python.framework/Versions/3.7/bin/python3.7 /Users/buildslave/jenkins/workspace/lldb-cmake/lldb-build/./bin/llvm-lit -v --time-tests --shuffle --xunit-xml-output=/Users/buildslave/jenkins/workspace/lldb-cmake/test/results.xml -v /Users/buildslave/jenkins/workspace/lldb-cmake/lldb-build/projects/debuginfo-tests ninja: build stopped: subcommand failed. Command failed: Command '['/usr/local/bin/ninja', '-v', 'check-debuginfo']' returned non-zero exit status 1 Command: ['/usr/local/bin/ninja', '-v', 'check-debuginfo'] [Pipeline] } [Pipeline] // timeout [Pipeline] } [Pipeline] // stage [Pipeline] stage [Pipeline] { (Declarative: Post Actions) [Pipeline] scanForIssues [Clang (LLVM based)] Sleeping for 5 seconds due to JENKINS-32191... [Clang (LLVM based)] Parsing console log (workspace: '/Users/buildslave/jenkins/workspace/lldb-cmake') [Clang (LLVM based)] Successfully parsed console log [Clang (LLVM based)] -> found 15 issues (skipped 64 duplicates) [Clang (LLVM based)] Post processing issues on 'green-dragon-10' with source code encoding 'UTF-8' [Clang (LLVM based)] Creating SCM blamer to obtain author and commit information for affected files [Clang (LLVM based)] Creating SCM miner to obtain statistics for affected repository files [Clang (LLVM based)] Resolving file names for all issues in source directory '/Users/buildslave/jenkins/workspace/lldb-cmake' [Clang (LLVM based)] -> resolved paths in source directory (10 found, 0 not found) [Clang (LLVM based)] Resolving module names from module definitions (build.xml, pom.xml, or Manifest.mf files) [Clang (LLVM based)] -> resolved module names for 15 issues [Clang (LLVM based)] Resolving package names (or namespaces) by parsing the affected files [Clang (LLVM based)] -> resolved package names of 9 affected files [Clang (LLVM based)] No filter has been set, publishing all 14 issues [Clang (LLVM based)] Creating fingerprints for all affected code blocks to track issues over different builds [Clang (LLVM based)] -> created fingerprints for 14 issues (skipped 0 issues) [Clang (LLVM based)] Copying affected files to Jenkins' build folder '/Users/Shared/Jenkins/Home/jobs/lldb-cmake/builds/22777/files-with-issues' [Clang (LLVM based)] -> 7 copied, 2 not in workspace, 0 not-found, 0 with I/O error [Pipeline] junit Recording test results [Pipeline] emailext Not sending mail to unregistered user kadircet@google.com because your SCM claimed this was associated with a user ID ‘kadircet' which your security realm does not recognize; you may need changes in your SCM plugin Not sending mail to unregistered user mkazantsev@azul.com because your SCM claimed this was associated with a user ID ‘mkazantsev' which your security realm does not recognize; you may need changes in your SCM plugin Not sending mail to unregistered user sjoerd.meijer@arm.com because your SCM claimed this was associated with a user ID ‘sjoerd.meijer' which your security realm does not recognize; you may need changes in your SCM plugin Not sending mail to unregistered user akuegel@google.com because your SCM claimed this was associated with a user ID ‘akuegel' which your security realm does not recognize; you may need changes in your SCM plugin Not sending mail to unregistered user david.truby@arm.com because your SCM claimed this was associated with a user ID ‘david.truby' which your security realm does not recognize; you may need changes in your SCM plugin Not sending mail to unregistered user kerry.mclaughlin@arm.com because your SCM claimed this was associated with a user ID ‘kerry.mclaughlin' which your security realm does not recognize; you may need changes in your SCM plugin Not sending mail to unregistered user david.green@arm.com because your SCM claimed this was associated with a user ID ‘david.green' which your security realm does not recognize; you may need changes in your SCM plugin Not sending mail to unregistered user Pavel.Iliin@arm.com because your SCM claimed this was associated with a user ID ‘Pavel.Iliin' which your security realm does not recognize; you may need changes in your SCM plugin Not sending mail to unregistered user Petar.Avramovic@rt-rk.com because your SCM claimed this was associated with a user ID ‘petar.avramovic' which your security realm does not recognize; you may need changes in your SCM plugin Not sending mail to unregistered user flo@fhahn.com because your SCM claimed this was associated with a user ID ‘flo' which your security realm does not recognize; you may need changes in your SCM plugin Not sending mail to unregistered user lebedev.ri@gmail.com because your SCM claimed this was associated with a user ID ‘lebedev.ri' which your security realm does not recognize; you may need changes in your SCM plugin Not sending mail to unregistered user kadircet@google.com because your SCM claimed this was associated with a user ID ‘kadircet' which your security realm does not recognize; you may need changes in your SCM plugin Not sending mail to unregistered user mkazantsev@azul.com because your SCM claimed this was associated with a user ID ‘mkazantsev' which your security realm does not recognize; you may need changes in your SCM plugin Not sending mail to unregistered user sjoerd.meijer@arm.com because your SCM claimed this was associated with a user ID ‘sjoerd.meijer' which your security realm does not recognize; you may need changes in your SCM plugin Not sending mail to unregistered user akuegel@google.com because your SCM claimed this was associated with a user ID ‘akuegel' which your security realm does not recognize; you may need changes in your SCM plugin Not sending mail to unregistered user david.truby@arm.com because your SCM claimed this was associated with a user ID ‘david.truby' which your security realm does not recognize; you may need changes in your SCM plugin Not sending mail to unregistered user kerry.mclaughlin@arm.com because your SCM claimed this was associated with a user ID ‘kerry.mclaughlin' which your security realm does not recognize; you may need changes in your SCM plugin Not sending mail to unregistered user david.green@arm.com because your SCM claimed this was associated with a user ID ‘david.green' which your security realm does not recognize; you may need changes in your SCM plugin Not sending mail to unregistered user Pavel.Iliin@arm.com because your SCM claimed this was associated with a user ID ‘Pavel.Iliin' which your security realm does not recognize; you may need changes in your SCM plugin Not sending mail to unregistered user Petar.Avramovic@rt-rk.com because your SCM claimed this was associated with a user ID ‘petar.avramovic' which your security realm does not recognize; you may need changes in your SCM plugin Not sending mail to unregistered user flo@fhahn.com because your SCM claimed this was associated with a user ID ‘flo' which your security realm does not recognize; you may need changes in your SCM plugin Not sending mail to unregistered user lebedev.ri@gmail.com because your SCM claimed this was associated with a user ID ‘lebedev.ri' which your security realm does not recognize; you may need changes in your SCM plugin

Hide Details

Begin Pre-Send Script... Sending email to: mschifer@apple.com Amara Emerson <amara@apple.com> Azhar Mohammed <azhar@apple.com>
[Pipeline] } [Pipeline] // stage [Pipeline] } [Pipeline] // withEnv [Pipeline] } [Pipeline] // node [Pipeline] End of Pipeline ERROR: script returned exit code 1 Finished: FAILURE