FailedConsole Output

Skipping 12,120 KB.. Full Log
LVM :: tools/llvm-readobj/ELF/ARM/attribute-4.s (52397 of 52859)
PASS: LLVM :: tools/llvm-readobj/ELF/ARM/attribute-5.s (52398 of 52859)
PASS: LLVM :: tools/llvm-readobj/ELF/ARM/attribute-8.s (52399 of 52859)
PASS: LLVM :: tools/llvm-readobj/ELF/ARM/attribute-7.s (52400 of 52859)
PASS: LLVM :: tools/llvm-readobj/ELF/ARM/attribute-6.s (52401 of 52859)
PASS: LLVM :: tools/llvm-readobj/ELF/ARM/attribute-9.s (52402 of 52859)
PASS: LLVM :: tools/llvm-readobj/ELF/ARM/dwarf-cfi.s (52403 of 52859)
PASS: LLVM :: tools/llvm-readobj/ELF/ARM/attribute-A.s (52404 of 52859)
PASS: LLVM :: tools/llvm-readobj/ELF/ARM/attribute-R.s (52405 of 52859)
PASS: LLVM :: tools/llvm-readobj/ELF/ARM/attribute-M.s (52406 of 52859)
PASS: LLVM :: tools/llvm-readobj/ELF/ARM/attribute-S.s (52407 of 52859)
PASS: LLVM :: tools/llvm-readobj/ELF/amdgpu-elf-definitions.test (52408 of 52859)
PASS: LLVM :: tools/llvm-readobj/ELF/ARM/unwind.s (52409 of 52859)
PASS: LLVM :: tools/llvm-readobj/ELF/ARM/attribute-conformance-2.s (52410 of 52859)
PASS: LLVM :: tools/llvm-readobj/ELF/ARM/attribute-conformance-1.s (52411 of 52859)
PASS: LLVM :: tools/llvm-readobj/ELF/basic.test (52412 of 52859)
PASS: LLVM :: tools/llvm-readobj/ELF/broken-dynamic-reloc-name.test (52413 of 52859)
PASS: LLVM :: tools/llvm-readobj/ELF/check-output-order.test (52414 of 52859)
PASS: LLVM :: tools/llvm-readobj/ELF/all.test (52415 of 52859)
PASS: LLVM :: tools/llvm-readobj/ELF/dynamic-empty.test (52416 of 52859)
PASS: LLVM :: tools/llvm-readobj/ELF/broken-dynsym-link.test (52417 of 52859)
PASS: LLVM :: tools/llvm-readobj/ELF/dependent-libraries.test (52418 of 52859)
PASS: LLVM :: tools/llvm-readobj/ELF/broken-group.test (52419 of 52859)
PASS: LLVM :: tools/llvm-readobj/ELF/addrsig.test (52420 of 52859)
PASS: LLVM :: tools/llvm-readobj/ELF/dynamic-no-pt-dynamic.test (52421 of 52859)
PASS: LLVM :: tools/llvm-readobj/ELF/dynamic-tags.test (52422 of 52859)
PASS: LLVM :: tools/llvm-readobj/ELF/dynamic-table-dtnull.s (52423 of 52859)
PASS: LLVM :: tools/llvm-readobj/ELF/dyn-symbols.test (52424 of 52859)
PASS: LLVM :: tools/llvm-readobj/ELF/dynamic-not-in-pt-dynamic.test (52425 of 52859)
PASS: LLVM :: tools/llvm-readobj/ELF/demangle.test (52426 of 52859)
PASS: LLVM :: tools/llvm-readobj/ELF/file-name.test (52427 of 52859)
PASS: LLVM :: tools/llvm-readobj/ELF/gnu-note-size.test (52428 of 52859)
PASS: LLVM :: tools/llvm-readobj/ELF/gnu-section-mapping-no-phdrs.test (52429 of 52859)
PASS: LLVM :: tools/llvm-readobj/ELF/file-headers.test (52430 of 52859)
PASS: LLVM :: tools/llvm-readobj/ELF/dynamic-malformed.test (52431 of 52859)
PASS: LLVM :: tools/llvm-readobj/ELF/gnu-section-mapping-no-shdrs.test (52432 of 52859)
PASS: LLVM :: tools/llvm-readobj/ELF/dynamic-tags-machine-specific.test (52433 of 52859)
PASS: LLVM :: tools/llvm-readobj/ELF/gnu-file-headers.test (52434 of 52859)
PASS: LLVM :: tools/llvm-readobj/ELF/groups.test (52435 of 52859)
PASS: LLVM :: tools/llvm-readobj/ELF/gnu-phdrs.test (52436 of 52859)
PASS: LLVM :: tools/llvm-readobj/ELF/gnu-symbols.test (52437 of 52859)
PASS: LLVM :: tools/llvm-readobj/ELF/gnuhash.test (52438 of 52859)
PASS: LLVM :: tools/llvm-readobj/ELF/gnu-sections.test (52439 of 52859)
PASS: LLVM :: tools/llvm-readobj/ELF/hex-dump-multi.s (52440 of 52859)
PASS: LLVM :: tools/llvm-readobj/ELF/hash-histogram.test (52441 of 52859)
PASS: LLVM :: tools/llvm-readobj/ELF/hidden-versym.test (52442 of 52859)
PASS: LLVM :: tools/llvm-readobj/ELF/headers.test (52443 of 52859)
PASS: LLVM :: tools/llvm-readobj/ELF/linker-options.test (52444 of 52859)
PASS: LLVM :: tools/llvm-readobj/ELF/invalid-shstrndx.test (52445 of 52859)
PASS: LLVM :: tools/llvm-readobj/ELF/loadname.test (52446 of 52859)
PASS: LLVM :: tools/llvm-readobj/ELF/gnu-notes.test (52447 of 52859)
PASS: LLVM :: tools/llvm-readobj/ELF/hash-symbols.test (52448 of 52859)
PASS: LLVM :: tools/llvm-readobj/ELF/many-sections.s (52449 of 52859)
PASS: LLVM :: tools/llvm-readobj/ELF/machine-specific-section-types.test (52450 of 52859)
PASS: LLVM :: tools/llvm-readobj/ELF/mips-got-overlapped.test (52451 of 52859)
PASS: LLVM :: tools/llvm-readobj/ELF/file-types.test (52452 of 52859)
PASS: LLVM :: tools/llvm-readobj/ELF/mips-options-sec.test (52453 of 52859)
PASS: LLVM :: tools/llvm-readobj/ELF/malformed-pt-dynamic.test (52454 of 52859)
PASS: LLVM :: tools/llvm-readobj/ELF/mips-options.test (52455 of 52859)
PASS: LLVM :: tools/llvm-readobj/ELF/merged.test (52456 of 52859)
PASS: LLVM :: tools/llvm-readobj/ELF/mips-abiflags.test (52457 of 52859)
PASS: LLVM :: tools/llvm-readobj/ELF/mips-reginfo.test (52458 of 52859)
PASS: LLVM :: tools/llvm-readobj/ELF/mips-rld-map-rel.test (52459 of 52859)
PASS: LLVM :: tools/llvm-readobj/ELF/mips-plt.test (52460 of 52859)
PASS: LLVM :: tools/llvm-readobj/ELF/mips-st-other.test (52461 of 52859)
PASS: LLVM :: tools/llvm-readobj/ELF/no-phdrs.test (52462 of 52859)
PASS: LLVM :: tools/llvm-readobj/ELF/no-shdrs.test (52463 of 52859)
PASS: LLVM :: tools/llvm-readobj/ELF/hex-dump.test (52464 of 52859)
PASS: LLVM :: tools/llvm-readobj/ELF/no-relocs.test (52465 of 52859)
PASS: LLVM :: tools/llvm-readobj/ELF/note-amd.s (52466 of 52859)
PASS: LLVM :: tools/llvm-readobj/ELF/mips-got.test (52467 of 52859)
PASS: LLVM :: tools/llvm-readobj/ELF/note-amdgpu.test (52468 of 52859)
PASS: LLVM :: tools/llvm-readobj/ELF/no-action.test (52469 of 52859)
PASS: LLVM :: tools/llvm-readobj/ELF/note-core-ntfile.test (52470 of 52859)
PASS: LLVM :: tools/llvm-readobj/ELF/note-core.test (52471 of 52859)
PASS: LLVM :: tools/llvm-readobj/ELF/note-freebsd.s (52472 of 52859)
PASS: LLVM :: tools/llvm-readobj/ELF/non-dynamic-in-pt-dynamic.test (52473 of 52859)
PASS: LLVM :: tools/llvm-readobj/ELF/note-generic.s (52474 of 52859)
PASS: LLVM :: tools/llvm-readobj/ELF/packed-relocs-empty.s (52475 of 52859)
PASS: LLVM :: tools/llvm-readobj/ELF/note-gnu-property.s (52476 of 52859)
PASS: LLVM :: tools/llvm-readobj/ELF/packed-relocs-error1.s (52477 of 52859)
PASS: LLVM :: tools/llvm-readobj/ELF/note-gnu-property2.s (52478 of 52859)
PASS: LLVM :: tools/llvm-readobj/ELF/packed-relocs-error3.s (52479 of 52859)
PASS: LLVM :: tools/llvm-readobj/ELF/note-unknown.s (52480 of 52859)
PASS: LLVM :: tools/llvm-readobj/ELF/packed-relocs-error2.s (52481 of 52859)
PASS: LLVM :: tools/llvm-readobj/ELF/packed-relocs-error4.s (52482 of 52859)
PASS: LLVM :: tools/llvm-readobj/ELF/note-core-ntfile-bad.test (52483 of 52859)
PASS: LLVM :: tools/llvm-readobj/ELF/packed-relocs-error5.s (52484 of 52859)
PASS: LLVM :: tools/llvm-readobj/ELF/ppc64-glink.test (52485 of 52859)
PASS: LLVM :: tools/llvm-readobj/ELF/reloc-no-sym.test (52486 of 52859)
PASS: LLVM :: tools/llvm-readobj/ELF/pt-gnu-property.test (52487 of 52859)
PASS: LLVM :: tools/llvm-readobj/ELF/reloc-negative-addend-no-sym.test (52488 of 52859)
PASS: LLVM :: tools/llvm-readobj/ELF/reloc-symbol-with-versioning.test (52489 of 52859)
PASS: LLVM :: tools/llvm-readobj/ELF/readelf-s-alias.test (52490 of 52859)
PASS: LLVM :: tools/llvm-readobj/ELF/reloc-types-elf-aarch64.test (52491 of 52859)
PASS: LLVM :: tools/llvm-readobj/ELF/reloc-types-elf-arm.test (52492 of 52859)
PASS: LLVM :: tools/llvm-readobj/ELF/packed-relocs.test (52493 of 52859)
PASS: LLVM :: tools/llvm-readobj/ELF/reloc-types-elf-lanai.test (52494 of 52859)
PASS: LLVM :: tools/llvm-readobj/ELF/reloc-types-elf-mips.test (52495 of 52859)
PASS: LLVM :: tools/llvm-readobj/ELF/reloc-types-elf-i386.test (52496 of 52859)
PASS: LLVM :: tools/llvm-readobj/ELF/program-headers.test (52497 of 52859)
PASS: LLVM :: tools/llvm-readobj/ELF/reloc-types-elf-mips64.test (52498 of 52859)
PASS: LLVM :: tools/llvm-readobj/ELF/reloc-types-elf-ppc64.test (52499 of 52859)
PASS: LLVM :: tools/llvm-readobj/ELF/rpath.test (52500 of 52859)
PASS: LLVM :: tools/llvm-readobj/ELF/reloc-zero-name-or-value.test (52501 of 52859)
PASS: LLVM :: tools/llvm-readobj/ELF/reloc-types-elf-x64.test (52502 of 52859)
PASS: LLVM :: tools/llvm-readobj/ELF/section-flags.test (52503 of 52859)
PASS: LLVM :: tools/llvm-readobj/ELF/section-types.test (52504 of 52859)
PASS: LLVM :: tools/llvm-readobj/ELF/relr-relocs.test (52505 of 52859)
PASS: LLVM :: tools/llvm-readobj/ELF/sections.test (52506 of 52859)
PASS: LLVM :: tools/llvm-readobj/ELF/sections-ext.test (52507 of 52859)
PASS: LLVM :: tools/llvm-readobj/ELF/string-dump-multi.s (52508 of 52859)
PASS: LLVM :: tools/llvm-readobj/ELF/section-symbols.test (52509 of 52859)
PASS: LLVM :: tools/llvm-readobj/ELF/section-arch-flags.test (52510 of 52859)
PASS: LLVM :: tools/llvm-readobj/ELF/symbol-64bit.test (52511 of 52859)
PASS: LLVM :: tools/llvm-readobj/ELF/symbol-binding.test (52512 of 52859)
PASS: LLVM :: tools/llvm-readobj/ELF/symbol-types.test (52513 of 52859)
PASS: LLVM :: tools/llvm-readobj/ELF/relocations.test (52514 of 52859)
PASS: LLVM :: tools/llvm-readobj/ELF/symbol-visibility.test (52515 of 52859)
PASS: LLVM :: tools/llvm-readobj/ELF/symbols.test (52516 of 52859)
PASS: LLVM :: tools/llvm-readobj/ELF/unwind.test (52517 of 52859)
PASS: LLVM :: tools/llvm-readobj/ELF/symbol-shndx.test (52518 of 52859)
PASS: LLVM :: tools/llvm-readobj/ELF/versioninfo.test (52519 of 52859)
PASS: LLVM :: tools/llvm-readobj/ELF/thin-archive-paths.test (52520 of 52859)
PASS: LLVM :: tools/llvm-readobj/ELF/many-sections2.s (52521 of 52859)
PASS: LLVM :: tools/llvm-readobj/ELF/string-dump.test (52522 of 52859)
PASS: LLVM :: tools/llvm-readobj/ELF/wrong-shstrtab-type.test (52523 of 52859)
PASS: LLVM :: tools/llvm-readobj/ELF/types.test (52524 of 52859)
PASS: LLVM :: tools/llvm-readobj/MachO/hex-dump.test (52525 of 52859)
PASS: LLVM :: tools/llvm-readobj/MachO/reloc-types-macho-arm.test (52526 of 52859)
PASS: LLVM :: tools/llvm-readobj/MachO/needed-libs.test (52527 of 52859)
PASS: LLVM :: tools/llvm-readobj/MachO/reloc-types-macho-i386.test (52528 of 52859)
PASS: LLVM :: tools/llvm-readobj/MachO/file-headers.test (52529 of 52859)
PASS: LLVM :: tools/llvm-readobj/MachO/reloc-types-macho-x64.test (52530 of 52859)
PASS: LLVM :: tools/llvm-readobj/MachO/universal-x86_64.i386.test (52531 of 52859)
PASS: LLVM :: tools/llvm-readobj/MachO/relocations.test (52532 of 52859)
PASS: LLVM :: tools/llvm-readobj/MachO/sections.test (52533 of 52859)
PASS: LLVM :: tools/llvm-readobj/ELF/verdef-invalid.test (52534 of 52859)
PASS: LLVM :: tools/llvm-readobj/ELF/versym-invalid.test (52535 of 52859)
PASS: LLVM :: tools/llvm-readobj/MachO/sections-ext.test (52536 of 52859)
PASS: LLVM :: tools/llvm-readobj/wasm/hex-dump.test (52537 of 52859)
PASS: LLVM :: tools/llvm-readobj/wasm/relocations.test (52538 of 52859)
PASS: LLVM :: tools/llvm-readobj/wasm/sections.test (52539 of 52859)
PASS: LLVM :: tools/llvm-readobj/wasm/symbols.test (52540 of 52859)
PASS: LLVM :: tools/llvm-readobj/wasm/wasm-imports.test (52541 of 52859)
PASS: LLVM :: tools/llvm-readobj/wasm/wasm-file-headers.test (52542 of 52859)
PASS: LLVM :: tools/llvm-readobj/archive.test (52543 of 52859)
PASS: LLVM :: tools/llvm-readobj/wasm/wasm-invalid.test (52544 of 52859)
PASS: LLVM :: tools/llvm-readobj/basic.test (52545 of 52859)
PASS: LLVM :: tools/llvm-size/elf-berkeley.test (52546 of 52859)
PASS: LLVM :: tools/llvm-size/common.test (52547 of 52859)
PASS: LLVM :: tools/llvm-readobj/ELF/verneed-invalid.test (52548 of 52859)
PASS: LLVM :: tools/llvm-size/darwin-m.test (52549 of 52859)
PASS: LLVM :: tools/llvm-size/elf-m.test (52550 of 52859)
PASS: LLVM :: tools/llvm-size/elf-sysv.test (52551 of 52859)
PASS: LLVM :: tools/llvm-size/help.test (52552 of 52859)
PASS: LLVM :: tools/llvm-size/long-format.test (52553 of 52859)
PASS: LLVM :: tools/llvm-size/invalid-input.test (52554 of 52859)
PASS: LLVM :: tools/llvm-readobj/thin-archive.test (52555 of 52859)
PASS: LLVM :: tools/llvm-size/macho-berkeley.test (52556 of 52859)
PASS: LLVM :: tools/llvm-readobj/ELF/stack-sizes.test (52557 of 52859)
PASS: LLVM :: tools/llvm-size/macho-sysv.test (52558 of 52859)
PASS: LLVM :: tools/llvm-size/unknown-format.test (52559 of 52859)
PASS: LLVM :: tools/llvm-size/multiple-inputs.test (52560 of 52859)
PASS: LLVM :: tools/llvm-size/response-file.test (52561 of 52859)
PASS: LLVM :: tools/llvm-size/stdin.test (52562 of 52859)
PASS: LLVM :: tools/llvm-size/version.test (52563 of 52859)
PASS: LLVM :: tools/llvm-size/no-input.test (52564 of 52859)
PASS: LLVM :: tools/llvm-size/totals.test (52565 of 52859)
PASS: LLVM :: tools/llvm-split/extern_linkage.ll (52566 of 52859)
PASS: LLVM :: tools/llvm-split/alias.ll (52567 of 52859)
PASS: LLVM :: tools/llvm-split/function.ll (52568 of 52859)
PASS: LLVM :: tools/llvm-split/comdat.ll (52569 of 52859)
PASS: LLVM :: tools/llvm-size/archive.test (52570 of 52859)
PASS: LLVM :: tools/llvm-split/global.ll (52571 of 52859)
PASS: LLVM :: tools/llvm-split/blockaddress.ll (52572 of 52859)
PASS: LLVM :: tools/llvm-split/personality.ll (52573 of 52859)
PASS: LLVM :: tools/llvm-split/scc-callchain.ll (52574 of 52859)
PASS: LLVM :: tools/llvm-split/scc-alias.ll (52575 of 52859)
PASS: LLVM :: tools/llvm-split/internal.ll (52576 of 52859)
PASS: LLVM :: tools/llvm-split/preserve-locals.ll (52577 of 52859)
PASS: LLVM :: tools/llvm-split/scc-comdat.ll (52578 of 52859)
PASS: LLVM :: tools/llvm-split/scc-const-alias.ll (52579 of 52859)
PASS: LLVM :: tools/llvm-split/scc-constants.ll (52580 of 52859)
PASS: LLVM :: tools/llvm-split/scc-cycle.ll (52581 of 52859)
PASS: LLVM :: tools/llvm-split/scc-global2global.ll (52582 of 52859)
PASS: LLVM :: tools/llvm-split/unnamed.ll (52583 of 52859)
PASS: LLVM :: tools/llvm-strings/all-sections.test (52584 of 52859)
PASS: LLVM :: tools/llvm-split/scc-global-alias.ll (52585 of 52859)
PASS: LLVM :: tools/llvm-strings/eof.test (52586 of 52859)
PASS: LLVM :: tools/llvm-strings/negative-char.test (52587 of 52859)
PASS: LLVM :: tools/llvm-strings/help.test (52588 of 52859)
PASS: LLVM :: tools/llvm-strings/option-grouping.test (52589 of 52859)
PASS: LLVM :: tools/llvm-strings/file-filename.test (52590 of 52859)
PASS: LLVM :: tools/llvm-strings/multiple-inputs.test (52591 of 52859)
PASS: LLVM :: tools/llvm-strings/archive-filename.test (52592 of 52859)
PASS: LLVM :: tools/llvm-strings/version.test (52593 of 52859)
PASS: LLVM :: tools/llvm-strings/response-file.test (52594 of 52859)
PASS: LLVM :: tools/llvm-strings/whitespace.test (52595 of 52859)
PASS: LLVM :: tools/llvm-size/radix.test (52596 of 52859)
PASS: LLVM :: tools/llvm-strings/stdin-filename.test (52597 of 52859)
PASS: LLVM :: tools/llvm-strings/stdin.test (52598 of 52859)
PASS: LLVM :: tools/llvm-symbolizer/adjust-vma.s (52599 of 52859)
PASS: LLVM :: tools/llvm-symbolizer/basenames.s (52600 of 52859)
PASS: LLVM :: tools/llvm-symbolizer/coff-dwarf.test (52601 of 52859)
PASS: LLVM :: tools/llvm-symbolizer/dwo.test (52602 of 52859)
PASS: LLVM :: tools/llvm-symbolizer/coff-exports.test (52603 of 52859)
PASS: LLVM :: tools/llvm-symbolizer/fission-ranges.test (52604 of 52859)
PASS: LLVM :: tools/llvm-symbolizer/dsym.test (52605 of 52859)
PASS: LLVM :: tools/llvm-strings/radix-filename.test (52606 of 52859)
PASS: LLVM :: tools/llvm-strings/length.test (52607 of 52859)
PASS: LLVM :: tools/llvm-symbolizer/basic.s (52608 of 52859)
PASS: LLVM :: tools/llvm-symbolizer/frame-fortran.s (52609 of 52859)
PASS: LLVM :: tools/llvm-symbolizer/fat.test (52610 of 52859)
PASS: LLVM :: tools/llvm-symbolizer/flush-output.s (52611 of 52859)
PASS: LLVM :: tools/llvm-symbolizer/flag-grouping.test (52612 of 52859)
PASS: LLVM :: tools/llvm-symbolizer/frame-noname.s (52613 of 52859)
PASS: LLVM :: tools/llvm-symbolizer/frame-specification.s (52614 of 52859)
PASS: LLVM :: tools/llvm-symbolizer/frame-types.s (52615 of 52859)
PASS: LLVM :: tools/llvm-symbolizer/frame.s (52616 of 52859)
PASS: LLVM :: tools/llvm-symbolizer/frame-loclist.s (52617 of 52859)
PASS: LLVM :: tools/llvm-symbolizer/invalid-input-address.test (52618 of 52859)
PASS: LLVM :: tools/llvm-strings/radix.test (52619 of 52859)
PASS: LLVM :: tools/llvm-symbolizer/ignore-undefined-symbols.s (52620 of 52859)
UNSUPPORTED: LLVM :: tools/llvm-symbolizer/padding-x86_64.ll (52621 of 52859)
UNSUPPORTED: LLVM :: tools/llvm-symbolizer/pdb/missing_pdb.test (52622 of 52859)
UNSUPPORTED: LLVM :: tools/llvm-symbolizer/pdb/pdb.test (52623 of 52859)
PASS: LLVM :: tools/llvm-symbolizer/demangle.s (52624 of 52859)
PASS: LLVM :: tools/llvm-symbolizer/only-empty-ranges.s (52625 of 52859)
PASS: LLVM :: tools/llvm-symbolizer/ppc64.test (52626 of 52859)
PASS: LLVM :: tools/llvm-symbolizer/help.test (52627 of 52859)
PASS: LLVM :: tools/llvm-symbolizer/space-in-path.s (52628 of 52859)
PASS: LLVM :: tools/llvm-symbolizer/print_context.c (52629 of 52859)
PASS: LLVM :: tools/llvm-symbolizer/output-style-column.test (52630 of 52859)
PASS: LLVM :: tools/llvm-symbolizer/output-style-inlined.test (52631 of 52859)
PASS: LLVM :: tools/llvm-symbolizer/output-style-empty-line.test (52632 of 52859)
PASS: LLVM :: tools/llvm-symbolizer/split-debug.test (52633 of 52859)
PASS: LLVM :: tools/llvm-symbolizer/sym-verbose.test (52634 of 52859)
PASS: LLVM :: tools/llvm-symbolizer/split-dwarf-addr-object-relocation.test (52635 of 52859)
PASS: LLVM :: tools/llvm-symbolizer/split-dwarf-dwp.test (52636 of 52859)
PASS: LLVM :: tools/llvm-symbolizer/functions.s (52637 of 52859)
PASS: LLVM :: tools/llvm-symbolizer/split-dwarf-multiple-cu.test (52638 of 52859)
PASS: LLVM :: tools/llvm-symbolizer/untag-addresses.test (52639 of 52859)
PASS: LLVM :: tools/llvm-xray/AArch64/extract-instrmap-aarch64.test (52640 of 52859)
PASS: LLVM :: tools/llvm-xray/X86/account-deduce-tail-call.yaml (52641 of 52859)
PASS: LLVM :: tools/llvm-xray/X86/account-keep-going.yaml (52642 of 52859)
PASS: LLVM :: tools/llvm-xray/X86/account-simple-case.yaml (52643 of 52859)
PASS: LLVM :: tools/llvm-xray/X86/account-empty-stack-error.yaml (52644 of 52859)
PASS: LLVM :: tools/llvm-xray/X86/convert-basic-arg1-to-yaml.txt (52645 of 52859)
PASS: LLVM :: tools/llvm-xray/X86/convert-basic-log-arg1-version3-to-yaml.txt (52646 of 52859)
PASS: LLVM :: tools/llvm-xray/X86/bad-instrmap-sizes.txt (52647 of 52859)
PASS: LLVM :: tools/llvm-xray/X86/convert-fdr-arg1-to-yaml.txt (52648 of 52859)
PASS: LLVM :: tools/llvm-xray/X86/convert-basic-log-version3-to-yaml.txt (52649 of 52859)
PASS: LLVM :: tools/llvm-xray/X86/convert-fdr-log-arg1-version3-to-yaml.txt (52650 of 52859)
PASS: LLVM :: tools/llvm-xray/X86/convert-fdr-log-version3-to-yaml.txt (52651 of 52859)
PASS: LLVM :: tools/llvm-xray/X86/convert-fdr-to-yaml.txt (52652 of 52859)
PASS: LLVM :: tools/llvm-xray/X86/convert-to-yaml.txt (52653 of 52859)
PASS: LLVM :: tools/llvm-xray/X86/convert-roundtrip.yaml (52654 of 52859)
PASS: LLVM :: tools/llvm-xray/X86/convert-with-yaml-instrmap.txt (52655 of 52859)
PASS: LLVM :: tools/llvm-xray/X86/convert-with-standalone-instrmap.txt (52656 of 52859)
PASS: LLVM :: tools/llvm-xray/X86/empty.txt (52657 of 52859)
PASS: LLVM :: tools/llvm-xray/X86/convert-with-debug-syms.txt (52658 of 52859)
PASS: LLVM :: tools/llvm-xray/X86/extract-all-sledtypes.txt (52659 of 52859)
PASS: LLVM :: tools/llvm-symbolizer/split-dwarf.test (52660 of 52859)
PASS: LLVM :: tools/llvm-xray/X86/extract-instrmap-macho.ll (52661 of 52859)
PASS: LLVM :: tools/llvm-xray/X86/fdr-dump-arg1-version-3.txt (52662 of 52859)
PASS: LLVM :: tools/llvm-xray/X86/extract-instrmap.ll (52663 of 52859)
PASS: LLVM :: tools/llvm-xray/X86/extract-instrmap-pie.ll (52664 of 52859)
PASS: LLVM :: tools/llvm-xray/X86/extract-instrmap-symbolize.ll (52665 of 52859)
PASS: LLVM :: tools/llvm-xray/X86/fdr-dump-arg1.txt (52666 of 52859)
PASS: LLVM :: tools/llvm-xray/X86/graph-zero-latency-calls.yaml (52667 of 52859)
PASS: LLVM :: tools/llvm-xray/X86/graph-color-simple-case.yaml (52668 of 52859)
PASS: LLVM :: tools/llvm-xray/X86/no-instr-map.txt (52669 of 52859)
PASS: LLVM :: tools/llvm-xray/X86/no-subcommand-noassert.txt (52670 of 52859)
PASS: LLVM :: tools/llvm-xray/X86/stack-empty-case.yaml (52671 of 52859)
PASS: LLVM :: tools/llvm-xray/X86/no-such-file.txt (52672 of 52859)
PASS: LLVM :: tools/llvm-xray/X86/account-simple-sorting.yaml (52673 of 52859)
PASS: LLVM :: tools/llvm-xray/X86/stack-simple-case.yaml (52674 of 52859)
PASS: LLVM :: tools/llvm-xray/X86/unsupported-elf32.txt (52675 of 52859)
PASS: LLVM :: tools/llvm-xray/X86/stack-multithread.yaml (52676 of 52859)
PASS: LLVM :: tools/llvm-xray/X86/stack-keep-going.yaml (52677 of 52859)
PASS: LLVM :: tools/llvm-xray/X86/graph-deduce-tail-call.yaml (52678 of 52859)
PASS: LLVM :: tools/llvm-xray/X86/graph-simple-case.yaml (52679 of 52859)
PASS: LLVM :: tools/obj2yaml/aix_xcoff.test (52680 of 52859)
PASS: LLVM :: tools/obj2yaml/aix_xcoff_truncated_file_header.test (52681 of 52859)
PASS: LLVM :: tools/obj2yaml/basic-minidump.yaml (52682 of 52859)
PASS: LLVM :: tools/obj2yaml/coff-long-file-symbol.test (52683 of 52859)
PASS: LLVM :: tools/llvm-xray/X86/graph-diff-simple.txt (52684 of 52859)
PASS: LLVM :: tools/obj2yaml/coff-long-section-name.test (52685 of 52859)
PASS: LLVM :: tools/obj2yaml/coff-section-aux-symbol.test (52686 of 52859)
PASS: LLVM :: tools/llvm-symbolizer/sym.test (52687 of 52859)
PASS: LLVM :: tools/obj2yaml/coff-weak-external.test (52688 of 52859)
PASS: LLVM :: tools/obj2yaml/dynamic-section.test (52689 of 52859)
PASS: LLVM :: tools/obj2yaml/elf-entsize.yaml (52690 of 52859)
PASS: LLVM :: tools/obj2yaml/elf-emachine.yaml (52691 of 52859)
PASS: LLVM :: tools/lto/no-bitcode.s (52692 of 52859)
PASS: LLVM :: tools/obj2yaml/duplicate-symbol-and-section-names.test (52693 of 52859)
PASS: LLVM :: tools/obj2yaml/elf-gnu-unique-symbols.yaml (52694 of 52859)
PASS: LLVM :: tools/obj2yaml/elf-gnu-hash-section.yaml (52695 of 52859)
PASS: LLVM :: tools/lto/print-stats.ll (52696 of 52859)
PASS: LLVM :: tools/obj2yaml/elf-hash-section.yaml (52697 of 52859)
PASS: LLVM :: tools/obj2yaml/dynamic-section-arch-tags.test (52698 of 52859)
PASS: LLVM :: tools/lto/opt-level.ll (52699 of 52859)
PASS: LLVM :: tools/lto/hide-linkonce-odr.ll (52700 of 52859)
PASS: LLVM :: tools/obj2yaml/elf-ppc64-relocations.yaml (52701 of 52859)
PASS: LLVM :: tools/obj2yaml/elf-llvm-addrsig-section.yaml (52702 of 52859)
PASS: LLVM :: tools/obj2yaml/elf-shinfo.yaml (52703 of 52859)
PASS: LLVM :: tools/obj2yaml/elf-no-symtab.yaml (52704 of 52859)
PASS: LLVM :: tools/obj2yaml/elf-reladyn-section-shinfo.yaml (52705 of 52859)
PASS: LLVM :: tools/obj2yaml/elf-symbol-visibility.yaml (52706 of 52859)
PASS: LLVM :: tools/obj2yaml/invalid_input_file.test (52707 of 52859)
PASS: LLVM :: tools/obj2yaml/invalid-section-name.yaml (52708 of 52859)
PASS: LLVM :: tools/obj2yaml/missing_symtab.test (52709 of 52859)
PASS: LLVM :: tools/obj2yaml/llvm-deplibs-section.yaml (52710 of 52859)
PASS: LLVM :: tools/obj2yaml/elf-null-section.yaml (52711 of 52859)
PASS: LLVM :: tools/obj2yaml/linker-options.yaml (52712 of 52859)
PASS: LLVM :: tools/obj2yaml/elf-stack-sizes.yaml (52713 of 52859)
PASS: LLVM :: tools/obj2yaml/elf-shlink.yaml (52714 of 52859)
PASS: LLVM :: tools/obj2yaml/no-symbol-reloc.test (52715 of 52859)
PASS: LLVM :: tools/obj2yaml/relocation-unsupported-machine.yaml (52716 of 52859)
PASS: LLVM :: tools/obj2yaml/section-type.yaml (52717 of 52859)
PASS: LLVM :: tools/obj2yaml/sections-info.yaml (52718 of 52859)
PASS: LLVM :: tools/obj2yaml/special-symbol-indices.yaml (52719 of 52859)
UNSUPPORTED: LLVM :: tools/opt-viewer/basic.test (52720 of 52859)
UNSUPPORTED: LLVM :: tools/opt-viewer/filter.test (52721 of 52859)
UNSUPPORTED: LLVM :: tools/opt-viewer/suppress.test (52722 of 52859)
UNSUPPORTED: LLVM :: tools/opt-viewer/unicode-function-name.test (52723 of 52859)
PASS: LLVM :: tools/obj2yaml/symbol-type.yaml (52724 of 52859)
UNSUPPORTED: LLVM :: tools/sancov/blacklist.test (52725 of 52859)
PASS: LLVM :: tools/obj2yaml/verdef-section.yaml (52726 of 52859)
UNSUPPORTED: LLVM :: tools/sancov/covered_functions.test (52727 of 52859)
UNSUPPORTED: LLVM :: tools/sancov/not_covered_functions.test (52728 of 52859)
UNSUPPORTED: LLVM :: tools/sancov/print.test (52729 of 52859)
UNSUPPORTED: LLVM :: tools/sancov/merge.test (52730 of 52859)
UNSUPPORTED: LLVM :: tools/sancov/stats.test (52731 of 52859)
UNSUPPORTED: LLVM :: tools/sancov/symbolize.test (52732 of 52859)
UNSUPPORTED: LLVM :: tools/sancov/symbolize_noskip_dead_files.test (52733 of 52859)
UNSUPPORTED: LLVM :: tools/sancov/validation.test (52734 of 52859)
PASS: LLVM :: tools/obj2yaml/verneed-section.yaml (52735 of 52859)
PASS: LLVM :: tools/obj2yaml/versym-section.yaml (52736 of 52859)
PASS: LLVM :: tools/obj2yaml/section-group.test (52737 of 52859)
PASS: LLVM :: tools/yaml2obj/COFF/invalid-alignment.yaml (52738 of 52859)
PASS: LLVM :: tools/sancov/AArch64/print_coverage_pcs.test (52739 of 52859)
PASS: LLVM :: tools/yaml2obj/COFF/basic-arm64.yaml (52740 of 52859)
PASS: LLVM :: tools/yaml2obj/COFF/symbol-index.yaml (52741 of 52859)
PASS: LLVM :: tools/obj2yaml/elf-sht-symtab-shndx.yaml (52742 of 52859)
PASS: LLVM :: tools/yaml2obj/COFF/xrelocs.yaml (52743 of 52859)
PASS: LLVM :: tools/yaml2obj/ELF/comdat-broken-members.yaml (52744 of 52859)
PASS: LLVM :: tools/yaml2obj/ELF/abiversion.yaml (52745 of 52859)
PASS: LLVM :: tools/yaml2obj/ELF/comdat-broken.yaml (52746 of 52859)
PASS: LLVM :: tools/yaml2obj/ELF/comdat-broken-info.yaml (52747 of 52859)
PASS: LLVM :: tools/yaml2obj/ELF/class-endianness.yaml (52748 of 52859)
PASS: LLVM :: tools/yaml2obj/ELF/dynamic-relocations.yaml (52749 of 52859)
PASS: LLVM :: tools/yaml2obj/ELF/dynamic-section-i386.yaml (52750 of 52859)
PASS: LLVM :: tools/yaml2obj/ELF/duplicate-symbol-names.yaml (52751 of 52859)
PASS: LLVM :: tools/sancov/print_coverage_pcs.test (52752 of 52859)
PASS: LLVM :: tools/yaml2obj/ELF/duplicate-section-names.yaml (52753 of 52859)
PASS: LLVM :: tools/yaml2obj/ELF/dynamic-section.yaml (52754 of 52859)
PASS: LLVM :: tools/yaml2obj/ELF/dynamic-section-raw-content.yaml (52755 of 52859)
PASS: LLVM :: tools/yaml2obj/ELF/dynamic-symbols.yaml (52756 of 52859)
PASS: LLVM :: tools/yaml2obj/ELF/empty-symbols.yaml (52757 of 52859)
PASS: LLVM :: tools/yaml2obj/ELF/emachine.yaml (52758 of 52859)
PASS: LLVM :: tools/yaml2obj/ELF/dynsymtab-shlink.yaml (52759 of 52859)
PASS: LLVM :: tools/yaml2obj/ELF/ent-size.yaml (52760 of 52859)
PASS: LLVM :: tools/yaml2obj/ELF/explicit-dynsym-no-dynstr.yaml (52761 of 52859)
PASS: LLVM :: tools/sanstats/elf.test (52762 of 52859)
PASS: LLVM :: tools/yaml2obj/ELF/custom-null-section.yaml (52763 of 52859)
PASS: LLVM :: tools/yaml2obj/ELF/gnu-unique-symbols.yaml (52764 of 52859)
PASS: LLVM :: tools/yaml2obj/ELF/header-elfdatanone.yaml (52765 of 52859)
PASS: LLVM :: tools/yaml2obj/ELF/custom-fill.yaml (52766 of 52859)
PASS: LLVM :: tools/yaml2obj/ELF/implicit-sections-addr.yaml (52767 of 52859)
PASS: LLVM :: tools/yaml2obj/ELF/dynsymtab-implicit-sections-size-content.yaml (52768 of 52859)
PASS: LLVM :: tools/yaml2obj/ELF/implicit-sections-types.yaml (52769 of 52859)
PASS: LLVM :: tools/yaml2obj/ELF/invalid-docnum.yaml (52770 of 52859)
PASS: LLVM :: tools/yaml2obj/ELF/header-sh-fields.yaml (52771 of 52859)
PASS: LLVM :: tools/yaml2obj/ELF/implicit-sections-info.yaml (52772 of 52859)
PASS: LLVM :: tools/yaml2obj/ELF/implicit-sections.yaml (52773 of 52859)
PASS: LLVM :: tools/yaml2obj/ELF/local-symbols.yaml (52774 of 52859)
PASS: LLVM :: tools/yaml2obj/ELF/llvm-deplibs-section.yaml (52775 of 52859)
PASS: LLVM :: tools/yaml2obj/ELF/linker-options.yaml (52776 of 52859)
PASS: LLVM :: tools/yaml2obj/ELF/no-phdrs.yaml (52777 of 52859)
PASS: LLVM :: tools/yaml2obj/ELF/override-shname.yaml (52778 of 52859)
PASS: LLVM :: tools/yaml2obj/ELF/gnu-hash-section.yaml (52779 of 52859)
PASS: LLVM :: tools/yaml2obj/ELF/program-header-nobits.yaml (52780 of 52859)
PASS: LLVM :: tools/yaml2obj/ELF/program-header-align.yaml (52781 of 52859)
PASS: LLVM :: tools/yaml2obj/ELF/program-header-size-offset.yaml (52782 of 52859)
PASS: LLVM :: tools/yaml2obj/ELF/hash-section.yaml (52783 of 52859)
PASS: LLVM :: tools/yaml2obj/ELF/program-header.yaml (52784 of 52859)
PASS: LLVM :: tools/yaml2obj/ELF/override-shoffset.yaml (52785 of 52859)
PASS: LLVM :: tools/yaml2obj/ELF/relocation-explicit-symbol-index.yaml (52786 of 52859)
PASS: LLVM :: tools/yaml2obj/ELF/reloc-sec-info.yaml (52787 of 52859)
PASS: LLVM :: tools/yaml2obj/ELF/relocation-missing-symbol.yaml (52788 of 52859)
PASS: LLVM :: tools/yaml2obj/ELF/relocation-implicit-symbol-index.yaml (52789 of 52859)
PASS: LLVM :: tools/yaml2obj/ELF/relocation-unsupported-machine.yaml (52790 of 52859)
PASS: LLVM :: tools/yaml2obj/ELF/section-type.yaml (52791 of 52859)
PASS: LLVM :: tools/yaml2obj/ELF/section-ordering.yaml (52792 of 52859)
PASS: LLVM :: tools/yaml2obj/ELF/section-unnamed.yaml (52793 of 52859)
PASS: LLVM :: tools/yaml2obj/ELF/override-shsize.yaml (52794 of 52859)
PASS: LLVM :: tools/yaml2obj/ELF/sh-addralign.yaml (52795 of 52859)
PASS: LLVM :: tools/yaml2obj/ELF/llvm-addrsig-section.yaml (52796 of 52859)
PASS: LLVM :: tools/yaml2obj/ELF/section-link.yaml (52797 of 52859)
PASS: LLVM :: tools/yaml2obj/ELF/symbol-binding.yaml (52798 of 52859)
PASS: LLVM :: tools/yaml2obj/ELF/symbol-index-invalid.yaml (52799 of 52859)
PASS: LLVM :: tools/yaml2obj/ELF/strtab-implicit-sections-flags.yaml (52800 of 52859)
PASS: LLVM :: tools/yaml2obj/ELF/symbol-index.yaml (52801 of 52859)
PASS: LLVM :: tools/yaml2obj/ELF/symbol-name.yaml (52802 of 52859)
PASS: LLVM :: tools/yaml2obj/ELF/sht-symtab-shndx.yaml (52803 of 52859)
PASS: LLVM :: tools/yaml2obj/ELF/section-size-content.yaml (52804 of 52859)
PASS: LLVM :: tools/yaml2obj/ELF/symbol-type.yaml (52805 of 52859)
PASS: LLVM :: tools/yaml2obj/ELF/symbol-visibility.yaml (52806 of 52859)
PASS: LLVM :: tools/obj2yaml/elf-mips-eflags.yaml (52807 of 52859)
PASS: LLVM :: tools/yaml2obj/ELF/symbols-binding-order.yaml (52808 of 52859)
PASS: LLVM :: tools/yaml2obj/ELF/symbol-stother.yaml (52809 of 52859)
PASS: LLVM :: tools/yaml2obj/ELF/symtab-shtype.yaml (52810 of 52859)
PASS: LLVM :: tools/yaml2obj/ELF/strtab-implicit-sections-size-content.yaml (52811 of 52859)
PASS: LLVM :: tools/yaml2obj/Minidump/exception-missing-parameter.yaml (52812 of 52859)
PASS: LLVM :: tools/yaml2obj/Minidump/raw-stream-small-size.yaml (52813 of 52859)
PASS: LLVM :: tools/yaml2obj/ELF/symtab-implicit-sections-flags.yaml (52814 of 52859)
PASS: LLVM :: tools/yaml2obj/ELF/versym-section.yaml (52815 of 52859)
PASS: LLVM :: tools/yaml2obj/Minidump/systeminfo-other-long.yaml (52816 of 52859)
PASS: LLVM :: tools/yaml2obj/Minidump/systeminfo-other-not-hex.yaml (52817 of 52859)
PASS: LLVM :: tools/yaml2obj/Minidump/systeminfo-other-short.yaml (52818 of 52859)
PASS: LLVM :: tools/yaml2obj/Minidump/systeminfo-x86-long.yaml (52819 of 52859)
PASS: LLVM :: tools/yaml2obj/ELF/verdef-section.yaml (52820 of 52859)
PASS: LLVM :: tools/yaml2obj/ELF/symtab-shlink.yaml (52821 of 52859)
PASS: LLVM :: tools/yaml2obj/Minidump/systeminfo-x86-short.yaml (52822 of 52859)
PASS: LLVM :: tools/yaml2obj/ELF/verneed-section.yaml (52823 of 52859)
PASS: LLVM :: tools/yaml2obj/invalid-output-file.yaml (52824 of 52859)
PASS: LLVM :: tools/yaml2obj/missing_document_tag.yaml (52825 of 52859)
PASS: LLVM :: tools/yaml2obj/invalid-yaml.yaml (52826 of 52859)
PASS: LLVM :: tools/yaml2obj/unsupported_document_tag.yaml (52827 of 52859)
PASS: LLVM :: tools/yaml2obj/empty-or-invalid-doc.yaml (52828 of 52859)
PASS: LLVM :: tools/yaml2obj/multi-doc.yaml (52829 of 52859)
PASS: LLVM :: tools/yaml2obj/ELF/symtab-implicit-sections-size-content.yaml (52830 of 52859)
PASS: LLVM :: tools/yaml2obj/ELF/stack-sizes.yaml (52831 of 52859)
PASS: lit :: boolean-parsing.py (52832 of 52859)
PASS: lit :: googletest-format.py (52833 of 52859)
PASS: lit :: parallelism-groups.py (52834 of 52859)
PASS: lit :: progress-bar.py (52835 of 52859)
PASS: lit :: shtest-encoding.py (52836 of 52859)
PASS: lit :: googletest-upstream-format.py (52837 of 52859)
PASS: lit :: shell-parsing.py (52838 of 52859)
PASS: lit :: shtest-format.py (52839 of 52859)
PASS: lit :: shtest-env.py (52840 of 52859)
PASS: lit :: shtest-output-printing.py (52841 of 52859)
PASS: lit :: lit-opts.py (52842 of 52859)
PASS: lit :: shtest-run-at-line.py (52843 of 52859)
PASS: lit :: test-data-micro.py (52844 of 52859)
PASS: lit :: discovery.py (52845 of 52859)
PASS: lit :: test-data.py (52846 of 52859)
PASS: lit :: test-output-micro.py (52847 of 52859)
PASS: lit :: test-output.py (52848 of 52859)
PASS: lit :: unit/ShUtil.py (52849 of 52859)
PASS: lit :: unit/TestRunner.py (52850 of 52859)
PASS: lit :: unittest-adaptor.py (52851 of 52859)
PASS: lit :: shtest-not.py (52852 of 52859)
PASS: lit :: usage.py (52853 of 52859)
PASS: lit :: xunit-output.py (52854 of 52859)
PASS: lit :: googletest-timeout.py (52855 of 52859)
PASS: lit :: selecting.py (52856 of 52859)
PASS: lit :: shtest-timeout.py (52857 of 52859)
PASS: lit :: max-failures.py (52858 of 52859)
PASS: lit :: shtest-shell.py (52859 of 52859)

Hide Details

Testing Time: 2552.83s Expected Passes : 52192 Expected Failures : 176 Unsupported Tests : 491 Completed at: 2019-12-13T04:00:16 @@@@@@ + echo '@@@ IOSSIM @@@'
IOSSIM

Hide Details

@@@ IOSSIM @@@ + cd clang-build + export 'SANITIZER_IOSSIM_TEST_DEVICE_IDENTIFIER=iPhone 6' + SANITIZER_IOSSIM_TEST_DEVICE_IDENTIFIER='iPhone 6' + ./bin/llvm-lit -v --xunit-xml-output=asan-IOSSimX86_64Config.xunit.xml ./tools/clang/runtime/compiler-rt-bins/test/asan/IOSSimX86_64Config/ llvm-lit: /Users/buildslave/jenkins/workspace/clang-stage1-cmake-RA-expensive/llvm-project/llvm/utils/lit/lit/util.py:410: note: using SDKROOT: u'/Applications/Xcode.app/Contents/Developer/Platforms/MacOSX.platform/Developer/SDKs/MacOSX10.13.sdk' llvm-lit: /Users/buildslave/jenkins/workspace/clang-stage1-cmake-RA-expensive/llvm-project/compiler-rt/test/lit.common.cfg.py:427: warning: Throttling sanitizer tests that require shadow memory on Darwin 64bit {"env": {}} -- Testing: 482 tests, 8 workers -- UNSUPPORTED: AddressSanitizer-x86_64-iossim :: TestCases/Darwin/abort_on_error.cpp (1 of 482) UNSUPPORTED: AddressSanitizer-x86_64-iossim :: TestCases/Darwin/address-range-limit.mm (2 of 482) UNSUPPORTED: AddressSanitizer-x86_64-iossim :: TestCases/Darwin/asan-symbolize-partial-report-no-external-symbolizer.cpp (3 of 482) UNSUPPORTED: AddressSanitizer-x86_64-iossim :: TestCases/Darwin/asan_gen_prefixes.cpp (4 of 482) UNSUPPORTED: AddressSanitizer-x86_64-iossim :: TestCases/Darwin/asan-symbolize-with-module-map.cpp (5 of 482) UNSUPPORTED: AddressSanitizer-x86_64-iossim :: TestCases/Darwin/asan-symbolize-partial-report-with-module-map.cpp (6 of 482) UNSUPPORTED: AddressSanitizer-x86_64-iossim :: TestCases/Darwin/atos-symbolizer.cpp (7 of 482) UNSUPPORTED: AddressSanitizer-x86_64-iossim :: TestCases/Darwin/atos-symbolizer-dyld-root-path.cpp (8 of 482) PASS: AddressSanitizer-x86_64-iossim :: TestCases/Darwin/cstring_section.c (9 of 482) UNSUPPORTED: AddressSanitizer-x86_64-iossim :: TestCases/Darwin/dead-strip.c (10 of 482) UNSUPPORTED: AddressSanitizer-x86_64-iossim :: TestCases/Darwin/dladdr-demangling.cpp (11 of 482) PASS: AddressSanitizer-x86_64-iossim :: TestCases/Darwin/cstring_literals_regtest.mm (12 of 482) UNSUPPORTED: AddressSanitizer-x86_64-iossim :: TestCases/Darwin/dyld_insert_libraries_reexec.cpp (13 of 482) UNSUPPORTED: AddressSanitizer-x86_64-iossim :: TestCases/Darwin/dyld_insert_libraries_remove.cpp (14 of 482) PASS: AddressSanitizer-x86_64-iossim :: TestCases/Darwin/dump_registers.cpp (15 of 482) PASS: AddressSanitizer-x86_64-iossim :: TestCases/Darwin/crashlog-stacktraces.c (16 of 482) PASS: AddressSanitizer-x86_64-iossim :: TestCases/Darwin/fclose.c (17 of 482) PASS: AddressSanitizer-x86_64-iossim :: TestCases/Darwin/empty-section.cpp (18 of 482) UNSUPPORTED: AddressSanitizer-x86_64-iossim :: TestCases/Darwin/haswell-symbolication.cpp (19 of 482) UNSUPPORTED: AddressSanitizer-x86_64-iossim :: TestCases/Darwin/interface_symbols_darwin.cpp (20 of 482) PASS: AddressSanitizer-x86_64-iossim :: TestCases/Darwin/getpwnam.c (21 of 482) PASS: AddressSanitizer-x86_64-iossim :: TestCases/Darwin/linked-only.cpp (22 of 482) PASS: AddressSanitizer-x86_64-iossim :: TestCases/Darwin/init_for_dlopen.cpp (23 of 482) PASS: AddressSanitizer-x86_64-iossim :: TestCases/Darwin/malloc_destroy_zone.cpp (24 of 482) PASS: AddressSanitizer-x86_64-iossim :: TestCases/Darwin/malloc_set_zone_name-mprotect.cpp (25 of 482) PASS: AddressSanitizer-x86_64-iossim :: TestCases/Darwin/malloc_zone-protected.cpp (26 of 482) PASS: AddressSanitizer-x86_64-iossim :: TestCases/Darwin/malloc_size_crash.mm (27 of 482) PASS: AddressSanitizer-x86_64-iossim :: TestCases/Darwin/mixing-global-constructors.cpp (28 of 482) PASS: AddressSanitizer-x86_64-iossim :: TestCases/Darwin/nil-return-struct.mm (29 of 482) UNSUPPORTED: AddressSanitizer-x86_64-iossim :: TestCases/Darwin/reexec-insert-libraries-env.cpp (30 of 482) UNSUPPORTED: AddressSanitizer-x86_64-iossim :: TestCases/Darwin/sandbox-symbolizer.cpp (31 of 482) PASS: AddressSanitizer-x86_64-iossim :: TestCases/Darwin/objc-odr.mm (32 of 482) PASS: AddressSanitizer-x86_64-iossim :: TestCases/Darwin/odr-lto.cpp (33 of 482) PASS: AddressSanitizer-x86_64-iossim :: TestCases/Darwin/segv_read_write.c (34 of 482) UNSUPPORTED: AddressSanitizer-x86_64-iossim :: TestCases/Darwin/suppressions-function.cpp (35 of 482) UNSUPPORTED: AddressSanitizer-x86_64-iossim :: TestCases/Darwin/suppressions-sandbox.cpp (36 of 482) UNSUPPORTED: AddressSanitizer-x86_64-iossim :: TestCases/Darwin/unset-insert-libraries-on-exec.cpp (37 of 482) UNSUPPORTED: AddressSanitizer-x86_64-iossim :: TestCases/Darwin/uuid.cpp (38 of 482) UNSUPPORTED: AddressSanitizer-x86_64-iossim :: TestCases/Linux/abort_on_error.cpp (39 of 482) UNSUPPORTED: AddressSanitizer-x86_64-iossim :: TestCases/Linux/activation-options.cpp (40 of 482) UNSUPPORTED: AddressSanitizer-x86_64-iossim :: TestCases/Linux/aligned_delete_test.cpp (41 of 482) UNSUPPORTED: AddressSanitizer-x86_64-iossim :: TestCases/Linux/asan_default_suppressions.cpp (42 of 482) UNSUPPORTED: AddressSanitizer-x86_64-iossim :: TestCases/Linux/allocator_oom_test.cpp (43 of 482) UNSUPPORTED: AddressSanitizer-x86_64-iossim :: TestCases/Linux/asan_dlopen_test.cpp (44 of 482) UNSUPPORTED: AddressSanitizer-x86_64-iossim :: TestCases/Linux/asan_prelink_test.cpp (45 of 482) UNSUPPORTED: AddressSanitizer-x86_64-iossim :: TestCases/Linux/asan_preload_test-1.cpp (46 of 482) UNSUPPORTED: AddressSanitizer-x86_64-iossim :: TestCases/Linux/asan_preload_test-2.cpp (47 of 482) UNSUPPORTED: AddressSanitizer-x86_64-iossim :: TestCases/Linux/asan_preload_test-3.cpp (48 of 482) UNSUPPORTED: AddressSanitizer-x86_64-iossim :: TestCases/Linux/asan_rt_confict_test-1.cpp (49 of 482) UNSUPPORTED: AddressSanitizer-x86_64-iossim :: TestCases/Linux/asan_rt_confict_test-2.cpp (50 of 482) UNSUPPORTED: AddressSanitizer-x86_64-iossim :: TestCases/Linux/auto_memory_profile_test.cpp (51 of 482) UNSUPPORTED: AddressSanitizer-x86_64-iossim :: TestCases/Linux/bzero.cpp (52 of 482) UNSUPPORTED: AddressSanitizer-x86_64-iossim :: TestCases/Linux/calloc-preload.c (53 of 482) UNSUPPORTED: AddressSanitizer-x86_64-iossim :: TestCases/Linux/clang_gcc_abi.cpp (54 of 482) UNSUPPORTED: AddressSanitizer-x86_64-iossim :: TestCases/Linux/clone_test.cpp (55 of 482) UNSUPPORTED: AddressSanitizer-x86_64-iossim :: TestCases/Linux/coverage-missing.cpp (56 of 482) UNSUPPORTED: AddressSanitizer-x86_64-iossim :: TestCases/Linux/cuda_test.cpp (57 of 482) UNSUPPORTED: AddressSanitizer-x86_64-iossim :: TestCases/Linux/dlopen-mixed-c-cxx.c (58 of 482) UNSUPPORTED: AddressSanitizer-x86_64-iossim :: TestCases/Linux/function-sections-are-bad.cpp (59 of 482) UNSUPPORTED: AddressSanitizer-x86_64-iossim :: TestCases/Linux/global-overflow-bfd.cpp (60 of 482) UNSUPPORTED: AddressSanitizer-x86_64-iossim :: TestCases/Linux/global-overflow-lld.cpp (61 of 482) UNSUPPORTED: AddressSanitizer-x86_64-iossim :: TestCases/Linux/globals-gc-sections-lld.cpp (62 of 482) UNSUPPORTED: AddressSanitizer-x86_64-iossim :: TestCases/Linux/init-order-dlopen.cpp (63 of 482) UNSUPPORTED: AddressSanitizer-x86_64-iossim :: TestCases/Linux/init_fini_sections.cpp (64 of 482) UNSUPPORTED: AddressSanitizer-x86_64-iossim :: TestCases/Linux/initialization-bug-any-order.cpp (65 of 482) UNSUPPORTED: AddressSanitizer-x86_64-iossim :: TestCases/Linux/interception_malloc_test.cpp (66 of 482) UNSUPPORTED: AddressSanitizer-x86_64-iossim :: TestCases/Linux/interception_readdir_r_test.cpp (67 of 482) UNSUPPORTED: AddressSanitizer-x86_64-iossim :: TestCases/Linux/interception_test.cpp (68 of 482) UNSUPPORTED: AddressSanitizer-x86_64-iossim :: TestCases/Linux/interface_symbols_linux.cpp (69 of 482) UNSUPPORTED: AddressSanitizer-x86_64-iossim :: TestCases/Linux/kernel-area.cpp (70 of 482) UNSUPPORTED: AddressSanitizer-x86_64-iossim :: TestCases/Linux/leak.cpp (71 of 482) UNSUPPORTED: AddressSanitizer-x86_64-iossim :: TestCases/Linux/leak_check_segv.cpp (72 of 482) UNSUPPORTED: AddressSanitizer-x86_64-iossim :: TestCases/Linux/local_alias.cpp (73 of 482) UNSUPPORTED: AddressSanitizer-x86_64-iossim :: TestCases/Linux/long-object-path.cpp (74 of 482) UNSUPPORTED: AddressSanitizer-x86_64-iossim :: TestCases/Linux/longjmp_chk.c (75 of 482) UNSUPPORTED: AddressSanitizer-x86_64-iossim :: TestCases/Linux/malloc-in-qsort.cpp (76 of 482) UNSUPPORTED: AddressSanitizer-x86_64-iossim :: TestCases/Linux/malloc_delete_mismatch.cpp (77 of 482) UNSUPPORTED: AddressSanitizer-x86_64-iossim :: TestCases/Linux/memmem_test.cpp (78 of 482) UNSUPPORTED: AddressSanitizer-x86_64-iossim :: TestCases/Linux/mincore.cpp (79 of 482) UNSUPPORTED: AddressSanitizer-x86_64-iossim :: TestCases/Linux/new_delete_mismatch.cpp (80 of 482) UNSUPPORTED: AddressSanitizer-x86_64-iossim :: TestCases/Linux/new_delete_mismatch_global.cpp (81 of 482) UNSUPPORTED: AddressSanitizer-x86_64-iossim :: TestCases/Linux/new_delete_mismatch_stack.cpp (82 of 482) UNSUPPORTED: AddressSanitizer-x86_64-iossim :: TestCases/Linux/nohugepage_test.cpp (83 of 482) UNSUPPORTED: AddressSanitizer-x86_64-iossim :: TestCases/Linux/odr-violation.cpp (84 of 482) UNSUPPORTED: AddressSanitizer-x86_64-iossim :: TestCases/Linux/odr-vtable.cpp (85 of 482) UNSUPPORTED: AddressSanitizer-x86_64-iossim :: TestCases/Linux/odr_c_test.c (86 of 482) UNSUPPORTED: AddressSanitizer-x86_64-iossim :: TestCases/Linux/odr_indicators.cpp (87 of 482) UNSUPPORTED: AddressSanitizer-x86_64-iossim :: TestCases/Linux/overflow-in-qsort.cpp (88 of 482) UNSUPPORTED: AddressSanitizer-x86_64-iossim :: TestCases/Linux/preinit_test.cpp (89 of 482) UNSUPPORTED: AddressSanitizer-x86_64-iossim :: TestCases/Linux/preinstalled_signal.cpp (90 of 482) UNSUPPORTED: AddressSanitizer-x86_64-iossim :: TestCases/Linux/print_memory_profile_test.cpp (91 of 482) UNSUPPORTED: AddressSanitizer-x86_64-iossim :: TestCases/Linux/printf-fortify-1.c (92 of 482) UNSUPPORTED: AddressSanitizer-x86_64-iossim :: TestCases/Linux/printf-fortify-2.c (93 of 482) UNSUPPORTED: AddressSanitizer-x86_64-iossim :: TestCases/Linux/printf-fortify-3.c (94 of 482) UNSUPPORTED: AddressSanitizer-x86_64-iossim :: TestCases/Linux/printf-fortify-4.c (95 of 482) UNSUPPORTED: AddressSanitizer-x86_64-iossim :: TestCases/Linux/printf-fortify-5.c (96 of 482) UNSUPPORTED: AddressSanitizer-x86_64-iossim :: TestCases/Linux/pthread_create_from_constructor.cpp (97 of 482) UNSUPPORTED: AddressSanitizer-x86_64-iossim :: TestCases/Linux/pthread_create_version.cpp (98 of 482) UNSUPPORTED: AddressSanitizer-x86_64-iossim :: TestCases/Linux/ptrace.cpp (99 of 482) UNSUPPORTED: AddressSanitizer-x86_64-iossim :: TestCases/Linux/quarantine_size_mb.cpp (100 of 482) UNSUPPORTED: AddressSanitizer-x86_64-iossim :: TestCases/Linux/read_binary_name_regtest.c (101 of 482) UNSUPPORTED: AddressSanitizer-x86_64-iossim :: TestCases/Linux/recoverable-lsan.cpp (102 of 482) UNSUPPORTED: AddressSanitizer-x86_64-iossim :: TestCases/Linux/recvfrom.cpp (103 of 482) UNSUPPORTED: AddressSanitizer-x86_64-iossim :: TestCases/Linux/release_to_os_test.cpp (104 of 482) UNSUPPORTED: AddressSanitizer-x86_64-iossim :: TestCases/Linux/rlimit_mmap_test.cpp (105 of 482) UNSUPPORTED: AddressSanitizer-x86_64-iossim :: TestCases/Linux/sanbox_read_proc_self_maps_test.cpp (106 of 482) UNSUPPORTED: AddressSanitizer-x86_64-iossim :: TestCases/Linux/segv_read_write.c (107 of 482) UNSUPPORTED: AddressSanitizer-x86_64-iossim :: TestCases/Linux/shmctl.cpp (108 of 482) UNSUPPORTED: AddressSanitizer-x86_64-iossim :: TestCases/Linux/signal_during_stop_the_world.cpp (109 of 482) UNSUPPORTED: AddressSanitizer-x86_64-iossim :: TestCases/Linux/sized_delete_test.cpp (110 of 482) UNSUPPORTED: AddressSanitizer-x86_64-iossim :: TestCases/Linux/stack-overflow-recovery-mode.cpp (111 of 482) UNSUPPORTED: AddressSanitizer-x86_64-iossim :: TestCases/Linux/stack-overflow-sigbus.cpp (112 of 482) UNSUPPORTED: AddressSanitizer-x86_64-iossim :: TestCases/Linux/stack-trace-dlclose.cpp (113 of 482) UNSUPPORTED: AddressSanitizer-x86_64-iossim :: TestCases/Linux/static_tls.cpp (114 of 482) UNSUPPORTED: AddressSanitizer-x86_64-iossim :: TestCases/Linux/stress_dtls.c (115 of 482) UNSUPPORTED: AddressSanitizer-x86_64-iossim :: TestCases/Linux/swapcontext_annotation.cpp (116 of 482) UNSUPPORTED: AddressSanitizer-x86_64-iossim :: TestCases/Linux/swapcontext_test.cpp (117 of 482) UNSUPPORTED: AddressSanitizer-x86_64-iossim :: TestCases/Linux/syscalls.cpp (118 of 482) UNSUPPORTED: AddressSanitizer-x86_64-iossim :: TestCases/Linux/textdomain.c (119 of 482) UNSUPPORTED: AddressSanitizer-x86_64-iossim :: TestCases/Linux/thread_local_quarantine_pthread_join.cpp (120 of 482) UNSUPPORTED: AddressSanitizer-x86_64-iossim :: TestCases/Linux/thread_local_quarantine_size_kb.cpp (121 of 482) UNSUPPORTED: AddressSanitizer-x86_64-iossim :: TestCases/Linux/uar_signals.cpp (122 of 482) UNSUPPORTED: AddressSanitizer-x86_64-iossim :: TestCases/Linux/unpoison_tls.cpp (123 of 482) UNSUPPORTED: AddressSanitizer-x86_64-iossim :: TestCases/Linux/vfork.cpp (124 of 482) UNSUPPORTED: AddressSanitizer-x86_64-iossim :: TestCases/Posix/asan-sigbus.cpp (125 of 482) PASS: AddressSanitizer-x86_64-iossim :: TestCases/Darwin/scribble.cpp (126 of 482) UNSUPPORTED: AddressSanitizer-x86_64-iossim :: TestCases/Posix/asan-symbolize-sanity-test.cpp (127 of 482) PASS: AddressSanitizer-x86_64-iossim :: TestCases/Posix/asan_symbolize_script/logging_options_in_help.cpp (128 of 482) PASS: AddressSanitizer-x86_64-iossim :: TestCases/Posix/asan_symbolize_script/plugin_no_op_help_output.cpp (129 of 482) UNSUPPORTED: AddressSanitizer-x86_64-iossim :: TestCases/Posix/asan_symbolize_script/plugin_no_op_symbolicate.cpp (130 of 482) UNSUPPORTED: AddressSanitizer-x86_64-iossim :: TestCases/Posix/asan_symbolize_script/plugin_wrong_frame_number_bug.cpp (131 of 482) PASS: AddressSanitizer-x86_64-iossim :: TestCases/Posix/asan_symbolize_script/set_log_dest.cpp (132 of 482) PASS: AddressSanitizer-x86_64-iossim :: TestCases/Posix/asan_symbolize_script/set_log_level.cpp (133 of 482) PASS: AddressSanitizer-x86_64-iossim :: TestCases/Posix/asan-symbolize-bad-path.cpp (134 of 482) PASS: AddressSanitizer-x86_64-iossim :: TestCases/Posix/assign_large_valloc_to_global.cpp (135 of 482) UNSUPPORTED: AddressSanitizer-x86_64-iossim :: TestCases/Posix/bcmp_test.cpp (136 of 482) UNSUPPORTED: AddressSanitizer-x86_64-iossim :: TestCases/Posix/closed-fds.cpp (137 of 482) PASS: AddressSanitizer-x86_64-iossim :: TestCases/Darwin/suppressions-darwin.cpp (138 of 482) UNSUPPORTED: AddressSanitizer-x86_64-iossim :: TestCases/Posix/coverage-fork.cpp (139 of 482) UNSUPPORTED: AddressSanitizer-x86_64-iossim :: TestCases/Posix/coverage-module-unloaded.cpp (140 of 482) UNSUPPORTED: AddressSanitizer-x86_64-iossim :: TestCases/Posix/coverage-reset.cpp (141 of 482) UNSUPPORTED: AddressSanitizer-x86_64-iossim :: TestCases/Posix/coverage.cpp (142 of 482) PASS: AddressSanitizer-x86_64-iossim :: TestCases/Posix/asprintf.cpp (143 of 482) UNSUPPORTED: AddressSanitizer-x86_64-iossim :: TestCases/Posix/deep_call_stack.cpp (144 of 482) PASS: AddressSanitizer-x86_64-iossim :: TestCases/Posix/concurrent_overflow.cpp (145 of 482) PASS: AddressSanitizer-x86_64-iossim :: TestCases/Posix/current_allocated_bytes.cpp (146 of 482) PASS: AddressSanitizer-x86_64-iossim :: TestCases/Posix/deep_thread_stack.cpp (147 of 482) PASS: AddressSanitizer-x86_64-iossim :: TestCases/Posix/fread_fwrite.cpp (148 of 482) PASS: AddressSanitizer-x86_64-iossim :: TestCases/Posix/fgets_fputs.cpp (149 of 482) PASS: AddressSanitizer-x86_64-iossim :: TestCases/Posix/free_hook_realloc.cpp (150 of 482) PASS: AddressSanitizer-x86_64-iossim :: TestCases/Posix/freopen.cpp (151 of 482) UNSUPPORTED: AddressSanitizer-x86_64-iossim :: TestCases/Posix/glob.cpp (152 of 482) PASS: AddressSanitizer-x86_64-iossim :: TestCases/Posix/global-registration.c (153 of 482) PASS: AddressSanitizer-x86_64-iossim :: TestCases/Posix/gc-test.cpp (154 of 482) PASS: AddressSanitizer-x86_64-iossim :: TestCases/Posix/halt_on_error-signals.c (155 of 482) PASS: AddressSanitizer-x86_64-iossim :: TestCases/Posix/dlclose-test.cpp (156 of 482) UNSUPPORTED: AddressSanitizer-x86_64-iossim :: TestCases/Posix/handle_abort_on_error.cpp (157 of 482) PASS: AddressSanitizer-x86_64-iossim :: TestCases/Posix/halt_on_error-torture.cpp (158 of 482) PASS: AddressSanitizer-x86_64-iossim :: TestCases/Posix/halt_on_error_suppress_equal_pcs.cpp (159 of 482) PASS: AddressSanitizer-x86_64-iossim :: TestCases/Posix/interception-in-shared-lib-test.cpp (160 of 482) UNSUPPORTED: AddressSanitizer-x86_64-iossim :: TestCases/Posix/invalid-pointer-pairs-threads.cpp (161 of 482) PASS: AddressSanitizer-x86_64-iossim :: TestCases/Posix/init-order-pthread-create.cpp (162 of 482) PASS: AddressSanitizer-x86_64-iossim :: TestCases/Posix/high-address-dereference.c (163 of 482) PASS: AddressSanitizer-x86_64-iossim :: TestCases/Posix/large_allocator_unpoisons_on_free.cpp (164 of 482) PASS: AddressSanitizer-x86_64-iossim :: TestCases/Posix/lto-constmerge-odr.cpp (165 of 482) UNSUPPORTED: AddressSanitizer-x86_64-iossim :: TestCases/Posix/new_array_cookie_test.cpp (166 of 482) UNSUPPORTED: AddressSanitizer-x86_64-iossim :: TestCases/Posix/new_array_cookie_uaf_test.cpp (167 of 482) UNSUPPORTED: AddressSanitizer-x86_64-iossim :: TestCases/Posix/new_array_cookie_with_new_from_class.cpp (168 of 482) PASS: AddressSanitizer-x86_64-iossim :: TestCases/Posix/no-fd.cpp (169 of 482) PASS: AddressSanitizer-x86_64-iossim :: TestCases/Posix/no_asan_gen_globals.c (170 of 482) PASS: AddressSanitizer-x86_64-iossim :: TestCases/Posix/ioctl.cpp (171 of 482) PASS: AddressSanitizer-x86_64-iossim :: TestCases/Posix/print_cmdline.cpp (172 of 482) PASS: AddressSanitizer-x86_64-iossim :: TestCases/Posix/readv.cpp (173 of 482) UNSUPPORTED: AddressSanitizer-x86_64-iossim :: TestCases/Posix/stack-overflow.cpp (174 of 482) PASS: AddressSanitizer-x86_64-iossim :: TestCases/Posix/mmap_limit_mb.cpp (175 of 482) PASS: AddressSanitizer-x86_64-iossim :: TestCases/Posix/stack-use-after-return.cpp (176 of 482) PASS: AddressSanitizer-x86_64-iossim :: TestCases/Posix/shared-lib-test.cpp (177 of 482) PASS: AddressSanitizer-x86_64-iossim :: TestCases/Posix/start-deactivated.cpp (178 of 482) PASS: AddressSanitizer-x86_64-iossim :: TestCases/Posix/strchr.c (179 of 482) PASS: AddressSanitizer-x86_64-iossim :: TestCases/Posix/strerror_r_test.cpp (180 of 482) PASS: AddressSanitizer-x86_64-iossim :: TestCases/Posix/tsd_dtor_leak.cpp (181 of 482) UNSUPPORTED: AddressSanitizer-x86_64-iossim :: TestCases/Posix/wait.cpp (182 of 482) UNSUPPORTED: AddressSanitizer-x86_64-iossim :: TestCases/Posix/wait3.cpp (183 of 482) UNSUPPORTED: AddressSanitizer-x86_64-iossim :: TestCases/Posix/wait4.cpp (184 of 482) UNSUPPORTED: AddressSanitizer-x86_64-iossim :: TestCases/Posix/waitid.cpp (185 of 482) PASS: AddressSanitizer-x86_64-iossim :: TestCases/Posix/wcrtomb.c (186 of 482) UNSUPPORTED: AddressSanitizer-x86_64-iossim :: TestCases/Windows/aligned_mallocs.cpp (187 of 482) UNSUPPORTED: AddressSanitizer-x86_64-iossim :: TestCases/Windows/allocators_sanity.cpp (188 of 482) UNSUPPORTED: AddressSanitizer-x86_64-iossim :: TestCases/Windows/beginthreadex.cpp (189 of 482) UNSUPPORTED: AddressSanitizer-x86_64-iossim :: TestCases/Windows/bind_io_completion_callback.cpp (190 of 482) UNSUPPORTED: AddressSanitizer-x86_64-iossim :: TestCases/Windows/bitfield.cpp (191 of 482) UNSUPPORTED: AddressSanitizer-x86_64-iossim :: TestCases/Windows/bitfield_uaf.cpp (192 of 482) UNSUPPORTED: AddressSanitizer-x86_64-iossim :: TestCases/Windows/calloc_left_oob.cpp (193 of 482) UNSUPPORTED: AddressSanitizer-x86_64-iossim :: TestCases/Windows/calloc_right_oob.cpp (194 of 482) UNSUPPORTED: AddressSanitizer-x86_64-iossim :: TestCases/Windows/calloc_uaf.cpp (195 of 482) UNSUPPORTED: AddressSanitizer-x86_64-iossim :: TestCases/Windows/coverage-basic.cpp (196 of 482) UNSUPPORTED: AddressSanitizer-x86_64-iossim :: TestCases/Windows/coverage-dll-stdio.cpp (197 of 482) UNSUPPORTED: AddressSanitizer-x86_64-iossim :: TestCases/Windows/crash_read_write.cpp (198 of 482) UNSUPPORTED: AddressSanitizer-x86_64-iossim :: TestCases/Windows/crt_initializers.cpp (199 of 482) UNSUPPORTED: AddressSanitizer-x86_64-iossim :: TestCases/Windows/delay_dbghelp.cpp (200 of 482) UNSUPPORTED: AddressSanitizer-x86_64-iossim :: TestCases/Windows/demangled_names.cpp (201 of 482) UNSUPPORTED: AddressSanitizer-x86_64-iossim :: TestCases/Windows/dll_aligned_mallocs.cpp (202 of 482) UNSUPPORTED: AddressSanitizer-x86_64-iossim :: TestCases/Windows/dll_allocators_sanity.cpp (203 of 482) UNSUPPORTED: AddressSanitizer-x86_64-iossim :: TestCases/Windows/dll_and_lib.cpp (204 of 482) UNSUPPORTED: AddressSanitizer-x86_64-iossim :: TestCases/Windows/dll_cerr.cpp (205 of 482) UNSUPPORTED: AddressSanitizer-x86_64-iossim :: TestCases/Windows/dll_control_c.cpp (206 of 482) UNSUPPORTED: AddressSanitizer-x86_64-iossim :: TestCases/Windows/dll_global_dead_strip.c (207 of 482) UNSUPPORTED: AddressSanitizer-x86_64-iossim :: TestCases/Windows/dll_heap_allocation.cpp (208 of 482) UNSUPPORTED: AddressSanitizer-x86_64-iossim :: TestCases/Windows/dll_host.cpp (209 of 482) UNSUPPORTED: AddressSanitizer-x86_64-iossim :: TestCases/Windows/dll_intercept_memchr.cpp (210 of 482) UNSUPPORTED: AddressSanitizer-x86_64-iossim :: TestCases/Windows/dll_intercept_memcpy.cpp (211 of 482) UNSUPPORTED: AddressSanitizer-x86_64-iossim :: TestCases/Windows/dll_intercept_memcpy_indirect.cpp (212 of 482) UNSUPPORTED: AddressSanitizer-x86_64-iossim :: TestCases/Windows/dll_intercept_memset.cpp (213 of 482) UNSUPPORTED: AddressSanitizer-x86_64-iossim :: TestCases/Windows/dll_intercept_strlen.cpp (214 of 482) UNSUPPORTED: AddressSanitizer-x86_64-iossim :: TestCases/Windows/dll_large_function.cpp (215 of 482) UNSUPPORTED: AddressSanitizer-x86_64-iossim :: TestCases/Windows/dll_malloc_left_oob.cpp (216 of 482) UNSUPPORTED: AddressSanitizer-x86_64-iossim :: TestCases/Windows/dll_malloc_uaf.cpp (217 of 482) UNSUPPORTED: AddressSanitizer-x86_64-iossim :: TestCases/Windows/dll_noreturn.cpp (218 of 482) UNSUPPORTED: AddressSanitizer-x86_64-iossim :: TestCases/Windows/dll_null_deref.cpp (219 of 482) UNSUPPORTED: AddressSanitizer-x86_64-iossim :: TestCases/Windows/dll_operator_array_new_left_oob.cpp (220 of 482) UNSUPPORTED: AddressSanitizer-x86_64-iossim :: TestCases/Windows/dll_operator_array_new_with_dtor_left_oob.cpp (221 of 482) UNSUPPORTED: AddressSanitizer-x86_64-iossim :: TestCases/Windows/dll_poison_unpoison.cpp (222 of 482) UNSUPPORTED: AddressSanitizer-x86_64-iossim :: TestCases/Windows/dll_report_globals_symbolization_at_startup.cpp (223 of 482) UNSUPPORTED: AddressSanitizer-x86_64-iossim :: TestCases/Windows/dll_seh.cpp (224 of 482) UNSUPPORTED: AddressSanitizer-x86_64-iossim :: TestCases/Windows/dll_stack_use_after_return.cpp (225 of 482) UNSUPPORTED: AddressSanitizer-x86_64-iossim :: TestCases/Windows/dll_thread_stack_array_left_oob.cpp (226 of 482) UNSUPPORTED: AddressSanitizer-x86_64-iossim :: TestCases/Windows/dll_unload.cpp (227 of 482) UNSUPPORTED: AddressSanitizer-x86_64-iossim :: TestCases/Windows/double_free.cpp (228 of 482) UNSUPPORTED: AddressSanitizer-x86_64-iossim :: TestCases/Windows/double_operator_delete.cpp (229 of 482) UNSUPPORTED: AddressSanitizer-x86_64-iossim :: TestCases/Windows/free_hook_realloc.cpp (230 of 482) UNSUPPORTED: AddressSanitizer-x86_64-iossim :: TestCases/Windows/fuse-lld-globals.cpp (231 of 482) UNSUPPORTED: AddressSanitizer-x86_64-iossim :: TestCases/Windows/fuse-lld.cpp (232 of 482) UNSUPPORTED: AddressSanitizer-x86_64-iossim :: TestCases/Windows/global_const_string.cpp (233 of 482) UNSUPPORTED: AddressSanitizer-x86_64-iossim :: TestCases/Windows/global_const_string_oob.cpp (234 of 482) UNSUPPORTED: AddressSanitizer-x86_64-iossim :: TestCases/Windows/global_dead_strip.c (235 of 482) UNSUPPORTED: AddressSanitizer-x86_64-iossim :: TestCases/Windows/heapalloc.cpp (236 of 482) UNSUPPORTED: AddressSanitizer-x86_64-iossim :: TestCases/Windows/heapalloc_dll_double_free.cpp (237 of 482) UNSUPPORTED: AddressSanitizer-x86_64-iossim :: TestCases/Windows/heapalloc_dll_unload_realloc_uaf.cpp (238 of 482) UNSUPPORTED: AddressSanitizer-x86_64-iossim :: TestCases/Windows/heapalloc_doublefree.cpp (239 of 482) UNSUPPORTED: AddressSanitizer-x86_64-iossim :: TestCases/Windows/heapalloc_flags_fallback.cpp (240 of 482) UNSUPPORTED: AddressSanitizer-x86_64-iossim :: TestCases/Windows/heapalloc_huge.cpp (241 of 482) UNSUPPORTED: AddressSanitizer-x86_64-iossim :: TestCases/Windows/heapalloc_rtl_transfer.cpp (242 of 482) UNSUPPORTED: AddressSanitizer-x86_64-iossim :: TestCases/Windows/heapalloc_sanity.cpp (243 of 482) UNSUPPORTED: AddressSanitizer-x86_64-iossim :: TestCases/Windows/heapalloc_transfer.cpp (244 of 482) UNSUPPORTED: AddressSanitizer-x86_64-iossim :: TestCases/Windows/heapalloc_uaf.cpp (245 of 482) UNSUPPORTED: AddressSanitizer-x86_64-iossim :: TestCases/Windows/heapalloc_zero_size.cpp (246 of 482) UNSUPPORTED: AddressSanitizer-x86_64-iossim :: TestCases/Windows/heaprealloc.cpp (247 of 482) UNSUPPORTED: AddressSanitizer-x86_64-iossim :: TestCases/Windows/heaprealloc_alloc_zero.cpp (248 of 482) UNSUPPORTED: AddressSanitizer-x86_64-iossim :: TestCases/Windows/heaprealloc_zero_size.cpp (249 of 482) UNSUPPORTED: AddressSanitizer-x86_64-iossim :: TestCases/Windows/hello_world.cpp (250 of 482) UNSUPPORTED: AddressSanitizer-x86_64-iossim :: TestCases/Windows/intercept_memcpy.cpp (251 of 482) UNSUPPORTED: AddressSanitizer-x86_64-iossim :: TestCases/Windows/intercept_strdup.cpp (252 of 482) UNSUPPORTED: AddressSanitizer-x86_64-iossim :: TestCases/Windows/intercept_strlen.cpp (253 of 482) UNSUPPORTED: AddressSanitizer-x86_64-iossim :: TestCases/Windows/interface_symbols_windows.cpp (254 of 482) UNSUPPORTED: AddressSanitizer-x86_64-iossim :: TestCases/Windows/iostream_sbo.cpp (255 of 482) UNSUPPORTED: AddressSanitizer-x86_64-iossim :: TestCases/Windows/longjmp.cpp (256 of 482) UNSUPPORTED: AddressSanitizer-x86_64-iossim :: TestCases/Windows/malloc_left_oob.cpp (257 of 482) UNSUPPORTED: AddressSanitizer-x86_64-iossim :: TestCases/Windows/malloc_right_oob.cpp (258 of 482) UNSUPPORTED: AddressSanitizer-x86_64-iossim :: TestCases/Windows/malloc_uaf.cpp (259 of 482) UNSUPPORTED: AddressSanitizer-x86_64-iossim :: TestCases/Windows/null_deref.cpp (260 of 482) UNSUPPORTED: AddressSanitizer-x86_64-iossim :: TestCases/Windows/null_deref_multiple_dlls.cpp (261 of 482) UNSUPPORTED: AddressSanitizer-x86_64-iossim :: TestCases/Windows/oom.cpp (262 of 482) UNSUPPORTED: AddressSanitizer-x86_64-iossim :: TestCases/Windows/operator_array_new_left_oob.cpp (263 of 482) UNSUPPORTED: AddressSanitizer-x86_64-iossim :: TestCases/Windows/operator_array_new_right_oob.cpp (264 of 482) UNSUPPORTED: AddressSanitizer-x86_64-iossim :: TestCases/Windows/operator_array_new_uaf.cpp (265 of 482) UNSUPPORTED: AddressSanitizer-x86_64-iossim :: TestCases/Windows/operator_array_new_with_dtor_left_oob.cpp (266 of 482) UNSUPPORTED: AddressSanitizer-x86_64-iossim :: TestCases/Windows/operator_delete_wrong_argument.cpp (267 of 482) UNSUPPORTED: AddressSanitizer-x86_64-iossim :: TestCases/Windows/operator_new_left_oob.cpp (268 of 482) UNSUPPORTED: AddressSanitizer-x86_64-iossim :: TestCases/Windows/operator_new_right_oob.cpp (269 of 482) UNSUPPORTED: AddressSanitizer-x86_64-iossim :: TestCases/Windows/operator_new_uaf.cpp (270 of 482) UNSUPPORTED: AddressSanitizer-x86_64-iossim :: TestCases/Windows/queue_user_work_item.cpp (271 of 482) UNSUPPORTED: AddressSanitizer-x86_64-iossim :: TestCases/Windows/queue_user_work_item_report.cpp (272 of 482) UNSUPPORTED: AddressSanitizer-x86_64-iossim :: TestCases/Windows/realloc_left_oob.cpp (273 of 482) UNSUPPORTED: AddressSanitizer-x86_64-iossim :: TestCases/Windows/realloc_right_oob.cpp (274 of 482) UNSUPPORTED: AddressSanitizer-x86_64-iossim :: TestCases/Windows/realloc_uaf.cpp (275 of 482) UNSUPPORTED: AddressSanitizer-x86_64-iossim :: TestCases/Windows/recalloc_sanity.cpp (276 of 482) UNSUPPORTED: AddressSanitizer-x86_64-iossim :: TestCases/Windows/report_after_syminitialize.cpp (277 of 482) UNSUPPORTED: AddressSanitizer-x86_64-iossim :: TestCases/Windows/report_globals_reload_dll.cpp (278 of 482) UNSUPPORTED: AddressSanitizer-x86_64-iossim :: TestCases/Windows/report_globals_vs_freelibrary.cpp (279 of 482) UNSUPPORTED: AddressSanitizer-x86_64-iossim :: TestCases/Windows/rtlallocateheap.cpp (280 of 482) UNSUPPORTED: AddressSanitizer-x86_64-iossim :: TestCases/Windows/rtlallocateheap_dll_unload_double_free.cpp (281 of 482) UNSUPPORTED: AddressSanitizer-x86_64-iossim :: TestCases/Windows/rtlallocateheap_dll_unload_realloc.cpp (282 of 482) UNSUPPORTED: AddressSanitizer-x86_64-iossim :: TestCases/Windows/rtlallocateheap_flags_fallback.cpp (283 of 482) UNSUPPORTED: AddressSanitizer-x86_64-iossim :: TestCases/Windows/rtlallocateheap_zero.cpp (284 of 482) UNSUPPORTED: AddressSanitizer-x86_64-iossim :: TestCases/Windows/seh.cpp (285 of 482) UNSUPPORTED: AddressSanitizer-x86_64-iossim :: TestCases/Windows/shadow_conflict_32.cpp (286 of 482) UNSUPPORTED: AddressSanitizer-x86_64-iossim :: TestCases/Windows/shadow_mapping_failure.cpp (287 of 482) UNSUPPORTED: AddressSanitizer-x86_64-iossim :: TestCases/Windows/stack_array_left_oob.cpp (288 of 482) UNSUPPORTED: AddressSanitizer-x86_64-iossim :: TestCases/Windows/stack_array_right_oob.cpp (289 of 482) UNSUPPORTED: AddressSanitizer-x86_64-iossim :: TestCases/Windows/stack_array_sanity.cpp (290 of 482) UNSUPPORTED: AddressSanitizer-x86_64-iossim :: TestCases/Windows/stack_use_after_return.cpp (291 of 482) UNSUPPORTED: AddressSanitizer-x86_64-iossim :: TestCases/Windows/symbols_path.cpp (292 of 482) UNSUPPORTED: AddressSanitizer-x86_64-iossim :: TestCases/Windows/thread_simple.cpp (293 of 482) UNSUPPORTED: AddressSanitizer-x86_64-iossim :: TestCases/Windows/thread_stack_array_left_oob.cpp (294 of 482) UNSUPPORTED: AddressSanitizer-x86_64-iossim :: TestCases/Windows/thread_stack_array_right_oob.cpp (295 of 482) UNSUPPORTED: AddressSanitizer-x86_64-iossim :: TestCases/Windows/thread_stack_reuse.cpp (296 of 482) UNSUPPORTED: AddressSanitizer-x86_64-iossim :: TestCases/Windows/thread_stress.cpp (297 of 482) UNSUPPORTED: AddressSanitizer-x86_64-iossim :: TestCases/Windows/thread_suspended.cpp (298 of 482) UNSUPPORTED: AddressSanitizer-x86_64-iossim :: TestCases/Windows/tls_init.cpp (299 of 482) UNSUPPORTED: AddressSanitizer-x86_64-iossim :: TestCases/Windows/unsymbolized.cpp (300 of 482) UNSUPPORTED: AddressSanitizer-x86_64-iossim :: TestCases/Windows/use_after_realloc.cpp (301 of 482) UNSUPPORTED: AddressSanitizer-x86_64-iossim :: TestCases/Windows/use_after_return_linkage.cpp (302 of 482) UNSUPPORTED: AddressSanitizer-x86_64-iossim :: TestCases/Windows/user-exception.cpp (303 of 482) UNSUPPORTED: AddressSanitizer-x86_64-iossim :: TestCases/Windows/windows_h.cpp (304 of 482) UNSUPPORTED: AddressSanitizer-x86_64-iossim :: TestCases/Windows/wrong_downcast_on_heap.cpp (305 of 482) UNSUPPORTED: AddressSanitizer-x86_64-iossim :: TestCases/Windows/wrong_downcast_on_stack.cpp (306 of 482) PASS: AddressSanitizer-x86_64-iossim :: TestCases/alloca_big_alignment.cpp (307 of 482) PASS: AddressSanitizer-x86_64-iossim :: TestCases/Posix/strndup_oob_test.cpp (308 of 482) PASS: AddressSanitizer-x86_64-iossim :: TestCases/Posix/strndup_oob_test2.cpp (309 of 482) PASS: AddressSanitizer-x86_64-iossim :: TestCases/alloca_constant_size.cpp (310 of 482) PASS: AddressSanitizer-x86_64-iossim :: TestCases/alloca_detect_custom_size_.cpp (311 of 482) PASS: AddressSanitizer-x86_64-iossim :: TestCases/alloca_instruments_all_paddings.cpp (312 of 482) PASS: AddressSanitizer-x86_64-iossim :: TestCases/alloca_loop_unpoisoning.cpp (313 of 482) PASS: AddressSanitizer-x86_64-iossim :: TestCases/alloca_overflow_partial.cpp (314 of 482) PASS: AddressSanitizer-x86_64-iossim :: TestCases/alloca_overflow_right.cpp (315 of 482) PASS: AddressSanitizer-x86_64-iossim :: TestCases/alloca_safe_access.cpp (316 of 482) PASS: AddressSanitizer-x86_64-iossim :: TestCases/alloca_underflow_left.cpp (317 of 482) PASS: AddressSanitizer-x86_64-iossim :: TestCases/asan_and_llvm_coverage_test.cpp (318 of 482) PASS: AddressSanitizer-x86_64-iossim :: TestCases/alloca_vla_interact.cpp (319 of 482) PASS: AddressSanitizer-x86_64-iossim :: TestCases/asan_options-help.cpp (320 of 482) PASS: AddressSanitizer-x86_64-iossim :: TestCases/atexit_stats.cpp (321 of 482) PASS: AddressSanitizer-x86_64-iossim :: TestCases/asan_update_allocation.cpp (322 of 482) PASS: AddressSanitizer-x86_64-iossim :: TestCases/atoi_strict.c (323 of 482) PASS: AddressSanitizer-x86_64-iossim :: TestCases/atol_strict.c (324 of 482) PASS: AddressSanitizer-x86_64-iossim :: TestCases/atoll_strict.c (325 of 482) PASS: AddressSanitizer-x86_64-iossim :: TestCases/calloc-overflow.cpp (326 of 482) PASS: AddressSanitizer-x86_64-iossim :: TestCases/blacklist.cpp (327 of 482) PASS: AddressSanitizer-x86_64-iossim :: TestCases/coverage-and-lsan.cpp (328 of 482) PASS: AddressSanitizer-x86_64-iossim :: TestCases/coverage-disabled.cpp (329 of 482) PASS: AddressSanitizer-x86_64-iossim :: TestCases/contiguous_container.cpp (330 of 482) PASS: AddressSanitizer-x86_64-iossim :: TestCases/contiguous_container_crash.cpp (331 of 482) PASS: AddressSanitizer-x86_64-iossim :: TestCases/coverage-trace-pc.cpp (332 of 482) PASS: AddressSanitizer-x86_64-iossim :: TestCases/debug_double_free.cpp (333 of 482) UNSUPPORTED: AddressSanitizer-x86_64-iossim :: TestCases/debug_ppc64_mapping.cpp (334 of 482) PASS: AddressSanitizer-x86_64-iossim :: TestCases/debug_locate.cpp (335 of 482) PASS: AddressSanitizer-x86_64-iossim :: TestCases/debug_mapping.cpp (336 of 482) PASS: AddressSanitizer-x86_64-iossim :: TestCases/debug_report.cpp (337 of 482) PASS: AddressSanitizer-x86_64-iossim :: TestCases/debug_stacks.cpp (338 of 482) UNSUPPORTED: AddressSanitizer-x86_64-iossim :: TestCases/default_blacklist.cpp (339 of 482) PASS: AddressSanitizer-x86_64-iossim :: TestCases/default_options.cpp (340 of 482) PASS: AddressSanitizer-x86_64-iossim :: TestCases/deep_stack_uaf.cpp (341 of 482) PASS: AddressSanitizer-x86_64-iossim :: TestCases/describe_address.cpp (342 of 482) PASS: AddressSanitizer-x86_64-iossim :: TestCases/error_report_callback.cpp (343 of 482) PASS: AddressSanitizer-x86_64-iossim :: TestCases/deep_tail_call.cpp (344 of 482) PASS: AddressSanitizer-x86_64-iossim :: TestCases/exitcode.cpp (345 of 482) PASS: AddressSanitizer-x86_64-iossim :: TestCases/force_inline_opt0.cpp (346 of 482) PASS: AddressSanitizer-x86_64-iossim :: TestCases/double-free.cpp (347 of 482) PASS: AddressSanitizer-x86_64-iossim :: TestCases/frexp_interceptor.cpp (348 of 482) PASS: AddressSanitizer-x86_64-iossim :: TestCases/global-demangle.cpp (349 of 482) PASS: AddressSanitizer-x86_64-iossim :: TestCases/global-address.cpp (350 of 482) PASS: AddressSanitizer-x86_64-iossim :: TestCases/global-location.cpp (351 of 482) PASS: AddressSanitizer-x86_64-iossim :: TestCases/global-overflow.cpp (352 of 482) PASS: AddressSanitizer-x86_64-iossim :: TestCases/global-underflow.cpp (353 of 482) PASS: AddressSanitizer-x86_64-iossim :: TestCases/halt_on_error-1.c (354 of 482) PASS: AddressSanitizer-x86_64-iossim :: TestCases/handle_noreturn_bug.cpp (355 of 482) UNSUPPORTED: AddressSanitizer-x86_64-iossim :: TestCases/heavy_uar_test.cpp (356 of 482) PASS: AddressSanitizer-x86_64-iossim :: TestCases/heap-overflow-large.cpp (357 of 482) PASS: AddressSanitizer-x86_64-iossim :: TestCases/huge_negative_hea_oob.cpp (358 of 482) PASS: AddressSanitizer-x86_64-iossim :: TestCases/ill.cpp (359 of 482) PASS: AddressSanitizer-x86_64-iossim :: TestCases/init-order-atexit.cpp (360 of 482) UNSUPPORTED: AddressSanitizer-x86_64-iossim :: TestCases/initialization-bug.cpp (361 of 482) PASS: AddressSanitizer-x86_64-iossim :: TestCases/heap-overflow.cpp (362 of 482) PASS: AddressSanitizer-x86_64-iossim :: TestCases/initialization-blacklist.cpp (363 of 482) PASS: AddressSanitizer-x86_64-iossim :: TestCases/inline.cpp (364 of 482) PASS: AddressSanitizer-x86_64-iossim :: TestCases/initialization-constexpr.cpp (365 of 482) PASS: AddressSanitizer-x86_64-iossim :: TestCases/intercept-rethrow-exception.cpp (366 of 482) PASS: AddressSanitizer-x86_64-iossim :: TestCases/initialization-nobug.cpp (367 of 482) PASS: AddressSanitizer-x86_64-iossim :: TestCases/interface_test.cpp (368 of 482) PASS: AddressSanitizer-x86_64-iossim :: TestCases/intra-object-overflow.cpp (369 of 482) PASS: AddressSanitizer-x86_64-iossim :: TestCases/interception_failure_test.cpp (370 of 482) PASS: AddressSanitizer-x86_64-iossim :: TestCases/invalid-pointer-pairs-compare-errors.cpp (371 of 482) PASS: AddressSanitizer-x86_64-iossim :: TestCases/invalid-pointer-pairs-compare-null.cpp (372 of 482) PASS: AddressSanitizer-x86_64-iossim :: TestCases/invalid-free.cpp (373 of 482) PASS: AddressSanitizer-x86_64-iossim :: TestCases/invalid-pointer-pairs-compare-success.cpp (374 of 482) PASS: AddressSanitizer-x86_64-iossim :: TestCases/invalid-pointer-pairs-subtract-errors.cpp (375 of 482) PASS: AddressSanitizer-x86_64-iossim :: TestCases/invalid-pointer-pairs-subtract-success.cpp (376 of 482) UNSUPPORTED: AddressSanitizer-x86_64-iossim :: TestCases/log-path_test.cpp (377 of 482) PASS: AddressSanitizer-x86_64-iossim :: TestCases/longjmp.cpp (378 of 482) PASS: AddressSanitizer-x86_64-iossim :: TestCases/invalid-pointer-pairs.cpp (379 of 482) PASS: AddressSanitizer-x86_64-iossim :: TestCases/lsan_annotations.cpp (380 of 482) PASS: AddressSanitizer-x86_64-iossim :: TestCases/malloc-no-intercept.c (381 of 482) PASS: AddressSanitizer-x86_64-iossim :: TestCases/large_func_test.cpp (382 of 482) PASS: AddressSanitizer-x86_64-iossim :: TestCases/malloc-size-too-big.cpp (383 of 482) PASS: AddressSanitizer-x86_64-iossim :: TestCases/malloc_fill.cpp (384 of 482) PASS: AddressSanitizer-x86_64-iossim :: TestCases/malloc_context_size.cpp (385 of 482) PASS: AddressSanitizer-x86_64-iossim :: TestCases/memcmp_strict_test.cpp (386 of 482) PASS: AddressSanitizer-x86_64-iossim :: TestCases/max_redzone.cpp (387 of 482) UNSUPPORTED: AddressSanitizer-x86_64-iossim :: TestCases/non-executable-pc.cpp (388 of 482) PASS: AddressSanitizer-x86_64-iossim :: TestCases/memcmp_test.cpp (389 of 482) PASS: AddressSanitizer-x86_64-iossim :: TestCases/on_error_callback.cpp (390 of 482) PASS: AddressSanitizer-x86_64-iossim :: TestCases/null_deref.cpp (391 of 482) PASS: AddressSanitizer-x86_64-iossim :: TestCases/pass-object-byval.cpp (392 of 482) UNSUPPORTED: AddressSanitizer-x86_64-iossim :: TestCases/pass-struct-byval-uar.cpp (393 of 482) PASS: AddressSanitizer-x86_64-iossim :: TestCases/pass-struct-byval.cpp (394 of 482) PASS: AddressSanitizer-x86_64-iossim :: TestCases/partial_right.cpp (395 of 482) PASS: AddressSanitizer-x86_64-iossim :: TestCases/poison_partial.cpp (396 of 482) PASS: AddressSanitizer-x86_64-iossim :: TestCases/pr33372.cpp (397 of 482) PASS: AddressSanitizer-x86_64-iossim :: TestCases/print_summary.cpp (398 of 482) PASS: AddressSanitizer-x86_64-iossim :: TestCases/printf-1.c (399 of 482) PASS: AddressSanitizer-x86_64-iossim :: TestCases/printf-2.c (400 of 482) PASS: AddressSanitizer-x86_64-iossim :: TestCases/printf-3.c (401 of 482) PASS: AddressSanitizer-x86_64-iossim :: TestCases/printf-4.c (402 of 482) PASS: AddressSanitizer-x86_64-iossim :: TestCases/printf-m.c (403 of 482) PASS: AddressSanitizer-x86_64-iossim :: TestCases/printf-5.c (404 of 482) PASS: AddressSanitizer-x86_64-iossim :: TestCases/memset_test.cpp (405 of 482) PASS: AddressSanitizer-x86_64-iossim :: TestCases/realloc.cpp (406 of 482) PASS: AddressSanitizer-x86_64-iossim :: TestCases/sanity_check_pure_c.c (407 of 482) PASS: AddressSanitizer-x86_64-iossim :: TestCases/sleep_after_init.c (408 of 482) PASS: AddressSanitizer-x86_64-iossim :: TestCases/set_shadow_test.c (409 of 482) PASS: AddressSanitizer-x86_64-iossim :: TestCases/sleep_before_dying.c (410 of 482) PASS: AddressSanitizer-x86_64-iossim :: TestCases/small_memcpy_test.cpp (411 of 482) PASS: AddressSanitizer-x86_64-iossim :: TestCases/speculative_load.cpp (412 of 482) PASS: AddressSanitizer-x86_64-iossim :: TestCases/speculative_load2.cpp (413 of 482) PASS: AddressSanitizer-x86_64-iossim :: TestCases/stack-buffer-overflow.cpp (414 of 482) PASS: AddressSanitizer-x86_64-iossim :: TestCases/stack-frame-demangle.cpp (415 of 482) PASS: AddressSanitizer-x86_64-iossim :: TestCases/scariness_score_test.cpp (416 of 482) PASS: AddressSanitizer-x86_64-iossim :: TestCases/stack-buffer-overflow-with-position.cpp (417 of 482) PASS: AddressSanitizer-x86_64-iossim :: TestCases/stack-oob-frames.cpp (418 of 482) PASS: AddressSanitizer-x86_64-iossim :: TestCases/strcasestr-1.c (419 of 482) PASS: AddressSanitizer-x86_64-iossim :: TestCases/strcasestr-2.c (420 of 482) PASS: AddressSanitizer-x86_64-iossim :: TestCases/strcasestr_strict.c (421 of 482) PASS: AddressSanitizer-x86_64-iossim :: TestCases/strchr_strict.c (422 of 482) PASS: AddressSanitizer-x86_64-iossim :: TestCases/strcat_strict.c (423 of 482) PASS: AddressSanitizer-x86_64-iossim :: TestCases/strcmp_strict.c (424 of 482) PASS: AddressSanitizer-x86_64-iossim :: TestCases/strcspn-1.c (425 of 482) PASS: AddressSanitizer-x86_64-iossim :: TestCases/strcat-overlap.cpp (426 of 482) PASS: AddressSanitizer-x86_64-iossim :: TestCases/strcspn-2.c (427 of 482) UNSUPPORTED: AddressSanitizer-x86_64-iossim :: TestCases/strdup_oob_test.cpp (428 of 482) PASS: AddressSanitizer-x86_64-iossim :: TestCases/strip_path_prefix.c (429 of 482) PASS: AddressSanitizer-x86_64-iossim :: TestCases/strcspn_strict.c (430 of 482) PASS: AddressSanitizer-x86_64-iossim :: TestCases/strcpy-overlap.cpp (431 of 482) PASS: AddressSanitizer-x86_64-iossim :: TestCases/strncasecmp_strict.c (432 of 482) PASS: AddressSanitizer-x86_64-iossim :: TestCases/strncat_strict.c (433 of 482) PASS: AddressSanitizer-x86_64-iossim :: TestCases/strncat-overlap.cpp (434 of 482) PASS: AddressSanitizer-x86_64-iossim :: TestCases/strncpy-overflow.cpp (435 of 482) PASS: AddressSanitizer-x86_64-iossim :: TestCases/strpbrk-1.c (436 of 482) PASS: AddressSanitizer-x86_64-iossim :: TestCases/strncmp_strict.c (437 of 482) PASS: AddressSanitizer-x86_64-iossim :: TestCases/strpbrk-2.c (438 of 482) PASS: AddressSanitizer-x86_64-iossim :: TestCases/strspn-1.c (439 of 482) PASS: AddressSanitizer-x86_64-iossim :: TestCases/strpbrk_strict.c (440 of 482) PASS: AddressSanitizer-x86_64-iossim :: TestCases/strncpy-overlap.cpp (441 of 482) PASS: AddressSanitizer-x86_64-iossim :: TestCases/strspn-2.c (442 of 482) PASS: AddressSanitizer-x86_64-iossim :: TestCases/strspn_strict.c (443 of 482) PASS: AddressSanitizer-x86_64-iossim :: TestCases/strstr-1.c (444 of 482) PASS: AddressSanitizer-x86_64-iossim :: TestCases/strstr-2.c (445 of 482) PASS: AddressSanitizer-x86_64-iossim :: TestCases/strstr_strict.c (446 of 482) PASS: AddressSanitizer-x86_64-iossim :: TestCases/strtok.c (447 of 482) UNSUPPORTED: AddressSanitizer-x86_64-iossim :: TestCases/suppressions-exec-relative-location.cpp (448 of 482) UNSUPPORTED: AddressSanitizer-x86_64-iossim :: TestCases/suppressions-function.cpp (449 of 482) PASS: AddressSanitizer-x86_64-iossim :: TestCases/suppressions-interceptor.cpp (450 of 482) PASS: AddressSanitizer-x86_64-iossim :: TestCases/suppressions-library.cpp (451 of 482) PASS: AddressSanitizer-x86_64-iossim :: TestCases/throw_call_test.cpp (452 of 482) PASS: AddressSanitizer-x86_64-iossim :: TestCases/strtol_strict.c (453 of 482) PASS: AddressSanitizer-x86_64-iossim :: TestCases/throw_catch.cpp (454 of 482) PASS: AddressSanitizer-x86_64-iossim :: TestCases/strtoll_strict.c (455 of 482) PASS: AddressSanitizer-x86_64-iossim :: TestCases/throw_invoke_test.cpp (456 of 482) PASS: AddressSanitizer-x86_64-iossim :: TestCases/time_interceptor.cpp (457 of 482) PASS: AddressSanitizer-x86_64-iossim :: TestCases/uar_and_exceptions.cpp (458 of 482) PASS: AddressSanitizer-x86_64-iossim :: TestCases/use-after-delete.cpp (459 of 482) PASS: AddressSanitizer-x86_64-iossim :: TestCases/use-after-free-right.cpp (460 of 482) PASS: AddressSanitizer-x86_64-iossim :: TestCases/unaligned_loads_and_stores.cpp (461 of 482) PASS: AddressSanitizer-x86_64-iossim :: TestCases/use-after-poison.cpp (462 of 482) XFAIL: AddressSanitizer-x86_64-iossim :: TestCases/use-after-scope-conversion.cpp (463 of 482) PASS: AddressSanitizer-x86_64-iossim :: TestCases/use-after-scope-dtor-order.cpp (464 of 482) PASS: AddressSanitizer-x86_64-iossim :: TestCases/use-after-scope-goto.cpp (465 of 482) PASS: AddressSanitizer-x86_64-iossim :: TestCases/use-after-free.cpp (466 of 482) PASS: AddressSanitizer-x86_64-iossim :: TestCases/use-after-scope-capture.cpp (467 of 482) PASS: AddressSanitizer-x86_64-iossim :: TestCases/use-after-scope-if.cpp (468 of 482) PASS: AddressSanitizer-x86_64-iossim :: TestCases/use-after-scope-inlined.cpp (469 of 482) PASS: AddressSanitizer-x86_64-iossim :: TestCases/use-after-scope-loop-bug.cpp (470 of 482) PASS: AddressSanitizer-x86_64-iossim :: TestCases/use-after-scope-loop-removed.cpp (471 of 482) PASS: AddressSanitizer-x86_64-iossim :: TestCases/use-after-scope-loop.cpp (472 of 482) PASS: AddressSanitizer-x86_64-iossim :: TestCases/use-after-scope-nobug.cpp (473 of 482) PASS: AddressSanitizer-x86_64-iossim :: TestCases/use-after-scope-temp.cpp (474 of 482) PASS: AddressSanitizer-x86_64-iossim :: TestCases/use-after-scope-temp2.cpp (475 of 482) UNSUPPORTED: AddressSanitizer-x86_64-iossim :: TestCases/verbose-log-path_test.cpp (476 of 482) PASS: AddressSanitizer-x86_64-iossim :: TestCases/vla_chrome_testcase.cpp (477 of 482) PASS: AddressSanitizer-x86_64-iossim :: TestCases/use-after-scope.cpp (478 of 482) PASS: AddressSanitizer-x86_64-iossim :: TestCases/vla_condition_overflow.cpp (479 of 482) PASS: AddressSanitizer-x86_64-iossim :: TestCases/vla_loop_overfow.cpp (480 of 482) PASS: AddressSanitizer-x86_64-iossim :: TestCases/zero_page_pc.cpp (481 of 482) PASS: AddressSanitizer-x86_64-iossim :: TestCases/use-after-scope-types.cpp (482 of 482)

Hide Details

1 warning(s) in tests

Hide Details

Testing Time: 199.16s Expected Passes : 222 Expected Failures : 1 Unsupported Tests : 259 + ./bin/llvm-lit -v --xunit-xml-output=asan-IOSSimI386Config.xunit.xml ./tools/clang/runtime/compiler-rt-bins/test/asan/IOSSimI386Config/ llvm-lit: /Users/buildslave/jenkins/workspace/clang-stage1-cmake-RA-expensive/llvm-project/llvm/utils/lit/lit/util.py:410: note: using SDKROOT: u'/Applications/Xcode.app/Contents/Developer/Platforms/MacOSX.platform/Developer/SDKs/MacOSX10.13.sdk' {"env": {}} -- Testing: 482 tests, 8 workers -- UNSUPPORTED: AddressSanitizer-i386-iossim :: TestCases/Darwin/abort_on_error.cpp (1 of 482) UNSUPPORTED: AddressSanitizer-i386-iossim :: TestCases/Darwin/address-range-limit.mm (2 of 482) UNSUPPORTED: AddressSanitizer-i386-iossim :: TestCases/Darwin/asan-symbolize-partial-report-no-external-symbolizer.cpp (3 of 482) UNSUPPORTED: AddressSanitizer-i386-iossim :: TestCases/Darwin/asan-symbolize-partial-report-with-module-map.cpp (4 of 482) UNSUPPORTED: AddressSanitizer-i386-iossim :: TestCases/Darwin/asan-symbolize-with-module-map.cpp (5 of 482) UNSUPPORTED: AddressSanitizer-i386-iossim :: TestCases/Darwin/asan_gen_prefixes.cpp (6 of 482) UNSUPPORTED: AddressSanitizer-i386-iossim :: TestCases/Darwin/atos-symbolizer-dyld-root-path.cpp (7 of 482) UNSUPPORTED: AddressSanitizer-i386-iossim :: TestCases/Darwin/atos-symbolizer.cpp (8 of 482) UNSUPPORTED: AddressSanitizer-i386-iossim :: TestCases/Darwin/crashlog-stacktraces.c (9 of 482) UNSUPPORTED: AddressSanitizer-i386-iossim :: TestCases/Darwin/cstring_literals_regtest.mm (10 of 482) UNSUPPORTED: AddressSanitizer-i386-iossim :: TestCases/Darwin/cstring_section.c (11 of 482) UNSUPPORTED: AddressSanitizer-i386-iossim :: TestCases/Darwin/dead-strip.c (12 of 482) UNSUPPORTED: AddressSanitizer-i386-iossim :: TestCases/Darwin/dladdr-demangling.cpp (13 of 482) UNSUPPORTED: AddressSanitizer-i386-iossim :: TestCases/Darwin/dump_registers.cpp (14 of 482) UNSUPPORTED: AddressSanitizer-i386-iossim :: TestCases/Darwin/dyld_insert_libraries_reexec.cpp (15 of 482) UNSUPPORTED: AddressSanitizer-i386-iossim :: TestCases/Darwin/dyld_insert_libraries_remove.cpp (16 of 482) UNSUPPORTED: AddressSanitizer-i386-iossim :: TestCases/Darwin/empty-section.cpp (17 of 482) UNSUPPORTED: AddressSanitizer-i386-iossim :: TestCases/Darwin/fclose.c (18 of 482) UNSUPPORTED: AddressSanitizer-i386-iossim :: TestCases/Darwin/getpwnam.c (19 of 482) UNSUPPORTED: AddressSanitizer-i386-iossim :: TestCases/Darwin/haswell-symbolication.cpp (20 of 482) UNSUPPORTED: AddressSanitizer-i386-iossim :: TestCases/Darwin/init_for_dlopen.cpp (21 of 482) UNSUPPORTED: AddressSanitizer-i386-iossim :: TestCases/Darwin/interface_symbols_darwin.cpp (22 of 482) UNSUPPORTED: AddressSanitizer-i386-iossim :: TestCases/Darwin/linked-only.cpp (23 of 482) UNSUPPORTED: AddressSanitizer-i386-iossim :: TestCases/Darwin/malloc_destroy_zone.cpp (24 of 482) UNSUPPORTED: AddressSanitizer-i386-iossim :: TestCases/Darwin/malloc_set_zone_name-mprotect.cpp (25 of 482) UNSUPPORTED: AddressSanitizer-i386-iossim :: TestCases/Darwin/malloc_size_crash.mm (26 of 482) UNSUPPORTED: AddressSanitizer-i386-iossim :: TestCases/Darwin/malloc_zone-protected.cpp (27 of 482) UNSUPPORTED: AddressSanitizer-i386-iossim :: TestCases/Darwin/mixing-global-constructors.cpp (28 of 482) UNSUPPORTED: AddressSanitizer-i386-iossim :: TestCases/Darwin/nil-return-struct.mm (29 of 482) UNSUPPORTED: AddressSanitizer-i386-iossim :: TestCases/Darwin/objc-odr.mm (30 of 482) UNSUPPORTED: AddressSanitizer-i386-iossim :: TestCases/Darwin/odr-lto.cpp (31 of 482) UNSUPPORTED: AddressSanitizer-i386-iossim :: TestCases/Darwin/reexec-insert-libraries-env.cpp (32 of 482) UNSUPPORTED: AddressSanitizer-i386-iossim :: TestCases/Darwin/sandbox-symbolizer.cpp (33 of 482) UNSUPPORTED: AddressSanitizer-i386-iossim :: TestCases/Darwin/scribble.cpp (34 of 482) UNSUPPORTED: AddressSanitizer-i386-iossim :: TestCases/Darwin/segv_read_write.c (35 of 482) UNSUPPORTED: AddressSanitizer-i386-iossim :: TestCases/Darwin/suppressions-darwin.cpp (36 of 482) UNSUPPORTED: AddressSanitizer-i386-iossim :: TestCases/Darwin/suppressions-function.cpp (37 of 482) UNSUPPORTED: AddressSanitizer-i386-iossim :: TestCases/Darwin/suppressions-sandbox.cpp (38 of 482) UNSUPPORTED: AddressSanitizer-i386-iossim :: TestCases/Darwin/unset-insert-libraries-on-exec.cpp (39 of 482) UNSUPPORTED: AddressSanitizer-i386-iossim :: TestCases/Darwin/uuid.cpp (40 of 482) UNSUPPORTED: AddressSanitizer-i386-iossim :: TestCases/Linux/abort_on_error.cpp (41 of 482) UNSUPPORTED: AddressSanitizer-i386-iossim :: TestCases/Linux/activation-options.cpp (42 of 482) UNSUPPORTED: AddressSanitizer-i386-iossim :: TestCases/Linux/aligned_delete_test.cpp (43 of 482) UNSUPPORTED: AddressSanitizer-i386-iossim :: TestCases/Linux/allocator_oom_test.cpp (44 of 482) UNSUPPORTED: AddressSanitizer-i386-iossim :: TestCases/Linux/asan_default_suppressions.cpp (45 of 482) UNSUPPORTED: AddressSanitizer-i386-iossim :: TestCases/Linux/asan_dlopen_test.cpp (46 of 482) UNSUPPORTED: AddressSanitizer-i386-iossim :: TestCases/Linux/asan_prelink_test.cpp (47 of 482) UNSUPPORTED: AddressSanitizer-i386-iossim :: TestCases/Linux/asan_preload_test-1.cpp (48 of 482) UNSUPPORTED: AddressSanitizer-i386-iossim :: TestCases/Linux/asan_preload_test-2.cpp (49 of 482) UNSUPPORTED: AddressSanitizer-i386-iossim :: TestCases/Linux/asan_preload_test-3.cpp (50 of 482) UNSUPPORTED: AddressSanitizer-i386-iossim :: TestCases/Linux/asan_rt_confict_test-1.cpp (51 of 482) UNSUPPORTED: AddressSanitizer-i386-iossim :: TestCases/Linux/asan_rt_confict_test-2.cpp (52 of 482) UNSUPPORTED: AddressSanitizer-i386-iossim :: TestCases/Linux/auto_memory_profile_test.cpp (53 of 482) UNSUPPORTED: AddressSanitizer-i386-iossim :: TestCases/Linux/bzero.cpp (54 of 482) UNSUPPORTED: AddressSanitizer-i386-iossim :: TestCases/Linux/calloc-preload.c (55 of 482) UNSUPPORTED: AddressSanitizer-i386-iossim :: TestCases/Linux/clang_gcc_abi.cpp (56 of 482) UNSUPPORTED: AddressSanitizer-i386-iossim :: TestCases/Linux/clone_test.cpp (57 of 482) UNSUPPORTED: AddressSanitizer-i386-iossim :: TestCases/Linux/coverage-missing.cpp (58 of 482) UNSUPPORTED: AddressSanitizer-i386-iossim :: TestCases/Linux/cuda_test.cpp (59 of 482) UNSUPPORTED: AddressSanitizer-i386-iossim :: TestCases/Linux/dlopen-mixed-c-cxx.c (60 of 482) UNSUPPORTED: AddressSanitizer-i386-iossim :: TestCases/Linux/function-sections-are-bad.cpp (61 of 482) UNSUPPORTED: AddressSanitizer-i386-iossim :: TestCases/Linux/global-overflow-bfd.cpp (62 of 482) UNSUPPORTED: AddressSanitizer-i386-iossim :: TestCases/Linux/global-overflow-lld.cpp (63 of 482) UNSUPPORTED: AddressSanitizer-i386-iossim :: TestCases/Linux/globals-gc-sections-lld.cpp (64 of 482) UNSUPPORTED: AddressSanitizer-i386-iossim :: TestCases/Linux/init-order-dlopen.cpp (65 of 482) UNSUPPORTED: AddressSanitizer-i386-iossim :: TestCases/Linux/init_fini_sections.cpp (66 of 482) UNSUPPORTED: AddressSanitizer-i386-iossim :: TestCases/Linux/initialization-bug-any-order.cpp (67 of 482) UNSUPPORTED: AddressSanitizer-i386-iossim :: TestCases/Linux/interception_malloc_test.cpp (68 of 482) UNSUPPORTED: AddressSanitizer-i386-iossim :: TestCases/Linux/interception_readdir_r_test.cpp (69 of 482) UNSUPPORTED: AddressSanitizer-i386-iossim :: TestCases/Linux/interception_test.cpp (70 of 482) UNSUPPORTED: AddressSanitizer-i386-iossim :: TestCases/Linux/interface_symbols_linux.cpp (71 of 482) UNSUPPORTED: AddressSanitizer-i386-iossim :: TestCases/Linux/kernel-area.cpp (72 of 482) UNSUPPORTED: AddressSanitizer-i386-iossim :: TestCases/Linux/leak.cpp (73 of 482) UNSUPPORTED: AddressSanitizer-i386-iossim :: TestCases/Linux/leak_check_segv.cpp (74 of 482) UNSUPPORTED: AddressSanitizer-i386-iossim :: TestCases/Linux/local_alias.cpp (75 of 482) UNSUPPORTED: AddressSanitizer-i386-iossim :: TestCases/Linux/long-object-path.cpp (76 of 482) UNSUPPORTED: AddressSanitizer-i386-iossim :: TestCases/Linux/longjmp_chk.c (77 of 482) UNSUPPORTED: AddressSanitizer-i386-iossim :: TestCases/Linux/malloc-in-qsort.cpp (78 of 482) UNSUPPORTED: AddressSanitizer-i386-iossim :: TestCases/Linux/malloc_delete_mismatch.cpp (79 of 482) UNSUPPORTED: AddressSanitizer-i386-iossim :: TestCases/Linux/memmem_test.cpp (80 of 482) UNSUPPORTED: AddressSanitizer-i386-iossim :: TestCases/Linux/mincore.cpp (81 of 482) UNSUPPORTED: AddressSanitizer-i386-iossim :: TestCases/Linux/new_delete_mismatch.cpp (82 of 482) UNSUPPORTED: AddressSanitizer-i386-iossim :: TestCases/Linux/new_delete_mismatch_global.cpp (83 of 482) UNSUPPORTED: AddressSanitizer-i386-iossim :: TestCases/Linux/new_delete_mismatch_stack.cpp (84 of 482) UNSUPPORTED: AddressSanitizer-i386-iossim :: TestCases/Linux/nohugepage_test.cpp (85 of 482) UNSUPPORTED: AddressSanitizer-i386-iossim :: TestCases/Linux/odr-violation.cpp (86 of 482) UNSUPPORTED: AddressSanitizer-i386-iossim :: TestCases/Linux/odr-vtable.cpp (87 of 482) UNSUPPORTED: AddressSanitizer-i386-iossim :: TestCases/Linux/odr_c_test.c (88 of 482) UNSUPPORTED: AddressSanitizer-i386-iossim :: TestCases/Linux/odr_indicators.cpp (89 of 482) UNSUPPORTED: AddressSanitizer-i386-iossim :: TestCases/Linux/overflow-in-qsort.cpp (90 of 482) UNSUPPORTED: AddressSanitizer-i386-iossim :: TestCases/Linux/preinit_test.cpp (91 of 482) UNSUPPORTED: AddressSanitizer-i386-iossim :: TestCases/Linux/preinstalled_signal.cpp (92 of 482) UNSUPPORTED: AddressSanitizer-i386-iossim :: TestCases/Linux/print_memory_profile_test.cpp (93 of 482) UNSUPPORTED: AddressSanitizer-i386-iossim :: TestCases/Linux/printf-fortify-1.c (94 of 482) UNSUPPORTED: AddressSanitizer-i386-iossim :: TestCases/Linux/printf-fortify-2.c (95 of 482) UNSUPPORTED: AddressSanitizer-i386-iossim :: TestCases/Linux/printf-fortify-3.c (96 of 482) UNSUPPORTED: AddressSanitizer-i386-iossim :: TestCases/Linux/printf-fortify-4.c (97 of 482) UNSUPPORTED: AddressSanitizer-i386-iossim :: TestCases/Linux/printf-fortify-5.c (98 of 482) UNSUPPORTED: AddressSanitizer-i386-iossim :: TestCases/Linux/pthread_create_from_constructor.cpp (99 of 482) UNSUPPORTED: AddressSanitizer-i386-iossim :: TestCases/Linux/pthread_create_version.cpp (100 of 482) UNSUPPORTED: AddressSanitizer-i386-iossim :: TestCases/Linux/ptrace.cpp (101 of 482) UNSUPPORTED: AddressSanitizer-i386-iossim :: TestCases/Linux/quarantine_size_mb.cpp (102 of 482) UNSUPPORTED: AddressSanitizer-i386-iossim :: TestCases/Linux/read_binary_name_regtest.c (103 of 482) UNSUPPORTED: AddressSanitizer-i386-iossim :: TestCases/Linux/recoverable-lsan.cpp (104 of 482) UNSUPPORTED: AddressSanitizer-i386-iossim :: TestCases/Linux/recvfrom.cpp (105 of 482) UNSUPPORTED: AddressSanitizer-i386-iossim :: TestCases/Linux/release_to_os_test.cpp (106 of 482) UNSUPPORTED: AddressSanitizer-i386-iossim :: TestCases/Linux/rlimit_mmap_test.cpp (107 of 482) UNSUPPORTED: AddressSanitizer-i386-iossim :: TestCases/Linux/sanbox_read_proc_self_maps_test.cpp (108 of 482) UNSUPPORTED: AddressSanitizer-i386-iossim :: TestCases/Linux/segv_read_write.c (109 of 482) UNSUPPORTED: AddressSanitizer-i386-iossim :: TestCases/Linux/shmctl.cpp (110 of 482) UNSUPPORTED: AddressSanitizer-i386-iossim :: TestCases/Linux/signal_during_stop_the_world.cpp (111 of 482) UNSUPPORTED: AddressSanitizer-i386-iossim :: TestCases/Linux/sized_delete_test.cpp (112 of 482) UNSUPPORTED: AddressSanitizer-i386-iossim :: TestCases/Linux/stack-overflow-recovery-mode.cpp (113 of 482) UNSUPPORTED: AddressSanitizer-i386-iossim :: TestCases/Linux/stack-overflow-sigbus.cpp (114 of 482) UNSUPPORTED: AddressSanitizer-i386-iossim :: TestCases/Linux/stack-trace-dlclose.cpp (115 of 482) UNSUPPORTED: AddressSanitizer-i386-iossim :: TestCases/Linux/static_tls.cpp (116 of 482) UNSUPPORTED: AddressSanitizer-i386-iossim :: TestCases/Linux/stress_dtls.c (117 of 482) UNSUPPORTED: AddressSanitizer-i386-iossim :: TestCases/Linux/swapcontext_annotation.cpp (118 of 482) UNSUPPORTED: AddressSanitizer-i386-iossim :: TestCases/Linux/swapcontext_test.cpp (119 of 482) UNSUPPORTED: AddressSanitizer-i386-iossim :: TestCases/Linux/syscalls.cpp (120 of 482) UNSUPPORTED: AddressSanitizer-i386-iossim :: TestCases/Linux/textdomain.c (121 of 482) UNSUPPORTED: AddressSanitizer-i386-iossim :: TestCases/Linux/thread_local_quarantine_pthread_join.cpp (122 of 482) UNSUPPORTED: AddressSanitizer-i386-iossim :: TestCases/Linux/thread_local_quarantine_size_kb.cpp (123 of 482) UNSUPPORTED: AddressSanitizer-i386-iossim :: TestCases/Linux/uar_signals.cpp (124 of 482) UNSUPPORTED: AddressSanitizer-i386-iossim :: TestCases/Linux/unpoison_tls.cpp (125 of 482) UNSUPPORTED: AddressSanitizer-i386-iossim :: TestCases/Linux/vfork.cpp (126 of 482) UNSUPPORTED: AddressSanitizer-i386-iossim :: TestCases/Posix/asan-sigbus.cpp (127 of 482) UNSUPPORTED: AddressSanitizer-i386-iossim :: TestCases/Posix/asan-symbolize-bad-path.cpp (128 of 482) UNSUPPORTED: AddressSanitizer-i386-iossim :: TestCases/Posix/asan-symbolize-sanity-test.cpp (129 of 482) UNSUPPORTED: AddressSanitizer-i386-iossim :: TestCases/Posix/asan_symbolize_script/logging_options_in_help.cpp (130 of 482) UNSUPPORTED: AddressSanitizer-i386-iossim :: TestCases/Posix/asan_symbolize_script/plugin_no_op_help_output.cpp (131 of 482) UNSUPPORTED: AddressSanitizer-i386-iossim :: TestCases/Posix/asan_symbolize_script/plugin_no_op_symbolicate.cpp (132 of 482) UNSUPPORTED: AddressSanitizer-i386-iossim :: TestCases/Posix/asan_symbolize_script/plugin_wrong_frame_number_bug.cpp (133 of 482) UNSUPPORTED: AddressSanitizer-i386-iossim :: TestCases/Posix/asan_symbolize_script/set_log_dest.cpp (134 of 482) UNSUPPORTED: AddressSanitizer-i386-iossim :: TestCases/Posix/asan_symbolize_script/set_log_level.cpp (135 of 482) UNSUPPORTED: AddressSanitizer-i386-iossim :: TestCases/Posix/asprintf.cpp (136 of 482) UNSUPPORTED: AddressSanitizer-i386-iossim :: TestCases/Posix/assign_large_valloc_to_global.cpp (137 of 482) UNSUPPORTED: AddressSanitizer-i386-iossim :: TestCases/Posix/bcmp_test.cpp (138 of 482) UNSUPPORTED: AddressSanitizer-i386-iossim :: TestCases/Posix/closed-fds.cpp (139 of 482) UNSUPPORTED: AddressSanitizer-i386-iossim :: TestCases/Posix/concurrent_overflow.cpp (140 of 482) UNSUPPORTED: AddressSanitizer-i386-iossim :: TestCases/Posix/coverage-fork.cpp (141 of 482) UNSUPPORTED: AddressSanitizer-i386-iossim :: TestCases/Posix/coverage-module-unloaded.cpp (142 of 482) UNSUPPORTED: AddressSanitizer-i386-iossim :: TestCases/Posix/coverage-reset.cpp (143 of 482) UNSUPPORTED: AddressSanitizer-i386-iossim :: TestCases/Posix/coverage.cpp (144 of 482) UNSUPPORTED: AddressSanitizer-i386-iossim :: TestCases/Posix/current_allocated_bytes.cpp (145 of 482) UNSUPPORTED: AddressSanitizer-i386-iossim :: TestCases/Posix/deep_call_stack.cpp (146 of 482) UNSUPPORTED: AddressSanitizer-i386-iossim :: TestCases/Posix/deep_thread_stack.cpp (147 of 482) UNSUPPORTED: AddressSanitizer-i386-iossim :: TestCases/Posix/dlclose-test.cpp (148 of 482) UNSUPPORTED: AddressSanitizer-i386-iossim :: TestCases/Posix/fgets_fputs.cpp (149 of 482) UNSUPPORTED: AddressSanitizer-i386-iossim :: TestCases/Posix/fread_fwrite.cpp (150 of 482) UNSUPPORTED: AddressSanitizer-i386-iossim :: TestCases/Posix/free_hook_realloc.cpp (151 of 482) UNSUPPORTED: AddressSanitizer-i386-iossim :: TestCases/Posix/freopen.cpp (152 of 482) UNSUPPORTED: AddressSanitizer-i386-iossim :: TestCases/Posix/gc-test.cpp (153 of 482) UNSUPPORTED: AddressSanitizer-i386-iossim :: TestCases/Posix/glob.cpp (154 of 482) UNSUPPORTED: AddressSanitizer-i386-iossim :: TestCases/Posix/global-registration.c (155 of 482) UNSUPPORTED: AddressSanitizer-i386-iossim :: TestCases/Posix/halt_on_error-signals.c (156 of 482) UNSUPPORTED: AddressSanitizer-i386-iossim :: TestCases/Posix/halt_on_error-torture.cpp (157 of 482) UNSUPPORTED: AddressSanitizer-i386-iossim :: TestCases/Posix/halt_on_error_suppress_equal_pcs.cpp (158 of 482) UNSUPPORTED: AddressSanitizer-i386-iossim :: TestCases/Posix/handle_abort_on_error.cpp (159 of 482) UNSUPPORTED: AddressSanitizer-i386-iossim :: TestCases/Posix/high-address-dereference.c (160 of 482) UNSUPPORTED: AddressSanitizer-i386-iossim :: TestCases/Posix/init-order-pthread-create.cpp (161 of 482) UNSUPPORTED: AddressSanitizer-i386-iossim :: TestCases/Posix/interception-in-shared-lib-test.cpp (162 of 482) UNSUPPORTED: AddressSanitizer-i386-iossim :: TestCases/Posix/invalid-pointer-pairs-threads.cpp (163 of 482) UNSUPPORTED: AddressSanitizer-i386-iossim :: TestCases/Posix/ioctl.cpp (164 of 482) UNSUPPORTED: AddressSanitizer-i386-iossim :: TestCases/Posix/large_allocator_unpoisons_on_free.cpp (165 of 482) UNSUPPORTED: AddressSanitizer-i386-iossim :: TestCases/Posix/lto-constmerge-odr.cpp (166 of 482) UNSUPPORTED: AddressSanitizer-i386-iossim :: TestCases/Posix/mmap_limit_mb.cpp (167 of 482) UNSUPPORTED: AddressSanitizer-i386-iossim :: TestCases/Posix/new_array_cookie_test.cpp (168 of 482) UNSUPPORTED: AddressSanitizer-i386-iossim :: TestCases/Posix/new_array_cookie_uaf_test.cpp (169 of 482) UNSUPPORTED: AddressSanitizer-i386-iossim :: TestCases/Posix/new_array_cookie_with_new_from_class.cpp (170 of 482) UNSUPPORTED: AddressSanitizer-i386-iossim :: TestCases/Posix/no-fd.cpp (171 of 482) UNSUPPORTED: AddressSanitizer-i386-iossim :: TestCases/Posix/no_asan_gen_globals.c (172 of 482) UNSUPPORTED: AddressSanitizer-i386-iossim :: TestCases/Posix/print_cmdline.cpp (173 of 482) UNSUPPORTED: AddressSanitizer-i386-iossim :: TestCases/Posix/readv.cpp (174 of 482) UNSUPPORTED: AddressSanitizer-i386-iossim :: TestCases/Posix/shared-lib-test.cpp (175 of 482) UNSUPPORTED: AddressSanitizer-i386-iossim :: TestCases/Posix/stack-overflow.cpp (176 of 482) UNSUPPORTED: AddressSanitizer-i386-iossim :: TestCases/Posix/stack-use-after-return.cpp (177 of 482) UNSUPPORTED: AddressSanitizer-i386-iossim :: TestCases/Posix/start-deactivated.cpp (178 of 482) UNSUPPORTED: AddressSanitizer-i386-iossim :: TestCases/Posix/strchr.c (179 of 482) UNSUPPORTED: AddressSanitizer-i386-iossim :: TestCases/Posix/strerror_r_test.cpp (180 of 482) UNSUPPORTED: AddressSanitizer-i386-iossim :: TestCases/Posix/strndup_oob_test.cpp (181 of 482) UNSUPPORTED: AddressSanitizer-i386-iossim :: TestCases/Posix/strndup_oob_test2.cpp (182 of 482) UNSUPPORTED: AddressSanitizer-i386-iossim :: TestCases/Posix/tsd_dtor_leak.cpp (183 of 482) UNSUPPORTED: AddressSanitizer-i386-iossim :: TestCases/Posix/wait.cpp (184 of 482) UNSUPPORTED: AddressSanitizer-i386-iossim :: TestCases/Posix/wait3.cpp (185 of 482) UNSUPPORTED: AddressSanitizer-i386-iossim :: TestCases/Posix/wait4.cpp (186 of 482) UNSUPPORTED: AddressSanitizer-i386-iossim :: TestCases/Posix/waitid.cpp (187 of 482) UNSUPPORTED: AddressSanitizer-i386-iossim :: TestCases/Posix/wcrtomb.c (188 of 482) UNSUPPORTED: AddressSanitizer-i386-iossim :: TestCases/Windows/aligned_mallocs.cpp (189 of 482) UNSUPPORTED: AddressSanitizer-i386-iossim :: TestCases/Windows/allocators_sanity.cpp (190 of 482) UNSUPPORTED: AddressSanitizer-i386-iossim :: TestCases/Windows/beginthreadex.cpp (191 of 482) UNSUPPORTED: AddressSanitizer-i386-iossim :: TestCases/Windows/bind_io_completion_callback.cpp (192 of 482) UNSUPPORTED: AddressSanitizer-i386-iossim :: TestCases/Windows/bitfield.cpp (193 of 482) UNSUPPORTED: AddressSanitizer-i386-iossim :: TestCases/Windows/bitfield_uaf.cpp (194 of 482) UNSUPPORTED: AddressSanitizer-i386-iossim :: TestCases/Windows/calloc_left_oob.cpp (195 of 482) UNSUPPORTED: AddressSanitizer-i386-iossim :: TestCases/Windows/calloc_right_oob.cpp (196 of 482) UNSUPPORTED: AddressSanitizer-i386-iossim :: TestCases/Windows/calloc_uaf.cpp (197 of 482) UNSUPPORTED: AddressSanitizer-i386-iossim :: TestCases/Windows/coverage-basic.cpp (198 of 482) UNSUPPORTED: AddressSanitizer-i386-iossim :: TestCases/Windows/coverage-dll-stdio.cpp (199 of 482) UNSUPPORTED: AddressSanitizer-i386-iossim :: TestCases/Windows/crash_read_write.cpp (200 of 482) UNSUPPORTED: AddressSanitizer-i386-iossim :: TestCases/Windows/crt_initializers.cpp (201 of 482) UNSUPPORTED: AddressSanitizer-i386-iossim :: TestCases/Windows/delay_dbghelp.cpp (202 of 482) UNSUPPORTED: AddressSanitizer-i386-iossim :: TestCases/Windows/demangled_names.cpp (203 of 482) UNSUPPORTED: AddressSanitizer-i386-iossim :: TestCases/Windows/dll_aligned_mallocs.cpp (204 of 482) UNSUPPORTED: AddressSanitizer-i386-iossim :: TestCases/Windows/dll_allocators_sanity.cpp (205 of 482) UNSUPPORTED: AddressSanitizer-i386-iossim :: TestCases/Windows/dll_and_lib.cpp (206 of 482) UNSUPPORTED: AddressSanitizer-i386-iossim :: TestCases/Windows/dll_cerr.cpp (207 of 482) UNSUPPORTED: AddressSanitizer-i386-iossim :: TestCases/Windows/dll_control_c.cpp (208 of 482) UNSUPPORTED: AddressSanitizer-i386-iossim :: TestCases/Windows/dll_global_dead_strip.c (209 of 482) UNSUPPORTED: AddressSanitizer-i386-iossim :: TestCases/Windows/dll_heap_allocation.cpp (210 of 482) UNSUPPORTED: AddressSanitizer-i386-iossim :: TestCases/Windows/dll_host.cpp (211 of 482) UNSUPPORTED: AddressSanitizer-i386-iossim :: TestCases/Windows/dll_intercept_memchr.cpp (212 of 482) UNSUPPORTED: AddressSanitizer-i386-iossim :: TestCases/Windows/dll_intercept_memcpy.cpp (213 of 482) UNSUPPORTED: AddressSanitizer-i386-iossim :: TestCases/Windows/dll_intercept_memcpy_indirect.cpp (214 of 482) UNSUPPORTED: AddressSanitizer-i386-iossim :: TestCases/Windows/dll_intercept_memset.cpp (215 of 482) UNSUPPORTED: AddressSanitizer-i386-iossim :: TestCases/Windows/dll_intercept_strlen.cpp (216 of 482) UNSUPPORTED: AddressSanitizer-i386-iossim :: TestCases/Windows/dll_large_function.cpp (217 of 482) UNSUPPORTED: AddressSanitizer-i386-iossim :: TestCases/Windows/dll_malloc_left_oob.cpp (218 of 482) UNSUPPORTED: AddressSanitizer-i386-iossim :: TestCases/Windows/dll_malloc_uaf.cpp (219 of 482) UNSUPPORTED: AddressSanitizer-i386-iossim :: TestCases/Windows/dll_noreturn.cpp (220 of 482) UNSUPPORTED: AddressSanitizer-i386-iossim :: TestCases/Windows/dll_null_deref.cpp (221 of 482) UNSUPPORTED: AddressSanitizer-i386-iossim :: TestCases/Windows/dll_operator_array_new_left_oob.cpp (222 of 482) UNSUPPORTED: AddressSanitizer-i386-iossim :: TestCases/Windows/dll_operator_array_new_with_dtor_left_oob.cpp (223 of 482) UNSUPPORTED: AddressSanitizer-i386-iossim :: TestCases/Windows/dll_poison_unpoison.cpp (224 of 482) UNSUPPORTED: AddressSanitizer-i386-iossim :: TestCases/Windows/dll_report_globals_symbolization_at_startup.cpp (225 of 482) UNSUPPORTED: AddressSanitizer-i386-iossim :: TestCases/Windows/dll_seh.cpp (226 of 482) UNSUPPORTED: AddressSanitizer-i386-iossim :: TestCases/Windows/dll_stack_use_after_return.cpp (227 of 482) UNSUPPORTED: AddressSanitizer-i386-iossim :: TestCases/Windows/dll_thread_stack_array_left_oob.cpp (228 of 482) UNSUPPORTED: AddressSanitizer-i386-iossim :: TestCases/Windows/dll_unload.cpp (229 of 482) UNSUPPORTED: AddressSanitizer-i386-iossim :: TestCases/Windows/double_free.cpp (230 of 482) UNSUPPORTED: AddressSanitizer-i386-iossim :: TestCases/Windows/double_operator_delete.cpp (231 of 482) UNSUPPORTED: AddressSanitizer-i386-iossim :: TestCases/Windows/free_hook_realloc.cpp (232 of 482) UNSUPPORTED: AddressSanitizer-i386-iossim :: TestCases/Windows/fuse-lld-globals.cpp (233 of 482) UNSUPPORTED: AddressSanitizer-i386-iossim :: TestCases/Windows/fuse-lld.cpp (234 of 482) UNSUPPORTED: AddressSanitizer-i386-iossim :: TestCases/Windows/global_const_string.cpp (235 of 482) UNSUPPORTED: AddressSanitizer-i386-iossim :: TestCases/Windows/global_const_string_oob.cpp (236 of 482) UNSUPPORTED: AddressSanitizer-i386-iossim :: TestCases/Windows/global_dead_strip.c (237 of 482) UNSUPPORTED: AddressSanitizer-i386-iossim :: TestCases/Windows/heapalloc.cpp (238 of 482) UNSUPPORTED: AddressSanitizer-i386-iossim :: TestCases/Windows/heapalloc_dll_double_free.cpp (239 of 482) UNSUPPORTED: AddressSanitizer-i386-iossim :: TestCases/Windows/heapalloc_dll_unload_realloc_uaf.cpp (240 of 482) UNSUPPORTED: AddressSanitizer-i386-iossim :: TestCases/Windows/heapalloc_doublefree.cpp (241 of 482) UNSUPPORTED: AddressSanitizer-i386-iossim :: TestCases/Windows/heapalloc_flags_fallback.cpp (242 of 482) UNSUPPORTED: AddressSanitizer-i386-iossim :: TestCases/Windows/heapalloc_huge.cpp (243 of 482) UNSUPPORTED: AddressSanitizer-i386-iossim :: TestCases/Windows/heapalloc_rtl_transfer.cpp (244 of 482) UNSUPPORTED: AddressSanitizer-i386-iossim :: TestCases/Windows/heapalloc_sanity.cpp (245 of 482) UNSUPPORTED: AddressSanitizer-i386-iossim :: TestCases/Windows/heapalloc_transfer.cpp (246 of 482) UNSUPPORTED: AddressSanitizer-i386-iossim :: TestCases/Windows/heapalloc_uaf.cpp (247 of 482) UNSUPPORTED: AddressSanitizer-i386-iossim :: TestCases/Windows/heapalloc_zero_size.cpp (248 of 482) UNSUPPORTED: AddressSanitizer-i386-iossim :: TestCases/Windows/heaprealloc.cpp (249 of 482) UNSUPPORTED: AddressSanitizer-i386-iossim :: TestCases/Windows/heaprealloc_alloc_zero.cpp (250 of 482) UNSUPPORTED: AddressSanitizer-i386-iossim :: TestCases/Windows/heaprealloc_zero_size.cpp (251 of 482) UNSUPPORTED: AddressSanitizer-i386-iossim :: TestCases/Windows/hello_world.cpp (252 of 482) UNSUPPORTED: AddressSanitizer-i386-iossim :: TestCases/Windows/intercept_memcpy.cpp (253 of 482) UNSUPPORTED: AddressSanitizer-i386-iossim :: TestCases/Windows/intercept_strdup.cpp (254 of 482) UNSUPPORTED: AddressSanitizer-i386-iossim :: TestCases/Windows/intercept_strlen.cpp (255 of 482) UNSUPPORTED: AddressSanitizer-i386-iossim :: TestCases/Windows/interface_symbols_windows.cpp (256 of 482) UNSUPPORTED: AddressSanitizer-i386-iossim :: TestCases/Windows/iostream_sbo.cpp (257 of 482) UNSUPPORTED: AddressSanitizer-i386-iossim :: TestCases/Windows/longjmp.cpp (258 of 482) UNSUPPORTED: AddressSanitizer-i386-iossim :: TestCases/Windows/malloc_left_oob.cpp (259 of 482) UNSUPPORTED: AddressSanitizer-i386-iossim :: TestCases/Windows/malloc_right_oob.cpp (260 of 482) UNSUPPORTED: AddressSanitizer-i386-iossim :: TestCases/Windows/malloc_uaf.cpp (261 of 482) UNSUPPORTED: AddressSanitizer-i386-iossim :: TestCases/Windows/null_deref.cpp (262 of 482) UNSUPPORTED: AddressSanitizer-i386-iossim :: TestCases/Windows/null_deref_multiple_dlls.cpp (263 of 482) UNSUPPORTED: AddressSanitizer-i386-iossim :: TestCases/Windows/oom.cpp (264 of 482) UNSUPPORTED: AddressSanitizer-i386-iossim :: TestCases/Windows/operator_array_new_left_oob.cpp (265 of 482) UNSUPPORTED: AddressSanitizer-i386-iossim :: TestCases/Windows/operator_array_new_right_oob.cpp (266 of 482) UNSUPPORTED: AddressSanitizer-i386-iossim :: TestCases/Windows/operator_array_new_uaf.cpp (267 of 482) UNSUPPORTED: AddressSanitizer-i386-iossim :: TestCases/Windows/operator_array_new_with_dtor_left_oob.cpp (268 of 482) UNSUPPORTED: AddressSanitizer-i386-iossim :: TestCases/Windows/operator_delete_wrong_argument.cpp (269 of 482) UNSUPPORTED: AddressSanitizer-i386-iossim :: TestCases/Windows/operator_new_left_oob.cpp (270 of 482) UNSUPPORTED: AddressSanitizer-i386-iossim :: TestCases/Windows/operator_new_right_oob.cpp (271 of 482) UNSUPPORTED: AddressSanitizer-i386-iossim :: TestCases/Windows/operator_new_uaf.cpp (272 of 482) UNSUPPORTED: AddressSanitizer-i386-iossim :: TestCases/Windows/queue_user_work_item.cpp (273 of 482) UNSUPPORTED: AddressSanitizer-i386-iossim :: TestCases/Windows/queue_user_work_item_report.cpp (274 of 482) UNSUPPORTED: AddressSanitizer-i386-iossim :: TestCases/Windows/realloc_left_oob.cpp (275 of 482) UNSUPPORTED: AddressSanitizer-i386-iossim :: TestCases/Windows/realloc_right_oob.cpp (276 of 482) UNSUPPORTED: AddressSanitizer-i386-iossim :: TestCases/Windows/realloc_uaf.cpp (277 of 482) UNSUPPORTED: AddressSanitizer-i386-iossim :: TestCases/Windows/recalloc_sanity.cpp (278 of 482) UNSUPPORTED: AddressSanitizer-i386-iossim :: TestCases/Windows/report_after_syminitialize.cpp (279 of 482) UNSUPPORTED: AddressSanitizer-i386-iossim :: TestCases/Windows/report_globals_reload_dll.cpp (280 of 482) UNSUPPORTED: AddressSanitizer-i386-iossim :: TestCases/Windows/report_globals_vs_freelibrary.cpp (281 of 482) UNSUPPORTED: AddressSanitizer-i386-iossim :: TestCases/Windows/rtlallocateheap.cpp (282 of 482) UNSUPPORTED: AddressSanitizer-i386-iossim :: TestCases/Windows/rtlallocateheap_dll_unload_double_free.cpp (283 of 482) UNSUPPORTED: AddressSanitizer-i386-iossim :: TestCases/Windows/rtlallocateheap_dll_unload_realloc.cpp (284 of 482) UNSUPPORTED: AddressSanitizer-i386-iossim :: TestCases/Windows/rtlallocateheap_flags_fallback.cpp (285 of 482) UNSUPPORTED: AddressSanitizer-i386-iossim :: TestCases/Windows/rtlallocateheap_zero.cpp (286 of 482) UNSUPPORTED: AddressSanitizer-i386-iossim :: TestCases/Windows/seh.cpp (287 of 482) UNSUPPORTED: AddressSanitizer-i386-iossim :: TestCases/Windows/shadow_conflict_32.cpp (288 of 482) UNSUPPORTED: AddressSanitizer-i386-iossim :: TestCases/Windows/shadow_mapping_failure.cpp (289 of 482) UNSUPPORTED: AddressSanitizer-i386-iossim :: TestCases/Windows/stack_array_left_oob.cpp (290 of 482) UNSUPPORTED: AddressSanitizer-i386-iossim :: TestCases/Windows/stack_array_right_oob.cpp (291 of 482) UNSUPPORTED: AddressSanitizer-i386-iossim :: TestCases/Windows/stack_array_sanity.cpp (292 of 482) UNSUPPORTED: AddressSanitizer-i386-iossim :: TestCases/Windows/stack_use_after_return.cpp (293 of 482) UNSUPPORTED: AddressSanitizer-i386-iossim :: TestCases/Windows/symbols_path.cpp (294 of 482) UNSUPPORTED: AddressSanitizer-i386-iossim :: TestCases/Windows/thread_simple.cpp (295 of 482) UNSUPPORTED: AddressSanitizer-i386-iossim :: TestCases/Windows/thread_stack_array_left_oob.cpp (296 of 482) UNSUPPORTED: AddressSanitizer-i386-iossim :: TestCases/Windows/thread_stack_array_right_oob.cpp (297 of 482) UNSUPPORTED: AddressSanitizer-i386-iossim :: TestCases/Windows/thread_stack_reuse.cpp (298 of 482) UNSUPPORTED: AddressSanitizer-i386-iossim :: TestCases/Windows/thread_stress.cpp (299 of 482) UNSUPPORTED: AddressSanitizer-i386-iossim :: TestCases/Windows/thread_suspended.cpp (300 of 482) UNSUPPORTED: AddressSanitizer-i386-iossim :: TestCases/Windows/tls_init.cpp (301 of 482) UNSUPPORTED: AddressSanitizer-i386-iossim :: TestCases/Windows/unsymbolized.cpp (302 of 482) UNSUPPORTED: AddressSanitizer-i386-iossim :: TestCases/Windows/use_after_realloc.cpp (303 of 482) UNSUPPORTED: AddressSanitizer-i386-iossim :: TestCases/Windows/use_after_return_linkage.cpp (304 of 482) UNSUPPORTED: AddressSanitizer-i386-iossim :: TestCases/Windows/user-exception.cpp (305 of 482) UNSUPPORTED: AddressSanitizer-i386-iossim :: TestCases/Windows/windows_h.cpp (306 of 482) UNSUPPORTED: AddressSanitizer-i386-iossim :: TestCases/Windows/wrong_downcast_on_heap.cpp (307 of 482) UNSUPPORTED: AddressSanitizer-i386-iossim :: TestCases/Windows/wrong_downcast_on_stack.cpp (308 of 482) UNSUPPORTED: AddressSanitizer-i386-iossim :: TestCases/alloca_big_alignment.cpp (309 of 482) UNSUPPORTED: AddressSanitizer-i386-iossim :: TestCases/alloca_constant_size.cpp (310 of 482) UNSUPPORTED: AddressSanitizer-i386-iossim :: TestCases/alloca_detect_custom_size_.cpp (311 of 482) UNSUPPORTED: AddressSanitizer-i386-iossim :: TestCases/alloca_instruments_all_paddings.cpp (312 of 482) UNSUPPORTED: AddressSanitizer-i386-iossim :: TestCases/alloca_loop_unpoisoning.cpp (313 of 482) UNSUPPORTED: AddressSanitizer-i386-iossim :: TestCases/alloca_overflow_partial.cpp (314 of 482) UNSUPPORTED: AddressSanitizer-i386-iossim :: TestCases/alloca_overflow_right.cpp (315 of 482) UNSUPPORTED: AddressSanitizer-i386-iossim :: TestCases/alloca_safe_access.cpp (316 of 482) UNSUPPORTED: AddressSanitizer-i386-iossim :: TestCases/alloca_underflow_left.cpp (317 of 482) UNSUPPORTED: AddressSanitizer-i386-iossim :: TestCases/alloca_vla_interact.cpp (318 of 482) UNSUPPORTED: AddressSanitizer-i386-iossim :: TestCases/asan_and_llvm_coverage_test.cpp (319 of 482) UNSUPPORTED: AddressSanitizer-i386-iossim :: TestCases/asan_options-help.cpp (320 of 482) UNSUPPORTED: AddressSanitizer-i386-iossim :: TestCases/asan_update_allocation.cpp (321 of 482) UNSUPPORTED: AddressSanitizer-i386-iossim :: TestCases/atexit_stats.cpp (322 of 482) UNSUPPORTED: AddressSanitizer-i386-iossim :: TestCases/atoi_strict.c (323 of 482) UNSUPPORTED: AddressSanitizer-i386-iossim :: TestCases/atol_strict.c (324 of 482) UNSUPPORTED: AddressSanitizer-i386-iossim :: TestCases/atoll_strict.c (325 of 482) UNSUPPORTED: AddressSanitizer-i386-iossim :: TestCases/blacklist.cpp (326 of 482) UNSUPPORTED: AddressSanitizer-i386-iossim :: TestCases/calloc-overflow.cpp (327 of 482) UNSUPPORTED: AddressSanitizer-i386-iossim :: TestCases/contiguous_container.cpp (328 of 482) UNSUPPORTED: AddressSanitizer-i386-iossim :: TestCases/contiguous_container_crash.cpp (329 of 482) UNSUPPORTED: AddressSanitizer-i386-iossim :: TestCases/coverage-and-lsan.cpp (330 of 482) UNSUPPORTED: AddressSanitizer-i386-iossim :: TestCases/coverage-disabled.cpp (331 of 482) UNSUPPORTED: AddressSanitizer-i386-iossim :: TestCases/coverage-trace-pc.cpp (332 of 482) UNSUPPORTED: AddressSanitizer-i386-iossim :: TestCases/debug_double_free.cpp (333 of 482) UNSUPPORTED: AddressSanitizer-i386-iossim :: TestCases/debug_locate.cpp (334 of 482) UNSUPPORTED: AddressSanitizer-i386-iossim :: TestCases/debug_mapping.cpp (335 of 482) UNSUPPORTED: AddressSanitizer-i386-iossim :: TestCases/debug_ppc64_mapping.cpp (336 of 482) UNSUPPORTED: AddressSanitizer-i386-iossim :: TestCases/debug_report.cpp (337 of 482) UNSUPPORTED: AddressSanitizer-i386-iossim :: TestCases/debug_stacks.cpp (338 of 482) UNSUPPORTED: AddressSanitizer-i386-iossim :: TestCases/deep_stack_uaf.cpp (339 of 482) UNSUPPORTED: AddressSanitizer-i386-iossim :: TestCases/deep_tail_call.cpp (340 of 482) UNSUPPORTED: AddressSanitizer-i386-iossim :: TestCases/default_blacklist.cpp (341 of 482) UNSUPPORTED: AddressSanitizer-i386-iossim :: TestCases/default_options.cpp (342 of 482) UNSUPPORTED: AddressSanitizer-i386-iossim :: TestCases/describe_address.cpp (343 of 482) UNSUPPORTED: AddressSanitizer-i386-iossim :: TestCases/double-free.cpp (344 of 482) UNSUPPORTED: AddressSanitizer-i386-iossim :: TestCases/error_report_callback.cpp (345 of 482) UNSUPPORTED: AddressSanitizer-i386-iossim :: TestCases/exitcode.cpp (346 of 482) UNSUPPORTED: AddressSanitizer-i386-iossim :: TestCases/force_inline_opt0.cpp (347 of 482) UNSUPPORTED: AddressSanitizer-i386-iossim :: TestCases/frexp_interceptor.cpp (348 of 482) UNSUPPORTED: AddressSanitizer-i386-iossim :: TestCases/global-address.cpp (349 of 482) UNSUPPORTED: AddressSanitizer-i386-iossim :: TestCases/global-demangle.cpp (350 of 482) UNSUPPORTED: AddressSanitizer-i386-iossim :: TestCases/global-location.cpp (351 of 482) UNSUPPORTED: AddressSanitizer-i386-iossim :: TestCases/global-overflow.cpp (352 of 482) UNSUPPORTED: AddressSanitizer-i386-iossim :: TestCases/global-underflow.cpp (353 of 482) UNSUPPORTED: AddressSanitizer-i386-iossim :: TestCases/halt_on_error-1.c (354 of 482) UNSUPPORTED: AddressSanitizer-i386-iossim :: TestCases/handle_noreturn_bug.cpp (355 of 482) UNSUPPORTED: AddressSanitizer-i386-iossim :: TestCases/heap-overflow-large.cpp (356 of 482) UNSUPPORTED: AddressSanitizer-i386-iossim :: TestCases/heap-overflow.cpp (357 of 482) UNSUPPORTED: AddressSanitizer-i386-iossim :: TestCases/heavy_uar_test.cpp (358 of 482) UNSUPPORTED: AddressSanitizer-i386-iossim :: TestCases/huge_negative_hea_oob.cpp (359 of 482) UNSUPPORTED: AddressSanitizer-i386-iossim :: TestCases/ill.cpp (360 of 482) UNSUPPORTED: AddressSanitizer-i386-iossim :: TestCases/init-order-atexit.cpp (361 of 482) UNSUPPORTED: AddressSanitizer-i386-iossim :: TestCases/initialization-blacklist.cpp (362 of 482) UNSUPPORTED: AddressSanitizer-i386-iossim :: TestCases/initialization-bug.cpp (363 of 482) UNSUPPORTED: AddressSanitizer-i386-iossim :: TestCases/initialization-constexpr.cpp (364 of 482) UNSUPPORTED: AddressSanitizer-i386-iossim :: TestCases/initialization-nobug.cpp (365 of 482) UNSUPPORTED: AddressSanitizer-i386-iossim :: TestCases/inline.cpp (366 of 482) UNSUPPORTED: AddressSanitizer-i386-iossim :: TestCases/intercept-rethrow-exception.cpp (367 of 482) UNSUPPORTED: AddressSanitizer-i386-iossim :: TestCases/interception_failure_test.cpp (368 of 482) UNSUPPORTED: AddressSanitizer-i386-iossim :: TestCases/interface_test.cpp (369 of 482) UNSUPPORTED: AddressSanitizer-i386-iossim :: TestCases/intra-object-overflow.cpp (370 of 482) UNSUPPORTED: AddressSanitizer-i386-iossim :: TestCases/invalid-free.cpp (371 of 482) UNSUPPORTED: AddressSanitizer-i386-iossim :: TestCases/invalid-pointer-pairs-compare-errors.cpp (372 of 482) UNSUPPORTED: AddressSanitizer-i386-iossim :: TestCases/invalid-pointer-pairs-compare-null.cpp (373 of 482) UNSUPPORTED: AddressSanitizer-i386-iossim :: TestCases/invalid-pointer-pairs-compare-success.cpp (374 of 482) UNSUPPORTED: AddressSanitizer-i386-iossim :: TestCases/invalid-pointer-pairs-subtract-errors.cpp (375 of 482) UNSUPPORTED: AddressSanitizer-i386-iossim :: TestCases/invalid-pointer-pairs-subtract-success.cpp (376 of 482) UNSUPPORTED: AddressSanitizer-i386-iossim :: TestCases/invalid-pointer-pairs.cpp (377 of 482) UNSUPPORTED: AddressSanitizer-i386-iossim :: TestCases/large_func_test.cpp (378 of 482) UNSUPPORTED: AddressSanitizer-i386-iossim :: TestCases/log-path_test.cpp (379 of 482) UNSUPPORTED: AddressSanitizer-i386-iossim :: TestCases/longjmp.cpp (380 of 482) UNSUPPORTED: AddressSanitizer-i386-iossim :: TestCases/lsan_annotations.cpp (381 of 482) UNSUPPORTED: AddressSanitizer-i386-iossim :: TestCases/malloc-no-intercept.c (382 of 482) UNSUPPORTED: AddressSanitizer-i386-iossim :: TestCases/malloc-size-too-big.cpp (383 of 482) UNSUPPORTED: AddressSanitizer-i386-iossim :: TestCases/malloc_context_size.cpp (384 of 482) UNSUPPORTED: AddressSanitizer-i386-iossim :: TestCases/malloc_fill.cpp (385 of 482) UNSUPPORTED: AddressSanitizer-i386-iossim :: TestCases/max_redzone.cpp (386 of 482) UNSUPPORTED: AddressSanitizer-i386-iossim :: TestCases/memcmp_strict_test.cpp (387 of 482) UNSUPPORTED: AddressSanitizer-i386-iossim :: TestCases/memcmp_test.cpp (388 of 482) UNSUPPORTED: AddressSanitizer-i386-iossim :: TestCases/memset_test.cpp (389 of 482) UNSUPPORTED: AddressSanitizer-i386-iossim :: TestCases/non-executable-pc.cpp (390 of 482) UNSUPPORTED: AddressSanitizer-i386-iossim :: TestCases/null_deref.cpp (391 of 482) UNSUPPORTED: AddressSanitizer-i386-iossim :: TestCases/on_error_callback.cpp (392 of 482) UNSUPPORTED: AddressSanitizer-i386-iossim :: TestCases/partial_right.cpp (393 of 482) UNSUPPORTED: AddressSanitizer-i386-iossim :: TestCases/pass-object-byval.cpp (394 of 482) UNSUPPORTED: AddressSanitizer-i386-iossim :: TestCases/pass-struct-byval-uar.cpp (395 of 482) UNSUPPORTED: AddressSanitizer-i386-iossim :: TestCases/pass-struct-byval.cpp (396 of 482) UNSUPPORTED: AddressSanitizer-i386-iossim :: TestCases/poison_partial.cpp (397 of 482) UNSUPPORTED: AddressSanitizer-i386-iossim :: TestCases/pr33372.cpp (398 of 482) UNSUPPORTED: AddressSanitizer-i386-iossim :: TestCases/print_summary.cpp (399 of 482) UNSUPPORTED: AddressSanitizer-i386-iossim :: TestCases/printf-1.c (400 of 482) UNSUPPORTED: AddressSanitizer-i386-iossim :: TestCases/printf-2.c (401 of 482) UNSUPPORTED: AddressSanitizer-i386-iossim :: TestCases/printf-3.c (402 of 482) UNSUPPORTED: AddressSanitizer-i386-iossim :: TestCases/printf-4.c (403 of 482) UNSUPPORTED: AddressSanitizer-i386-iossim :: TestCases/printf-5.c (404 of 482) UNSUPPORTED: AddressSanitizer-i386-iossim :: TestCases/printf-m.c (405 of 482) UNSUPPORTED: AddressSanitizer-i386-iossim :: TestCases/realloc.cpp (406 of 482) UNSUPPORTED: AddressSanitizer-i386-iossim :: TestCases/sanity_check_pure_c.c (407 of 482) UNSUPPORTED: AddressSanitizer-i386-iossim :: TestCases/scariness_score_test.cpp (408 of 482) UNSUPPORTED: AddressSanitizer-i386-iossim :: TestCases/set_shadow_test.c (409 of 482) UNSUPPORTED: AddressSanitizer-i386-iossim :: TestCases/sleep_after_init.c (410 of 482) UNSUPPORTED: AddressSanitizer-i386-iossim :: TestCases/sleep_before_dying.c (411 of 482) UNSUPPORTED: AddressSanitizer-i386-iossim :: TestCases/small_memcpy_test.cpp (412 of 482) UNSUPPORTED: AddressSanitizer-i386-iossim :: TestCases/speculative_load.cpp (413 of 482) UNSUPPORTED: AddressSanitizer-i386-iossim :: TestCases/speculative_load2.cpp (414 of 482) UNSUPPORTED: AddressSanitizer-i386-iossim :: TestCases/stack-buffer-overflow-with-position.cpp (415 of 482) UNSUPPORTED: AddressSanitizer-i386-iossim :: TestCases/stack-buffer-overflow.cpp (416 of 482) UNSUPPORTED: AddressSanitizer-i386-iossim :: TestCases/stack-frame-demangle.cpp (417 of 482) UNSUPPORTED: AddressSanitizer-i386-iossim :: TestCases/stack-oob-frames.cpp (418 of 482) UNSUPPORTED: AddressSanitizer-i386-iossim :: TestCases/strcasestr-1.c (419 of 482) UNSUPPORTED: AddressSanitizer-i386-iossim :: TestCases/strcasestr-2.c (420 of 482) UNSUPPORTED: AddressSanitizer-i386-iossim :: TestCases/strcasestr_strict.c (421 of 482) UNSUPPORTED: AddressSanitizer-i386-iossim :: TestCases/strcat-overlap.cpp (422 of 482) UNSUPPORTED: AddressSanitizer-i386-iossim :: TestCases/strcat_strict.c (423 of 482) UNSUPPORTED: AddressSanitizer-i386-iossim :: TestCases/strchr_strict.c (424 of 482) UNSUPPORTED: AddressSanitizer-i386-iossim :: TestCases/strcmp_strict.c (425 of 482) UNSUPPORTED: AddressSanitizer-i386-iossim :: TestCases/strcpy-overlap.cpp (426 of 482) UNSUPPORTED: AddressSanitizer-i386-iossim :: TestCases/strcspn-1.c (427 of 482) UNSUPPORTED: AddressSanitizer-i386-iossim :: TestCases/strcspn-2.c (428 of 482) UNSUPPORTED: AddressSanitizer-i386-iossim :: TestCases/strcspn_strict.c (429 of 482) UNSUPPORTED: AddressSanitizer-i386-iossim :: TestCases/strdup_oob_test.cpp (430 of 482) UNSUPPORTED: AddressSanitizer-i386-iossim :: TestCases/strip_path_prefix.c (431 of 482) UNSUPPORTED: AddressSanitizer-i386-iossim :: TestCases/strncasecmp_strict.c (432 of 482) UNSUPPORTED: AddressSanitizer-i386-iossim :: TestCases/strncat-overlap.cpp (433 of 482) UNSUPPORTED: AddressSanitizer-i386-iossim :: TestCases/strncat_strict.c (434 of 482) UNSUPPORTED: AddressSanitizer-i386-iossim :: TestCases/strncmp_strict.c (435 of 482) UNSUPPORTED: AddressSanitizer-i386-iossim :: TestCases/strncpy-overflow.cpp (436 of 482) UNSUPPORTED: AddressSanitizer-i386-iossim :: TestCases/strncpy-overlap.cpp (437 of 482) UNSUPPORTED: AddressSanitizer-i386-iossim :: TestCases/strpbrk-1.c (438 of 482) UNSUPPORTED: AddressSanitizer-i386-iossim :: TestCases/strpbrk-2.c (439 of 482) UNSUPPORTED: AddressSanitizer-i386-iossim :: TestCases/strpbrk_strict.c (440 of 482) UNSUPPORTED: AddressSanitizer-i386-iossim :: TestCases/strspn-1.c (441 of 482) UNSUPPORTED: AddressSanitizer-i386-iossim :: TestCases/strspn-2.c (442 of 482) UNSUPPORTED: AddressSanitizer-i386-iossim :: TestCases/strspn_strict.c (443 of 482) UNSUPPORTED: AddressSanitizer-i386-iossim :: TestCases/strstr-1.c (444 of 482) UNSUPPORTED: AddressSanitizer-i386-iossim :: TestCases/strstr-2.c (445 of 482) UNSUPPORTED: AddressSanitizer-i386-iossim :: TestCases/strstr_strict.c (446 of 482) UNSUPPORTED: AddressSanitizer-i386-iossim :: TestCases/strtok.c (447 of 482) UNSUPPORTED: AddressSanitizer-i386-iossim :: TestCases/strtol_strict.c (448 of 482) UNSUPPORTED: AddressSanitizer-i386-iossim :: TestCases/strtoll_strict.c (449 of 482) UNSUPPORTED: AddressSanitizer-i386-iossim :: TestCases/suppressions-exec-relative-location.cpp (450 of 482) UNSUPPORTED: AddressSanitizer-i386-iossim :: TestCases/suppressions-function.cpp (451 of 482) UNSUPPORTED: AddressSanitizer-i386-iossim :: TestCases/suppressions-interceptor.cpp (452 of 482) UNSUPPORTED: AddressSanitizer-i386-iossim :: TestCases/suppressions-library.cpp (453 of 482) UNSUPPORTED: AddressSanitizer-i386-iossim :: TestCases/throw_call_test.cpp (454 of 482) UNSUPPORTED: AddressSanitizer-i386-iossim :: TestCases/throw_catch.cpp (455 of 482) UNSUPPORTED: AddressSanitizer-i386-iossim :: TestCases/throw_invoke_test.cpp (456 of 482) UNSUPPORTED: AddressSanitizer-i386-iossim :: TestCases/time_interceptor.cpp (457 of 482) UNSUPPORTED: AddressSanitizer-i386-iossim :: TestCases/uar_and_exceptions.cpp (458 of 482) UNSUPPORTED: AddressSanitizer-i386-iossim :: TestCases/unaligned_loads_and_stores.cpp (459 of 482) UNSUPPORTED: AddressSanitizer-i386-iossim :: TestCases/use-after-delete.cpp (460 of 482) UNSUPPORTED: AddressSanitizer-i386-iossim :: TestCases/use-after-free-right.cpp (461 of 482) UNSUPPORTED: AddressSanitizer-i386-iossim :: TestCases/use-after-free.cpp (462 of 482) UNSUPPORTED: AddressSanitizer-i386-iossim :: TestCases/use-after-poison.cpp (463 of 482) UNSUPPORTED: AddressSanitizer-i386-iossim :: TestCases/use-after-scope-capture.cpp (464 of 482) UNSUPPORTED: AddressSanitizer-i386-iossim :: TestCases/use-after-scope-conversion.cpp (465 of 482) UNSUPPORTED: AddressSanitizer-i386-iossim :: TestCases/use-after-scope-dtor-order.cpp (466 of 482) UNSUPPORTED: AddressSanitizer-i386-iossim :: TestCases/use-after-scope-goto.cpp (467 of 482) UNSUPPORTED: AddressSanitizer-i386-iossim :: TestCases/use-after-scope-if.cpp (468 of 482) UNSUPPORTED: AddressSanitizer-i386-iossim :: TestCases/use-after-scope-inlined.cpp (469 of 482) UNSUPPORTED: AddressSanitizer-i386-iossim :: TestCases/use-after-scope-loop-bug.cpp (470 of 482) UNSUPPORTED: AddressSanitizer-i386-iossim :: TestCases/use-after-scope-loop-removed.cpp (471 of 482) UNSUPPORTED: AddressSanitizer-i386-iossim :: TestCases/use-after-scope-loop.cpp (472 of 482) UNSUPPORTED: AddressSanitizer-i386-iossim :: TestCases/use-after-scope-nobug.cpp (473 of 482) UNSUPPORTED: AddressSanitizer-i386-iossim :: TestCases/use-after-scope-temp.cpp (474 of 482) UNSUPPORTED: AddressSanitizer-i386-iossim :: TestCases/use-after-scope-temp2.cpp (475 of 482) UNSUPPORTED: AddressSanitizer-i386-iossim :: TestCases/use-after-scope-types.cpp (476 of 482) UNSUPPORTED: AddressSanitizer-i386-iossim :: TestCases/use-after-scope.cpp (477 of 482) UNSUPPORTED: AddressSanitizer-i386-iossim :: TestCases/verbose-log-path_test.cpp (478 of 482) UNSUPPORTED: AddressSanitizer-i386-iossim :: TestCases/vla_chrome_testcase.cpp (479 of 482) UNSUPPORTED: AddressSanitizer-i386-iossim :: TestCases/vla_condition_overflow.cpp (480 of 482) UNSUPPORTED: AddressSanitizer-i386-iossim :: TestCases/vla_loop_overfow.cpp (481 of 482) UNSUPPORTED: AddressSanitizer-i386-iossim :: TestCases/zero_page_pc.cpp (482 of 482)

Hide Details

Testing Time: 0.38s Unsupported Tests : 482 + ./bin/llvm-lit -v --xunit-xml-output=tsan-IOSSimX86_64Config.xunit.xml ./tools/clang/runtime/compiler-rt-bins/test/tsan/IOSSimX86_64Config/ llvm-lit: /Users/buildslave/jenkins/workspace/clang-stage1-cmake-RA-expensive/llvm-project/llvm/utils/lit/lit/util.py:410: note: using SDKROOT: u'/Applications/Xcode.app/Contents/Developer/Platforms/MacOSX.platform/Developer/SDKs/MacOSX10.13.sdk' llvm-lit: /Users/buildslave/jenkins/workspace/clang-stage1-cmake-RA-expensive/llvm-project/compiler-rt/test/lit.common.cfg.py:427: warning: Throttling sanitizer tests that require shadow memory on Darwin 64bit {"env": {}} -- Testing: 322 tests, 8 workers -- XFAIL: ThreadSanitizer-x86_64-iossim :: Darwin/dlopen.cpp (1 of 322) PASS: ThreadSanitizer-x86_64-iossim :: Darwin/deadlock.mm (2 of 322) PASS: ThreadSanitizer-x86_64-iossim :: Darwin/debug_external.cpp (3 of 322) PASS: ThreadSanitizer-x86_64-iossim :: Darwin/external-lib.cpp (4 of 322) PASS: ThreadSanitizer-x86_64-iossim :: Darwin/external-noninstrumented-module.cpp (5 of 322) PASS: ThreadSanitizer-x86_64-iossim :: Darwin/external-dups.cpp (6 of 322) PASS: ThreadSanitizer-x86_64-iossim :: Darwin/external-swift-debugging.cpp (7 of 322) PASS: ThreadSanitizer-x86_64-iossim :: Darwin/external-ignore-noninstrumented.cpp (8 of 322) PASS: ThreadSanitizer-x86_64-iossim :: Darwin/external-swift.cpp (9 of 322) PASS: ThreadSanitizer-x86_64-iossim :: Darwin/gcd-sync-block-copy.mm (10 of 322) PASS: ThreadSanitizer-x86_64-iossim :: Darwin/ignore-noninstrumented.mm (11 of 322) PASS: ThreadSanitizer-x86_64-iossim :: Darwin/libcxx-call-once.mm (12 of 322) PASS: ThreadSanitizer-x86_64-iossim :: Darwin/libcxx-future.mm (13 of 322) PASS: ThreadSanitizer-x86_64-iossim :: Darwin/external.cpp (14 of 322) PASS: ThreadSanitizer-x86_64-iossim :: Darwin/libcxx-shared-ptr-recursive.mm (15 of 322) FAIL: ThreadSanitizer-x86_64-iossim :: Darwin/mach_vm_allocate.c (16 of 322) ******************** TEST 'ThreadSanitizer-x86_64-iossim :: Darwin/mach_vm_allocate.c' FAILED ******************** Script: -- : 'RUN: at line 3'; /Users/buildslave/jenkins/workspace/clang-stage1-cmake-RA-expensive/llvm-project/compiler-rt/test/sanitizer_common/ios_commands/iossim_compile.py /Users/buildslave/jenkins/workspace/clang-stage1-cmake-RA-expensive/clang-build/./bin/clang -fsanitize=thread -Wall -arch x86_64 -stdlib=libc++ -miphoneos-version-min=9.0 -isysroot /Applications/Xcode.app/Contents/Developer/Platforms/iPhoneSimulator.platform/Developer/SDKs/iPhoneSimulator11.4.sdk -gline-tables-only -I/Users/buildslave/jenkins/workspace/clang-stage1-cmake-RA-expensive/llvm-project/compiler-rt/test/tsan/../ /Users/buildslave/jenkins/workspace/clang-stage1-cmake-RA-expensive/llvm-project/compiler-rt/test/tsan/Darwin/mach_vm_allocate.c -o /Users/buildslave/jenkins/workspace/clang-stage1-cmake-RA-expensive/clang-build/tools/clang/runtime/compiler-rt-bins/test/tsan/IOSSimX86_64Config/Darwin/Output/mach_vm_allocate.c.tmp : 'RUN: at line 4'; /Users/buildslave/jenkins/workspace/clang-stage1-cmake-RA-expensive/llvm-project/compiler-rt/test/sanitizer_common/ios_commands/iossim_run.py /Users/buildslave/jenkins/workspace/clang-stage1-cmake-RA-expensive/clang-build/tools/clang/runtime/compiler-rt-bins/test/tsan/IOSSimX86_64Config/Darwin/Output/mach_vm_allocate.c.tmp 2>&1 | FileCheck /Users/buildslave/jenkins/workspace/clang-stage1-cmake-RA-expensive/llvm-project/compiler-rt/test/tsan/Darwin/mach_vm_allocate.c --implicit-check-not='ThreadSanitizer' -- Exit Code: 1

Hide Details

Command Output (stderr): -- In file included from /Users/buildslave/jenkins/workspace/clang-stage1-cmake-RA-expensive/llvm-project/compiler-rt/test/tsan/Darwin/mach_vm_allocate.c:7: /Applications/Xcode.app/Contents/Developer/Platforms/iPhoneSimulator.platform/Developer/SDKs/iPhoneSimulator11.4.sdk/usr/include/mach/mach_vm.h:1:2: error: mach_vm.h unsupported. #error mach_vm.h unsupported. ^ /Users/buildslave/jenkins/workspace/clang-stage1-cmake-RA-expensive/llvm-project/compiler-rt/test/tsan/Darwin/mach_vm_allocate.c:21:7: error: implicit declaration of function 'mach_vm_allocate' is invalid in C99 [-Werror,-Wimplicit-function-declaration] mach_vm_allocate(mach_task_self(), &addr, alloc_size, VM_FLAGS_ANYWHERE); ^ /Users/buildslave/jenkins/workspace/clang-stage1-cmake-RA-expensive/llvm-project/compiler-rt/test/tsan/Darwin/mach_vm_allocate.c:21:7: note: did you mean 'mach_port_allocate'? /Applications/Xcode.app/Contents/Developer/Platforms/iPhoneSimulator.platform/Developer/SDKs/iPhoneSimulator11.4.sdk/usr/include/mach/mach_port.h:131:15: note: 'mach_port_allocate' declared here kern_return_t mach_port_allocate ^ /Users/buildslave/jenkins/workspace/clang-stage1-cmake-RA-expensive/llvm-project/compiler-rt/test/tsan/Darwin/mach_vm_allocate.c:30:7: error: implicit declaration of function 'mach_vm_allocate' is invalid in C99 [-Werror,-Wimplicit-function-declaration] mach_vm_allocate(mach_task_self(), &addr, alloc_size, VM_FLAGS_FIXED); ^ /Users/buildslave/jenkins/workspace/clang-stage1-cmake-RA-expensive/llvm-project/compiler-rt/test/tsan/Darwin/mach_vm_allocate.c:36:7: error: implicit declaration of function 'mach_vm_deallocate' is invalid in C99 [-Werror,-Wimplicit-function-declaration] mach_vm_deallocate(mach_task_self(), (mach_vm_address_t)ptr, alloc_size); ^ /Users/buildslave/jenkins/workspace/clang-stage1-cmake-RA-expensive/llvm-project/compiler-rt/test/tsan/Darwin/mach_vm_allocate.c:36:7: note: did you mean 'mach_port_deallocate'? /Applications/Xcode.app/Contents/Developer/Platforms/iPhoneSimulator.platform/Developer/SDKs/iPhoneSimulator11.4.sdk/usr/include/mach/mach_port.h:156:15: note: 'mach_port_deallocate' declared here kern_return_t mach_port_deallocate ^ 4 errors generated.

Hide Details

--

Hide Details

******************** PASS: ThreadSanitizer-x86_64-iossim :: Darwin/main_tid.mm (17 of 322) PASS: ThreadSanitizer-x86_64-iossim :: Darwin/libcxx-shared-ptr.mm (18 of 322) PASS: ThreadSanitizer-x86_64-iossim :: Darwin/libcxx-shared-ptr-stress.mm (19 of 322) PASS: ThreadSanitizer-x86_64-iossim :: Darwin/malloc-stack-logging.cpp (20 of 322) PASS: ThreadSanitizer-x86_64-iossim :: Darwin/malloc_size.mm (21 of 322) PASS: ThreadSanitizer-x86_64-iossim :: Darwin/norace-objcxx-run-time.mm (22 of 322) PASS: ThreadSanitizer-x86_64-iossim :: Darwin/objc-race.mm (23 of 322) PASS: ThreadSanitizer-x86_64-iossim :: Darwin/objc-simple.mm (24 of 322) PASS: ThreadSanitizer-x86_64-iossim :: Darwin/objc-synchronize-cycle-tagged.mm (25 of 322) PASS: ThreadSanitizer-x86_64-iossim :: Darwin/objc-synchronize-cycle.mm (26 of 322) PASS: ThreadSanitizer-x86_64-iossim :: Darwin/objc-synchronize-nested-recursive.mm (27 of 322) PASS: ThreadSanitizer-x86_64-iossim :: Darwin/objc-double-property.mm (28 of 322) UNSUPPORTED: ThreadSanitizer-x86_64-iossim :: Darwin/os_unfair_lock.c (29 of 322) PASS: ThreadSanitizer-x86_64-iossim :: Darwin/objc-synchronize-tagged.mm (30 of 322) PASS: ThreadSanitizer-x86_64-iossim :: Darwin/objc-synchronize.mm (31 of 322) PASS: ThreadSanitizer-x86_64-iossim :: Darwin/osatomics-bitops.mm (32 of 322) PASS: ThreadSanitizer-x86_64-iossim :: Darwin/osatomics-add.mm (33 of 322) PASS: ThreadSanitizer-x86_64-iossim :: Darwin/osspinlock-norace.cpp (34 of 322) PASS: ThreadSanitizer-x86_64-iossim :: Darwin/realloc-zero.cpp (35 of 322) PASS: ThreadSanitizer-x86_64-iossim :: Darwin/osatomics-list.mm (36 of 322) PASS: ThreadSanitizer-x86_64-iossim :: Darwin/signals-blocked.cpp (37 of 322) PASS: ThreadSanitizer-x86_64-iossim :: Darwin/symbolizer-atos.cpp (38 of 322) UNSUPPORTED: ThreadSanitizer-x86_64-iossim :: Darwin/xpc-cancel.mm (39 of 322) UNSUPPORTED: ThreadSanitizer-x86_64-iossim :: Darwin/xpc-race.mm (40 of 322) UNSUPPORTED: ThreadSanitizer-x86_64-iossim :: Darwin/xpc.mm (41 of 322) UNSUPPORTED: ThreadSanitizer-x86_64-iossim :: Linux/check_memcpy.c (42 of 322) UNSUPPORTED: ThreadSanitizer-x86_64-iossim :: Linux/check_preinit.cpp (43 of 322) UNSUPPORTED: ThreadSanitizer-x86_64-iossim :: Linux/double_race.cpp (44 of 322) UNSUPPORTED: ThreadSanitizer-x86_64-iossim :: Linux/mutex_robust.cpp (45 of 322) UNSUPPORTED: ThreadSanitizer-x86_64-iossim :: Linux/mutex_robust2.cpp (46 of 322) UNSUPPORTED: ThreadSanitizer-x86_64-iossim :: Linux/pie_no_aslr.cpp (47 of 322) UNSUPPORTED: ThreadSanitizer-x86_64-iossim :: Linux/thread_timedjoin.c (48 of 322) UNSUPPORTED: ThreadSanitizer-x86_64-iossim :: Linux/thread_tryjoin.c (49 of 322) UNSUPPORTED: ThreadSanitizer-x86_64-iossim :: Linux/user_fopen.cpp (50 of 322) UNSUPPORTED: ThreadSanitizer-x86_64-iossim :: Linux/user_malloc.cpp (51 of 322) PASS: ThreadSanitizer-x86_64-iossim :: Darwin/symbolizer-dladdr.cpp (52 of 322) PASS: ThreadSanitizer-x86_64-iossim :: aligned_vs_unaligned_race.cpp (53 of 322) PASS: ThreadSanitizer-x86_64-iossim :: annotate_happens_before.cpp (54 of 322) PASS: ThreadSanitizer-x86_64-iossim :: Darwin/workerthreads.mm (55 of 322) PASS: ThreadSanitizer-x86_64-iossim :: atexit.cpp (56 of 322) PASS: ThreadSanitizer-x86_64-iossim :: atexit2.cpp (57 of 322) PASS: ThreadSanitizer-x86_64-iossim :: atexit3.cpp (58 of 322) PASS: ThreadSanitizer-x86_64-iossim :: atomic_free2.cpp (59 of 322) PASS: ThreadSanitizer-x86_64-iossim :: atomic_free3.cpp (60 of 322) PASS: ThreadSanitizer-x86_64-iossim :: atomic_hle.cpp (61 of 322) PASS: ThreadSanitizer-x86_64-iossim :: atomic_norace.cpp (62 of 322) PASS: ThreadSanitizer-x86_64-iossim :: atomic_race.cpp (63 of 322) PASS: ThreadSanitizer-x86_64-iossim :: atomic_stack.cpp (64 of 322) UNSUPPORTED: ThreadSanitizer-x86_64-iossim :: barrier.cpp (65 of 322) UNSUPPORTED: ThreadSanitizer-x86_64-iossim :: bench_acquire_only.cpp (66 of 322) UNSUPPORTED: ThreadSanitizer-x86_64-iossim :: bench_acquire_release.cpp (67 of 322) UNSUPPORTED: ThreadSanitizer-x86_64-iossim :: bench_local_mutex.cpp (68 of 322) UNSUPPORTED: ThreadSanitizer-x86_64-iossim :: bench_mutex.cpp (69 of 322) UNSUPPORTED: ThreadSanitizer-x86_64-iossim :: bench_release_only.cpp (70 of 322) UNSUPPORTED: ThreadSanitizer-x86_64-iossim :: bench_rwmutex.cpp (71 of 322) PASS: ThreadSanitizer-x86_64-iossim :: bench_shadow_flush.cpp (72 of 322) UNSUPPORTED: ThreadSanitizer-x86_64-iossim :: bench_single_writer.cpp (73 of 322) UNSUPPORTED: ThreadSanitizer-x86_64-iossim :: bench_ten_mutexes.cpp (74 of 322) PASS: ThreadSanitizer-x86_64-iossim :: atomic_store.cpp (75 of 322) PASS: ThreadSanitizer-x86_64-iossim :: blacklist.cpp (76 of 322) PASS: ThreadSanitizer-x86_64-iossim :: benign_race.cpp (77 of 322) PASS: ThreadSanitizer-x86_64-iossim :: cond.c (78 of 322) PASS: ThreadSanitizer-x86_64-iossim :: blacklist2.cpp (79 of 322) PASS: ThreadSanitizer-x86_64-iossim :: cond_cancel.c (80 of 322) PASS: ThreadSanitizer-x86_64-iossim :: cond_destruction.cpp (81 of 322) UNSUPPORTED: ThreadSanitizer-x86_64-iossim :: cond_version.c (82 of 322) PASS: ThreadSanitizer-x86_64-iossim :: cond_race.cpp (83 of 322) PASS: ThreadSanitizer-x86_64-iossim :: custom_mutex0.cpp (84 of 322) PASS: ThreadSanitizer-x86_64-iossim :: custom_mutex1.cpp (85 of 322) PASS: ThreadSanitizer-x86_64-iossim :: custom_mutex2.cpp (86 of 322) PASS: ThreadSanitizer-x86_64-iossim :: custom_mutex3.cpp (87 of 322) PASS: ThreadSanitizer-x86_64-iossim :: custom_mutex4.cpp (88 of 322) PASS: ThreadSanitizer-x86_64-iossim :: custom_mutex5.cpp (89 of 322) PASS: ThreadSanitizer-x86_64-iossim :: cxa_guard_acquire.cpp (90 of 322) UNSUPPORTED: ThreadSanitizer-x86_64-iossim :: debug_alloc_stack.cpp (91 of 322) PASS: ThreadSanitizer-x86_64-iossim :: atomic_free.cpp (92 of 322) PASS: ThreadSanitizer-x86_64-iossim :: debug_locate.cpp (93 of 322) PASS: ThreadSanitizer-x86_64-iossim :: debugging.cpp (94 of 322) PASS: ThreadSanitizer-x86_64-iossim :: default_options.cpp (95 of 322) UNSUPPORTED: ThreadSanitizer-x86_64-iossim :: dl_iterate_phdr.cpp (96 of 322) PASS: ThreadSanitizer-x86_64-iossim :: deep_stack1.cpp (97 of 322) PASS: ThreadSanitizer-x86_64-iossim :: dlclose.cpp (98 of 322) PASS: ThreadSanitizer-x86_64-iossim :: dtls.c (99 of 322) PASS: ThreadSanitizer-x86_64-iossim :: exceptions.cpp (100 of 322) PASS: ThreadSanitizer-x86_64-iossim :: fd_close_norace.cpp (101 of 322) PASS: ThreadSanitizer-x86_64-iossim :: fd_close_norace2.cpp (102 of 322) PASS: ThreadSanitizer-x86_64-iossim :: fd_dup_norace.cpp (103 of 322) PASS: ThreadSanitizer-x86_64-iossim :: fd_dup_norace2.cpp (104 of 322) PASS: ThreadSanitizer-x86_64-iossim :: fd_dup_race.cpp (105 of 322) PASS: ThreadSanitizer-x86_64-iossim :: fd_pipe_norace.cpp (106 of 322) PASS: ThreadSanitizer-x86_64-iossim :: fd_location.cpp (107 of 322) PASS: ThreadSanitizer-x86_64-iossim :: fd_pipe_race.cpp (108 of 322) PASS: ThreadSanitizer-x86_64-iossim :: fd_socket_connect_norace.cpp (109 of 322) PASS: ThreadSanitizer-x86_64-iossim :: fd_socketpair_norace.cpp (110 of 322) PASS: ThreadSanitizer-x86_64-iossim :: fd_socket_norace.cpp (111 of 322) PASS: ThreadSanitizer-x86_64-iossim :: deadlock_detector_stress_test.cpp (112 of 322) PASS: ThreadSanitizer-x86_64-iossim :: fd_stdout_race.cpp (113 of 322) PASS: ThreadSanitizer-x86_64-iossim :: fiber_asm.cpp (114 of 322) PASS: ThreadSanitizer-x86_64-iossim :: fd_tid_recycled.cpp (115 of 322) PASS: ThreadSanitizer-x86_64-iossim :: fiber_from_thread.cpp (116 of 322) PASS: ThreadSanitizer-x86_64-iossim :: fiber_longjmp.cpp (117 of 322) PASS: ThreadSanitizer-x86_64-iossim :: fiber_race.cpp (118 of 322) PASS: ThreadSanitizer-x86_64-iossim :: fiber_simple.cpp (119 of 322) PASS: ThreadSanitizer-x86_64-iossim :: fiber_two_threads.cpp (120 of 322) PASS: ThreadSanitizer-x86_64-iossim :: fork_atexit.cpp (121 of 322) PASS: ThreadSanitizer-x86_64-iossim :: fork_multithreaded3.cpp (122 of 322) PASS: ThreadSanitizer-x86_64-iossim :: fork_multithreaded.cpp (123 of 322) PASS: ThreadSanitizer-x86_64-iossim :: free_race.c (124 of 322) PASS: ThreadSanitizer-x86_64-iossim :: free_race2.c (125 of 322) PASS: ThreadSanitizer-x86_64-iossim :: getline_nohang.cpp (126 of 322) PASS: ThreadSanitizer-x86_64-iossim :: global_race2.cpp (127 of 322) PASS: ThreadSanitizer-x86_64-iossim :: fork_deadlock.cpp (128 of 322) PASS: ThreadSanitizer-x86_64-iossim :: global_race3.cpp (129 of 322) PASS: ThreadSanitizer-x86_64-iossim :: halt_on_error.cpp (130 of 322) PASS: ThreadSanitizer-x86_64-iossim :: heap_race.cpp (131 of 322) UNSUPPORTED: ThreadSanitizer-x86_64-iossim :: ignore_lib0.cpp (132 of 322) PASS: ThreadSanitizer-x86_64-iossim :: ignore_free.cpp (133 of 322) PASS: ThreadSanitizer-x86_64-iossim :: ignore_lib2.cpp (134 of 322) PASS: ThreadSanitizer-x86_64-iossim :: ignore_lib1.cpp (135 of 322) PASS: ThreadSanitizer-x86_64-iossim :: ignore_lib3.cpp (136 of 322) PASS: ThreadSanitizer-x86_64-iossim :: ignore_lib5.cpp (137 of 322) PASS: ThreadSanitizer-x86_64-iossim :: ignore_malloc.cpp (138 of 322) PASS: ThreadSanitizer-x86_64-iossim :: ignore_lib4.cpp (139 of 322) PASS: ThreadSanitizer-x86_64-iossim :: ignore_race.cpp (140 of 322) PASS: ThreadSanitizer-x86_64-iossim :: ignore_sync.cpp (141 of 322) PASS: ThreadSanitizer-x86_64-iossim :: global_race.cpp (142 of 322) PASS: ThreadSanitizer-x86_64-iossim :: inlined_memcpy_race.cpp (143 of 322) PASS: ThreadSanitizer-x86_64-iossim :: ignored-interceptors-mmap.cpp (144 of 322) PASS: ThreadSanitizer-x86_64-iossim :: inlined_memcpy_race2.cpp (145 of 322) PASS: ThreadSanitizer-x86_64-iossim :: interface_atomic_test.c (146 of 322) PASS: ThreadSanitizer-x86_64-iossim :: java_alloc.cpp (147 of 322) PASS: ThreadSanitizer-x86_64-iossim :: java_finalizer.cpp (148 of 322) PASS: ThreadSanitizer-x86_64-iossim :: java_find.cpp (149 of 322) PASS: ThreadSanitizer-x86_64-iossim :: java_heap_init.cpp (150 of 322) PASS: ThreadSanitizer-x86_64-iossim :: java_lock.cpp (151 of 322) PASS: ThreadSanitizer-x86_64-iossim :: java_lock_move.cpp (152 of 322) PASS: ThreadSanitizer-x86_64-iossim :: java_lock_rec.cpp (153 of 322) PASS: ThreadSanitizer-x86_64-iossim :: java_lock_rec_race.cpp (154 of 322) PASS: ThreadSanitizer-x86_64-iossim :: java_move_overlap.cpp (155 of 322) PASS: ThreadSanitizer-x86_64-iossim :: java_race.cpp (156 of 322) PASS: ThreadSanitizer-x86_64-iossim :: java_move_overlap_race.cpp (157 of 322) PASS: ThreadSanitizer-x86_64-iossim :: java_race_move.cpp (158 of 322) PASS: ThreadSanitizer-x86_64-iossim :: java_race_pc.cpp (159 of 322) PASS: ThreadSanitizer-x86_64-iossim :: java_rwlock.cpp (160 of 322) PASS: ThreadSanitizer-x86_64-iossim :: java_symbolization.cpp (161 of 322) UNSUPPORTED: ThreadSanitizer-x86_64-iossim :: large_malloc_meta.cpp (162 of 322) PASS: ThreadSanitizer-x86_64-iossim :: java_symbolization_legacy.cpp (163 of 322) PASS: ThreadSanitizer-x86_64-iossim :: java_volatile.cpp (164 of 322) PASS: ThreadSanitizer-x86_64-iossim :: libdispatch/after.c (165 of 322) PASS: ThreadSanitizer-x86_64-iossim :: libdispatch/apply-race.c (166 of 322) PASS: ThreadSanitizer-x86_64-iossim :: libdispatch/apply.c (167 of 322) PASS: ThreadSanitizer-x86_64-iossim :: libcxx/std_shared_ptr.cpp (168 of 322) PASS: ThreadSanitizer-x86_64-iossim :: libdispatch/async-norace.c (169 of 322) PASS: ThreadSanitizer-x86_64-iossim :: libdispatch/async-race.c (170 of 322) PASS: ThreadSanitizer-x86_64-iossim :: libdispatch/barrier-race.c (171 of 322) PASS: ThreadSanitizer-x86_64-iossim :: libdispatch/barrier.c (172 of 322) PASS: ThreadSanitizer-x86_64-iossim :: libdispatch/blocks.c (173 of 322) PASS: ThreadSanitizer-x86_64-iossim :: libdispatch/data.c (174 of 322) PASS: ThreadSanitizer-x86_64-iossim :: libdispatch/dispatch_once_deadlock.c (175 of 322) PASS: ThreadSanitizer-x86_64-iossim :: libdispatch/dispatch_main.c (176 of 322) PASS: ThreadSanitizer-x86_64-iossim :: libdispatch/fd.c (177 of 322) PASS: ThreadSanitizer-x86_64-iossim :: libdispatch/groups-leave.c (178 of 322) PASS: ThreadSanitizer-x86_64-iossim :: libdispatch/groups-norace.c (179 of 322) PASS: ThreadSanitizer-x86_64-iossim :: libdispatch/groups-destructor.cpp (180 of 322) PASS: ThreadSanitizer-x86_64-iossim :: libdispatch/io-barrier.c (181 of 322) PASS: ThreadSanitizer-x86_64-iossim :: libdispatch/io-barrier-race.c (182 of 322) PASS: ThreadSanitizer-x86_64-iossim :: libdispatch/io-cleanup.c (183 of 322) PASS: ThreadSanitizer-x86_64-iossim :: libdispatch/groups-stress.c (184 of 322) PASS: ThreadSanitizer-x86_64-iossim :: libdispatch/io-race.c (185 of 322) PASS: ThreadSanitizer-x86_64-iossim :: libdispatch/io.c (186 of 322) PASS: ThreadSanitizer-x86_64-iossim :: libdispatch/semaphore-norace.c (187 of 322) PASS: ThreadSanitizer-x86_64-iossim :: libdispatch/once.c (188 of 322) PASS: ThreadSanitizer-x86_64-iossim :: libdispatch/serial-queue-norace.c (189 of 322) PASS: ThreadSanitizer-x86_64-iossim :: libdispatch/source-cancel.c (190 of 322) PASS: ThreadSanitizer-x86_64-iossim :: libdispatch/source-cancel2.c (191 of 322) PASS: ThreadSanitizer-x86_64-iossim :: libdispatch/source-event.c (192 of 322) PASS: ThreadSanitizer-x86_64-iossim :: libdispatch/source-event2.c (193 of 322) PASS: ThreadSanitizer-x86_64-iossim :: libdispatch/source-registration.c (194 of 322) PASS: ThreadSanitizer-x86_64-iossim :: libdispatch/source-registration2.c (195 of 322) PASS: ThreadSanitizer-x86_64-iossim :: libdispatch/suspend.c (196 of 322) PASS: ThreadSanitizer-x86_64-iossim :: libdispatch/source-serial.c (197 of 322) PASS: ThreadSanitizer-x86_64-iossim :: libdispatch/sync-norace.c (198 of 322) PASS: ThreadSanitizer-x86_64-iossim :: libdispatch/sync-block-copy.cpp (199 of 322) PASS: ThreadSanitizer-x86_64-iossim :: libdispatch/sync-race.c (200 of 322) PASS: ThreadSanitizer-x86_64-iossim :: libdispatch/target-queue-norace.c (201 of 322) PASS: ThreadSanitizer-x86_64-iossim :: longjmp.cpp (202 of 322) PASS: ThreadSanitizer-x86_64-iossim :: longjmp2.cpp (203 of 322) PASS: ThreadSanitizer-x86_64-iossim :: longjmp3.cpp (204 of 322) PASS: ThreadSanitizer-x86_64-iossim :: load_shared_lib.cpp (205 of 322) PASS: ThreadSanitizer-x86_64-iossim :: longjmp4.cpp (206 of 322) PASS: ThreadSanitizer-x86_64-iossim :: malloc_overflow.cpp (207 of 322) UNSUPPORTED: ThreadSanitizer-x86_64-iossim :: map32bit.cpp (208 of 322) PASS: ThreadSanitizer-x86_64-iossim :: lots_of_threads.c (209 of 322) PASS: ThreadSanitizer-x86_64-iossim :: malloc_stack.cpp (210 of 322) UNSUPPORTED: ThreadSanitizer-x86_64-iossim :: mmap_large.cpp (211 of 322) PASS: ThreadSanitizer-x86_64-iossim :: memcmp_race.cpp (212 of 322) PASS: ThreadSanitizer-x86_64-iossim :: memcpy_race.cpp (213 of 322) PASS: ThreadSanitizer-x86_64-iossim :: mmap_stress.cpp (214 of 322) PASS: ThreadSanitizer-x86_64-iossim :: mop1.c (215 of 322) XFAIL: ThreadSanitizer-x86_64-iossim :: must_deadlock.cpp (216 of 322) PASS: ThreadSanitizer-x86_64-iossim :: mop_with_offset.cpp (217 of 322) PASS: ThreadSanitizer-x86_64-iossim :: mop_with_offset2.cpp (218 of 322) PASS: ThreadSanitizer-x86_64-iossim :: mutex_annotations.cpp (219 of 322) PASS: ThreadSanitizer-x86_64-iossim :: mutex_bad_read_lock.cpp (220 of 322) PASS: ThreadSanitizer-x86_64-iossim :: mutex_bad_read_unlock.cpp (221 of 322) PASS: ThreadSanitizer-x86_64-iossim :: mutex_bad_unlock.cpp (222 of 322) PASS: ThreadSanitizer-x86_64-iossim :: mutex_destroy_locked.cpp (223 of 322) PASS: ThreadSanitizer-x86_64-iossim :: mutex_destroy_locked2.cpp (224 of 322) PASS: ThreadSanitizer-x86_64-iossim :: mutex_double_lock.cpp (225 of 322) PASS: ThreadSanitizer-x86_64-iossim :: mutex_cycle2.c (226 of 322) PASS: ThreadSanitizer-x86_64-iossim :: mutex_cycle_long.c (227 of 322) PASS: ThreadSanitizer-x86_64-iossim :: mutex_lock_destroyed.cpp (228 of 322) PASS: ThreadSanitizer-x86_64-iossim :: mutexset1.cpp (229 of 322) PASS: ThreadSanitizer-x86_64-iossim :: mutexset2.cpp (230 of 322) PASS: ThreadSanitizer-x86_64-iossim :: mutexset3.cpp (231 of 322) PASS: ThreadSanitizer-x86_64-iossim :: mutexset4.cpp (232 of 322) PASS: ThreadSanitizer-x86_64-iossim :: mutexset5.cpp (233 of 322) PASS: ThreadSanitizer-x86_64-iossim :: mutexset6.cpp (234 of 322) PASS: ThreadSanitizer-x86_64-iossim :: mutexset7.cpp (235 of 322) PASS: ThreadSanitizer-x86_64-iossim :: mutexset8.cpp (236 of 322) PASS: ThreadSanitizer-x86_64-iossim :: pie_test.cpp (237 of 322) PASS: ThreadSanitizer-x86_64-iossim :: pthread_atfork_deadlock.c (238 of 322) UNSUPPORTED: ThreadSanitizer-x86_64-iossim :: race_on_barrier.c (239 of 322) UNSUPPORTED: ThreadSanitizer-x86_64-iossim :: race_on_barrier2.c (240 of 322) PASS: ThreadSanitizer-x86_64-iossim :: printf-1.c (241 of 322) PASS: ThreadSanitizer-x86_64-iossim :: pthread_key.cpp (242 of 322) PASS: ThreadSanitizer-x86_64-iossim :: race_on_fputs.cpp (243 of 322) PASS: ThreadSanitizer-x86_64-iossim :: race_on_mutex.c (244 of 322) PASS: ThreadSanitizer-x86_64-iossim :: race_on_mutex2.c (245 of 322) PASS: ThreadSanitizer-x86_64-iossim :: race_on_heap.cpp (246 of 322) PASS: ThreadSanitizer-x86_64-iossim :: race_on_puts.cpp (247 of 322) PASS: ThreadSanitizer-x86_64-iossim :: race_on_speculative_load.cpp (248 of 322) PASS: ThreadSanitizer-x86_64-iossim :: race_on_read.cpp (249 of 322) PASS: ThreadSanitizer-x86_64-iossim :: race_on_write.cpp (250 of 322) PASS: ThreadSanitizer-x86_64-iossim :: race_range_pc.cpp (251 of 322) PASS: ThreadSanitizer-x86_64-iossim :: race_stress.cpp (252 of 322) PASS: ThreadSanitizer-x86_64-iossim :: race_top_suppression.cpp (253 of 322) PASS: ThreadSanitizer-x86_64-iossim :: race_top_suppression1.cpp (254 of 322) PASS: ThreadSanitizer-x86_64-iossim :: race_with_finished_thread.cpp (255 of 322) PASS: ThreadSanitizer-x86_64-iossim :: setuid.c (256 of 322) PASS: ThreadSanitizer-x86_64-iossim :: real_deadlock_detector_stress_test.cpp (257 of 322) PASS: ThreadSanitizer-x86_64-iossim :: restore_stack.cpp (258 of 322) PASS: ThreadSanitizer-x86_64-iossim :: signal_block.cpp (259 of 322) PASS: ThreadSanitizer-x86_64-iossim :: setuid2.c (260 of 322) PASS: ThreadSanitizer-x86_64-iossim :: signal_longjmp.cpp (261 of 322) PASS: ThreadSanitizer-x86_64-iossim :: signal_errno.cpp (262 of 322) PASS: ThreadSanitizer-x86_64-iossim :: signal_cond.cpp (263 of 322) UNSUPPORTED: ThreadSanitizer-x86_64-iossim :: signal_recursive.cpp (264 of 322) UNSUPPORTED: ThreadSanitizer-x86_64-iossim :: signal_reset.cpp (265 of 322) UNSUPPORTED: ThreadSanitizer-x86_64-iossim :: signal_sync.cpp (266 of 322) UNSUPPORTED: ThreadSanitizer-x86_64-iossim :: signal_sync2.cpp (267 of 322) UNSUPPORTED: ThreadSanitizer-x86_64-iossim :: signal_thread.cpp (268 of 322) PASS: ThreadSanitizer-x86_64-iossim :: signal_pause.cpp (269 of 322) PASS: ThreadSanitizer-x86_64-iossim :: signal_malloc.cpp (270 of 322) PASS: ThreadSanitizer-x86_64-iossim :: signal_write.cpp (271 of 322) PASS: ThreadSanitizer-x86_64-iossim :: sigsuspend.cpp (272 of 322) PASS: ThreadSanitizer-x86_64-iossim :: simple_race.c (273 of 322) PASS: ThreadSanitizer-x86_64-iossim :: simple_race.cpp (274 of 322) PASS: ThreadSanitizer-x86_64-iossim :: simple_stack2.cpp (275 of 322) PASS: ThreadSanitizer-x86_64-iossim :: sleep_sync.cpp (276 of 322) PASS: ThreadSanitizer-x86_64-iossim :: sleep_sync2.cpp (277 of 322) PASS: ThreadSanitizer-x86_64-iossim :: simple_stack.c (278 of 322) PASS: ThreadSanitizer-x86_64-iossim :: stack_race.cpp (279 of 322) PASS: ThreadSanitizer-x86_64-iossim :: stack_race2.cpp (280 of 322) PASS: ThreadSanitizer-x86_64-iossim :: static_init1.cpp (281 of 322) PASS: ThreadSanitizer-x86_64-iossim :: stack_sync_reuse.cpp (282 of 322) PASS: ThreadSanitizer-x86_64-iossim :: static_init2.cpp (283 of 322) PASS: ThreadSanitizer-x86_64-iossim :: static_init4.cpp (284 of 322) PASS: ThreadSanitizer-x86_64-iossim :: static_init3.cpp (285 of 322) UNSUPPORTED: ThreadSanitizer-x86_64-iossim :: strerror_r.cpp (286 of 322) UNSUPPORTED: ThreadSanitizer-x86_64-iossim :: sunrpc.cpp (287 of 322) PASS: ThreadSanitizer-x86_64-iossim :: static_init5.cpp (288 of 322) PASS: ThreadSanitizer-x86_64-iossim :: static_init6.cpp (289 of 322) PASS: ThreadSanitizer-x86_64-iossim :: suppress_same_address.cpp (290 of 322) PASS: ThreadSanitizer-x86_64-iossim :: suppress_same_stacks.cpp (291 of 322) PASS: ThreadSanitizer-x86_64-iossim :: suppressions_global.cpp (292 of 322) PASS: ThreadSanitizer-x86_64-iossim :: suppressions_mutex.cpp (293 of 322) PASS: ThreadSanitizer-x86_64-iossim :: suppressions_race.cpp (294 of 322) PASS: ThreadSanitizer-x86_64-iossim :: suppressions_race2.cpp (295 of 322) PASS: ThreadSanitizer-x86_64-iossim :: thread_detach.c (296 of 322) PASS: ThreadSanitizer-x86_64-iossim :: thread_detach2.c (297 of 322) PASS: ThreadSanitizer-x86_64-iossim :: thread_end_with_ignore2.cpp (298 of 322) PASS: ThreadSanitizer-x86_64-iossim :: thread_end_with_ignore.cpp (299 of 322) PASS: ThreadSanitizer-x86_64-iossim :: thread_end_with_ignore3.cpp (300 of 322) PASS: ThreadSanitizer-x86_64-iossim :: thread_leak.c (301 of 322) PASS: ThreadSanitizer-x86_64-iossim :: thread_exit.c (302 of 322) PASS: ThreadSanitizer-x86_64-iossim :: thread_leak2.c (303 of 322) PASS: ThreadSanitizer-x86_64-iossim :: thread_leak4.c (304 of 322) PASS: ThreadSanitizer-x86_64-iossim :: thread_leak3.c (305 of 322) UNSUPPORTED: ThreadSanitizer-x86_64-iossim :: thread_name2.cpp (306 of 322) PASS: ThreadSanitizer-x86_64-iossim :: thread_name.cpp (307 of 322) PASS: ThreadSanitizer-x86_64-iossim :: thread_leak5.c (308 of 322) PASS: ThreadSanitizer-x86_64-iossim :: tiny_race.c (309 of 322) PASS: ThreadSanitizer-x86_64-iossim :: tls_race.cpp (310 of 322) PASS: ThreadSanitizer-x86_64-iossim :: tls_race2.cpp (311 of 322) PASS: ThreadSanitizer-x86_64-iossim :: unaligned_norace.cpp (312 of 322) PASS: ThreadSanitizer-x86_64-iossim :: tsan-vs-gvn.cpp (313 of 322) PASS: ThreadSanitizer-x86_64-iossim :: vfork.cpp (314 of 322) PASS: ThreadSanitizer-x86_64-iossim :: unaligned_race.cpp (315 of 322) PASS: ThreadSanitizer-x86_64-iossim :: virtual_inheritance_compile_bug.cpp (316 of 322) PASS: ThreadSanitizer-x86_64-iossim :: vptr_benign_race.cpp (317 of 322) PASS: ThreadSanitizer-x86_64-iossim :: vptr_harmful_race.cpp (318 of 322) PASS: ThreadSanitizer-x86_64-iossim :: vptr_harmful_race2.cpp (319 of 322) PASS: ThreadSanitizer-x86_64-iossim :: vptr_harmful_race3.cpp (320 of 322) PASS: ThreadSanitizer-x86_64-iossim :: vptr_harmful_race4.cpp (321 of 322) PASS: ThreadSanitizer-x86_64-iossim :: write_in_reader_lock.cpp (322 of 322)

Hide Details

1 warning(s) in tests

Hide Details

Testing Time: 262.39s ******************** Failing Tests (1): ThreadSanitizer-x86_64-iossim :: Darwin/mach_vm_allocate.c

Hide Details

Expected Passes : 279 Expected Failures : 2 Unsupported Tests : 40 Unexpected Failures: 1 Build step 'Execute shell' marked build as failure Recording test results [BFA] Scanning build for known causes... [BFA] Found failure cause(s): [BFA] Regression test failed from category Test [BFA] Compile Error from category Compile [BFA] Done. 2s No emails were triggered. Finished: FAILURE