Failed

LLVM-Unit.Analysis/_/AnalysisTests.VFShapeAPITest.Parameters_Invalid (from LLVM-Unit)

Failing for the past 1 build (Since Failed#6783 )
Took 0.67 sec.

Stacktrace

Note: Google Test filter = VFShapeAPITest.Parameters_Invalid
[==========] Running 1 test from 1 test case.
[----------] Global test environment set-up.
[----------] 1 test from VFShapeAPITest
[ RUN      ] VFShapeAPITest.Parameters_Invalid
/Users/buildslave/jenkins/workspace/clang-stage2-cmake-RgSan/llvm-project/llvm/unittests/Analysis/VectorUtilsTest.cpp:438: Failure
Death test: validParams({{1, VFParamKind::Vector}})
    Result: failed to die.
 Error msg:
[  DEATH   ] 
/Users/buildslave/jenkins/workspace/clang-stage2-cmake-RgSan/llvm-project/llvm/unittests/Analysis/VectorUtilsTest.cpp:441: Failure
Death test: validParams({{1, VFParamKind::Vector}, {0, VFParamKind::Vector}})
    Result: failed to die.
 Error msg:
[  DEATH   ] 
[  FAILED  ] VFShapeAPITest.Parameters_Invalid (389 ms)
[----------] 1 test from VFShapeAPITest (389 ms total)

[----------] Global test environment tear-down
[==========] 1 test from 1 test case ran. (390 ms total)
[  PASSED  ] 0 tests.
[  FAILED  ] 1 test, listed below:
[  FAILED  ] VFShapeAPITest.Parameters_Invalid

 1 FAILED TEST