FailedConsole Output

Skipping 9,079 KB.. Full Log
te/test/dotest.py", line 949, in run_suite
    import lldb
  File "/Users/buildslave/jenkins/workspace/lldb-cmake-sanitized/lldb-build/lib/python3.7/site-packages/lldb/__init__.py", line 41, in <module>
    from . import _lldb
ImportError: dynamic module does not define init function (init_lldb)

Hide Details

******************** UNRESOLVED: lldb-api :: lang/cpp/function-template-parameter-pack/TestFunctionTemplateParameterPack.py (1673 of 1794) ******************** TEST 'lldb-api :: lang/cpp/function-template-parameter-pack/TestFunctionTemplateParameterPack.py' FAILED ******************** Unable to find 'RESULT: PASSED' in dotest output (exit code 1):

Hide Details

lldb version 10.0.99 (http://labmaster3.local/git/llvm-project.git revision a078c77d72082bf6a06486849735cdeaab1374bc) clang revision a078c77d72082bf6a06486849735cdeaab1374bc llvm revision a078c77d72082bf6a06486849735cdeaab1374bc LLDB library dir: /Users/buildslave/jenkins/workspace/lldb-cmake-sanitized/lldb-build/bin LLDB import library dir: /Users/buildslave/jenkins/workspace/lldb-cmake-sanitized/lldb-build/bin Traceback (most recent call last): File "/Users/buildslave/jenkins/workspace/lldb-cmake-sanitized/llvm-project/lldb/test/API/dotest.py", line 7, in <module> lldbsuite.test.run_suite() File "/Users/buildslave/jenkins/workspace/lldb-cmake-sanitized/llvm-project/lldb/packages/Python/lldbsuite/test/dotest.py", line 949, in run_suite import lldb File "/Users/buildslave/jenkins/workspace/lldb-cmake-sanitized/lldb-build/lib/python3.7/site-packages/lldb/__init__.py", line 41, in <module> from . import _lldb ImportError: dynamic module does not define init function (init_lldb)

Hide Details

******************** PASS: lldb-unit :: Utility/./UtilityTests/VMRange.IsValid (1674 of 1794) XFAIL: lldb-shell :: Unwind/prefer-debug-over-eh-frame.test (1675 of 1794) PASS: lldb-shell :: SymbolFile/NativePDB/ast-functions.cpp (1676 of 1794) UNRESOLVED: lldb-api :: functionalities/data-formatter/data-formatter-synth/TestDataFormatterSynth.py (1677 of 1794) ******************** TEST 'lldb-api :: functionalities/data-formatter/data-formatter-synth/TestDataFormatterSynth.py' FAILED ******************** Unable to find 'RESULT: PASSED' in dotest output (exit code 1):

Hide Details

lldb version 10.0.99 (http://labmaster3.local/git/llvm-project.git revision a078c77d72082bf6a06486849735cdeaab1374bc) clang revision a078c77d72082bf6a06486849735cdeaab1374bc llvm revision a078c77d72082bf6a06486849735cdeaab1374bc LLDB library dir: /Users/buildslave/jenkins/workspace/lldb-cmake-sanitized/lldb-build/bin LLDB import library dir: /Users/buildslave/jenkins/workspace/lldb-cmake-sanitized/lldb-build/bin Traceback (most recent call last): File "/Users/buildslave/jenkins/workspace/lldb-cmake-sanitized/llvm-project/lldb/test/API/dotest.py", line 7, in <module> lldbsuite.test.run_suite() File "/Users/buildslave/jenkins/workspace/lldb-cmake-sanitized/llvm-project/lldb/packages/Python/lldbsuite/test/dotest.py", line 949, in run_suite import lldb File "/Users/buildslave/jenkins/workspace/lldb-cmake-sanitized/lldb-build/lib/python3.7/site-packages/lldb/__init__.py", line 41, in <module> from . import _lldb ImportError: dynamic module does not define init function (init_lldb)

Hide Details

******************** UNRESOLVED: lldb-api :: functionalities/load_unload/TestLoadUnload.py (1678 of 1794) ******************** TEST 'lldb-api :: functionalities/load_unload/TestLoadUnload.py' FAILED ******************** Unable to find 'RESULT: PASSED' in dotest output (exit code 1):

Hide Details

lldb version 10.0.99 (http://labmaster3.local/git/llvm-project.git revision a078c77d72082bf6a06486849735cdeaab1374bc) clang revision a078c77d72082bf6a06486849735cdeaab1374bc llvm revision a078c77d72082bf6a06486849735cdeaab1374bc LLDB library dir: /Users/buildslave/jenkins/workspace/lldb-cmake-sanitized/lldb-build/bin LLDB import library dir: /Users/buildslave/jenkins/workspace/lldb-cmake-sanitized/lldb-build/bin Traceback (most recent call last): File "/Users/buildslave/jenkins/workspace/lldb-cmake-sanitized/llvm-project/lldb/test/API/dotest.py", line 7, in <module> lldbsuite.test.run_suite() File "/Users/buildslave/jenkins/workspace/lldb-cmake-sanitized/llvm-project/lldb/packages/Python/lldbsuite/test/dotest.py", line 949, in run_suite import lldb File "/Users/buildslave/jenkins/workspace/lldb-cmake-sanitized/lldb-build/lib/python3.7/site-packages/lldb/__init__.py", line 41, in <module> from . import _lldb ImportError: dynamic module does not define init function (init_lldb)

Hide Details

******************** PASS: lldb-unit :: Utility/./UtilityTests/StringListTest.JoinSingle (1679 of 1794) UNRESOLVED: lldb-api :: lang/cpp/class_types/TestClassTypes.py (1680 of 1794) ******************** TEST 'lldb-api :: lang/cpp/class_types/TestClassTypes.py' FAILED ******************** Unable to find 'RESULT: PASSED' in dotest output (exit code 1):

Hide Details

lldb version 10.0.99 (http://labmaster3.local/git/llvm-project.git revision a078c77d72082bf6a06486849735cdeaab1374bc) clang revision a078c77d72082bf6a06486849735cdeaab1374bc llvm revision a078c77d72082bf6a06486849735cdeaab1374bc LLDB library dir: /Users/buildslave/jenkins/workspace/lldb-cmake-sanitized/lldb-build/bin LLDB import library dir: /Users/buildslave/jenkins/workspace/lldb-cmake-sanitized/lldb-build/bin Traceback (most recent call last): File "/Users/buildslave/jenkins/workspace/lldb-cmake-sanitized/llvm-project/lldb/test/API/dotest.py", line 7, in <module> lldbsuite.test.run_suite() File "/Users/buildslave/jenkins/workspace/lldb-cmake-sanitized/llvm-project/lldb/packages/Python/lldbsuite/test/dotest.py", line 949, in run_suite import lldb File "/Users/buildslave/jenkins/workspace/lldb-cmake-sanitized/lldb-build/lib/python3.7/site-packages/lldb/__init__.py", line 41, in <module> from . import _lldb ImportError: dynamic module does not define init function (init_lldb)

Hide Details

******************** PASS: lldb-unit :: SymbolFile/NativePDB/./SymbolFileNativePDBTests/PDBFPOProgramToDWARFExpressionTests.InvalidOpBinary (1681 of 1794) PASS: lldb-unit :: Host/./HostTests/ConnectionFileDescriptorTest.TCPGetURIv4 (1682 of 1794) UNRESOLVED: lldb-api :: iohandler/completion/TestIOHandlerCompletion.py (1683 of 1794) ******************** TEST 'lldb-api :: iohandler/completion/TestIOHandlerCompletion.py' FAILED ******************** Unable to find 'RESULT: PASSED' in dotest output (exit code 1):

Hide Details

lldb version 10.0.99 (http://labmaster3.local/git/llvm-project.git revision a078c77d72082bf6a06486849735cdeaab1374bc) clang revision a078c77d72082bf6a06486849735cdeaab1374bc llvm revision a078c77d72082bf6a06486849735cdeaab1374bc LLDB library dir: /Users/buildslave/jenkins/workspace/lldb-cmake-sanitized/lldb-build/bin LLDB import library dir: /Users/buildslave/jenkins/workspace/lldb-cmake-sanitized/lldb-build/bin Traceback (most recent call last): File "/Users/buildslave/jenkins/workspace/lldb-cmake-sanitized/llvm-project/lldb/test/API/dotest.py", line 7, in <module> lldbsuite.test.run_suite() File "/Users/buildslave/jenkins/workspace/lldb-cmake-sanitized/llvm-project/lldb/packages/Python/lldbsuite/test/dotest.py", line 949, in run_suite import lldb File "/Users/buildslave/jenkins/workspace/lldb-cmake-sanitized/lldb-build/lib/python3.7/site-packages/lldb/__init__.py", line 41, in <module> from . import _lldb ImportError: dynamic module does not define init function (init_lldb)

Hide Details

******************** UNRESOLVED: lldb-api :: functionalities/darwin_log/filter/regex/category/TestDarwinLogFilterRegexCategory.py (1684 of 1794) ******************** TEST 'lldb-api :: functionalities/darwin_log/filter/regex/category/TestDarwinLogFilterRegexCategory.py' FAILED ******************** Unable to find 'RESULT: PASSED' in dotest output (exit code 1):

Hide Details

lldb version 10.0.99 (http://labmaster3.local/git/llvm-project.git revision a078c77d72082bf6a06486849735cdeaab1374bc) clang revision a078c77d72082bf6a06486849735cdeaab1374bc llvm revision a078c77d72082bf6a06486849735cdeaab1374bc LLDB library dir: /Users/buildslave/jenkins/workspace/lldb-cmake-sanitized/lldb-build/bin LLDB import library dir: /Users/buildslave/jenkins/workspace/lldb-cmake-sanitized/lldb-build/bin Traceback (most recent call last): File "/Users/buildslave/jenkins/workspace/lldb-cmake-sanitized/llvm-project/lldb/test/API/dotest.py", line 7, in <module> lldbsuite.test.run_suite() File "/Users/buildslave/jenkins/workspace/lldb-cmake-sanitized/llvm-project/lldb/packages/Python/lldbsuite/test/dotest.py", line 949, in run_suite import lldb File "/Users/buildslave/jenkins/workspace/lldb-cmake-sanitized/lldb-build/lib/python3.7/site-packages/lldb/__init__.py", line 41, in <module> from . import _lldb ImportError: dynamic module does not define init function (init_lldb)

Hide Details

******************** UNRESOLVED: lldb-api :: functionalities/inferior-crashing/recursive-inferior/TestRecursiveInferiorStep.py (1685 of 1794) ******************** TEST 'lldb-api :: functionalities/inferior-crashing/recursive-inferior/TestRecursiveInferiorStep.py' FAILED ******************** Unable to find 'RESULT: PASSED' in dotest output (exit code 1):

Hide Details

lldb version 10.0.99 (http://labmaster3.local/git/llvm-project.git revision a078c77d72082bf6a06486849735cdeaab1374bc) clang revision a078c77d72082bf6a06486849735cdeaab1374bc llvm revision a078c77d72082bf6a06486849735cdeaab1374bc LLDB library dir: /Users/buildslave/jenkins/workspace/lldb-cmake-sanitized/lldb-build/bin LLDB import library dir: /Users/buildslave/jenkins/workspace/lldb-cmake-sanitized/lldb-build/bin Traceback (most recent call last): File "/Users/buildslave/jenkins/workspace/lldb-cmake-sanitized/llvm-project/lldb/test/API/dotest.py", line 7, in <module> lldbsuite.test.run_suite() File "/Users/buildslave/jenkins/workspace/lldb-cmake-sanitized/llvm-project/lldb/packages/Python/lldbsuite/test/dotest.py", line 949, in run_suite import lldb File "/Users/buildslave/jenkins/workspace/lldb-cmake-sanitized/lldb-build/lib/python3.7/site-packages/lldb/__init__.py", line 41, in <module> from . import _lldb ImportError: dynamic module does not define init function (init_lldb)

Hide Details

******************** UNRESOLVED: lldb-api :: commands/expression/import-std-module/forward_list-basic/TestBasicForwardList.py (1686 of 1794) ******************** TEST 'lldb-api :: commands/expression/import-std-module/forward_list-basic/TestBasicForwardList.py' FAILED ******************** Unable to find 'RESULT: PASSED' in dotest output (exit code 1):

Hide Details

lldb version 10.0.99 (http://labmaster3.local/git/llvm-project.git revision a078c77d72082bf6a06486849735cdeaab1374bc) clang revision a078c77d72082bf6a06486849735cdeaab1374bc llvm revision a078c77d72082bf6a06486849735cdeaab1374bc LLDB library dir: /Users/buildslave/jenkins/workspace/lldb-cmake-sanitized/lldb-build/bin LLDB import library dir: /Users/buildslave/jenkins/workspace/lldb-cmake-sanitized/lldb-build/bin Traceback (most recent call last): File "/Users/buildslave/jenkins/workspace/lldb-cmake-sanitized/llvm-project/lldb/test/API/dotest.py", line 7, in <module> lldbsuite.test.run_suite() File "/Users/buildslave/jenkins/workspace/lldb-cmake-sanitized/llvm-project/lldb/packages/Python/lldbsuite/test/dotest.py", line 949, in run_suite import lldb File "/Users/buildslave/jenkins/workspace/lldb-cmake-sanitized/lldb-build/lib/python3.7/site-packages/lldb/__init__.py", line 41, in <module> from . import _lldb ImportError: dynamic module does not define init function (init_lldb)

Hide Details

******************** UNRESOLVED: lldb-api :: lang/cpp/class-template-parameter-pack/TestClassTemplateParameterPack.py (1687 of 1794) ******************** TEST 'lldb-api :: lang/cpp/class-template-parameter-pack/TestClassTemplateParameterPack.py' FAILED ******************** Unable to find 'RESULT: PASSED' in dotest output (exit code 1):

Hide Details

lldb version 10.0.99 (http://labmaster3.local/git/llvm-project.git revision a078c77d72082bf6a06486849735cdeaab1374bc) clang revision a078c77d72082bf6a06486849735cdeaab1374bc llvm revision a078c77d72082bf6a06486849735cdeaab1374bc LLDB library dir: /Users/buildslave/jenkins/workspace/lldb-cmake-sanitized/lldb-build/bin LLDB import library dir: /Users/buildslave/jenkins/workspace/lldb-cmake-sanitized/lldb-build/bin Traceback (most recent call last): File "/Users/buildslave/jenkins/workspace/lldb-cmake-sanitized/llvm-project/lldb/test/API/dotest.py", line 7, in <module> lldbsuite.test.run_suite() File "/Users/buildslave/jenkins/workspace/lldb-cmake-sanitized/llvm-project/lldb/packages/Python/lldbsuite/test/dotest.py", line 949, in run_suite import lldb File "/Users/buildslave/jenkins/workspace/lldb-cmake-sanitized/lldb-build/lib/python3.7/site-packages/lldb/__init__.py", line 41, in <module> from . import _lldb ImportError: dynamic module does not define init function (init_lldb)

Hide Details

******************** PASS: lldb-unit :: Process/gdb-remote/./ProcessGdbRemoteTests/GDBRemoteCommunicationClientTest.GetMemoryRegionInfoInvalidResponse (1688 of 1794) UNRESOLVED: lldb-api :: functionalities/memory/read/TestMemoryRead.py (1689 of 1794) ******************** TEST 'lldb-api :: functionalities/memory/read/TestMemoryRead.py' FAILED ******************** Unable to find 'RESULT: PASSED' in dotest output (exit code 1):

Hide Details

lldb version 10.0.99 (http://labmaster3.local/git/llvm-project.git revision a078c77d72082bf6a06486849735cdeaab1374bc) clang revision a078c77d72082bf6a06486849735cdeaab1374bc llvm revision a078c77d72082bf6a06486849735cdeaab1374bc LLDB library dir: /Users/buildslave/jenkins/workspace/lldb-cmake-sanitized/lldb-build/bin LLDB import library dir: /Users/buildslave/jenkins/workspace/lldb-cmake-sanitized/lldb-build/bin Traceback (most recent call last): File "/Users/buildslave/jenkins/workspace/lldb-cmake-sanitized/llvm-project/lldb/test/API/dotest.py", line 7, in <module> lldbsuite.test.run_suite() File "/Users/buildslave/jenkins/workspace/lldb-cmake-sanitized/llvm-project/lldb/packages/Python/lldbsuite/test/dotest.py", line 949, in run_suite import lldb File "/Users/buildslave/jenkins/workspace/lldb-cmake-sanitized/lldb-build/lib/python3.7/site-packages/lldb/__init__.py", line 41, in <module> from . import _lldb ImportError: dynamic module does not define init function (init_lldb)

Hide Details

******************** PASS: lldb-unit :: Utility/./UtilityTests/NameMatchesTest.Contains (1690 of 1794) PASS: lldb-unit :: debugserver/./debugserverTests/RNBSocket.LoopBackConnectIPv6 (1691 of 1794) PASS: lldb-unit :: UnwindAssembly/x86/./UnwindAssemblyx86Tests/Testx86AssemblyInspectionEngine.TestAddRSP (1692 of 1794) PASS: lldb-unit :: UnwindAssembly/x86/./UnwindAssemblyx86Tests/Testx86AssemblyInspectionEngine.TestStackRealign8BitDisp_i386 (1693 of 1794) UNRESOLVED: lldb-api :: lang/objc/ptr_refs/TestPtrRefsObjC.py (1694 of 1794) ******************** TEST 'lldb-api :: lang/objc/ptr_refs/TestPtrRefsObjC.py' FAILED ******************** Unable to find 'RESULT: PASSED' in dotest output (exit code 1):

Hide Details

lldb version 10.0.99 (http://labmaster3.local/git/llvm-project.git revision a078c77d72082bf6a06486849735cdeaab1374bc) clang revision a078c77d72082bf6a06486849735cdeaab1374bc llvm revision a078c77d72082bf6a06486849735cdeaab1374bc LLDB library dir: /Users/buildslave/jenkins/workspace/lldb-cmake-sanitized/lldb-build/bin LLDB import library dir: /Users/buildslave/jenkins/workspace/lldb-cmake-sanitized/lldb-build/bin Traceback (most recent call last): File "/Users/buildslave/jenkins/workspace/lldb-cmake-sanitized/llvm-project/lldb/test/API/dotest.py", line 7, in <module> lldbsuite.test.run_suite() File "/Users/buildslave/jenkins/workspace/lldb-cmake-sanitized/llvm-project/lldb/packages/Python/lldbsuite/test/dotest.py", line 949, in run_suite import lldb File "/Users/buildslave/jenkins/workspace/lldb-cmake-sanitized/lldb-build/lib/python3.7/site-packages/lldb/__init__.py", line 41, in <module> from . import _lldb ImportError: dynamic module does not define init function (init_lldb)

Hide Details

******************** PASS: lldb-unit :: Utility/./UtilityTests/StringListTest.InsertStringAtIndexStart (1695 of 1794) PASS: lldb-unit :: Host/./HostTests/SocketAddressTest.GetAddressInfo (1696 of 1794) PASS: lldb-unit :: Utility/./UtilityTests/RangeTest.LessThanInvalid (1697 of 1794) PASS: lldb-shell :: ExecControl/StopHook/stop-hook.test (1698 of 1794) PASS: lldb-unit :: Language/Highlighting/./HighlighterTests/HighlighterTest.ClangIdentifiers (1699 of 1794) PASS: lldb-unit :: Utility/./UtilityTests/UUIDTest.SetFromStringRef (1700 of 1794) PASS: lldb-shell :: Breakpoint/jitbp_elf.test (1701 of 1794) UNRESOLVED: lldb-api :: commands/expression/ir-interpreter/TestIRInterpreter.py (1702 of 1794) ******************** TEST 'lldb-api :: commands/expression/ir-interpreter/TestIRInterpreter.py' FAILED ******************** Unable to find 'RESULT: PASSED' in dotest output (exit code 1):

Hide Details

lldb version 10.0.99 (http://labmaster3.local/git/llvm-project.git revision a078c77d72082bf6a06486849735cdeaab1374bc) clang revision a078c77d72082bf6a06486849735cdeaab1374bc llvm revision a078c77d72082bf6a06486849735cdeaab1374bc LLDB library dir: /Users/buildslave/jenkins/workspace/lldb-cmake-sanitized/lldb-build/bin LLDB import library dir: /Users/buildslave/jenkins/workspace/lldb-cmake-sanitized/lldb-build/bin Traceback (most recent call last): File "/Users/buildslave/jenkins/workspace/lldb-cmake-sanitized/llvm-project/lldb/test/API/dotest.py", line 7, in <module> lldbsuite.test.run_suite() File "/Users/buildslave/jenkins/workspace/lldb-cmake-sanitized/llvm-project/lldb/packages/Python/lldbsuite/test/dotest.py", line 949, in run_suite import lldb File "/Users/buildslave/jenkins/workspace/lldb-cmake-sanitized/lldb-build/lib/python3.7/site-packages/lldb/__init__.py", line 41, in <module> from . import _lldb ImportError: dynamic module does not define init function (init_lldb)

Hide Details

******************** PASS: lldb-unit :: Utility/./UtilityTests/TimerTest.CategoryTimes2 (1703 of 1794) PASS: lldb-unit :: Utility/./UtilityTests/StringExtractorTest.GetHexBytes_FullString (1704 of 1794) PASS: lldb-unit :: UnwindAssembly/x86/./UnwindAssemblyx86Tests/Testx86AssemblyInspectionEngine.TestPopRBP (1705 of 1794) PASS: lldb-unit :: Utility/./UtilityTests/FileSpecTest.EqualSeparator (1706 of 1794) PASS: lldb-shell :: ObjectFile/ELF/base-address.yaml (1707 of 1794) UNRESOLVED: lldb-api :: lang/c/const_variables/TestConstVariables.py (1708 of 1794) ******************** TEST 'lldb-api :: lang/c/const_variables/TestConstVariables.py' FAILED ******************** Unable to find 'RESULT: PASSED' in dotest output (exit code 1):

Hide Details

lldb version 10.0.99 (http://labmaster3.local/git/llvm-project.git revision a078c77d72082bf6a06486849735cdeaab1374bc) clang revision a078c77d72082bf6a06486849735cdeaab1374bc llvm revision a078c77d72082bf6a06486849735cdeaab1374bc LLDB library dir: /Users/buildslave/jenkins/workspace/lldb-cmake-sanitized/lldb-build/bin LLDB import library dir: /Users/buildslave/jenkins/workspace/lldb-cmake-sanitized/lldb-build/bin Traceback (most recent call last): File "/Users/buildslave/jenkins/workspace/lldb-cmake-sanitized/llvm-project/lldb/test/API/dotest.py", line 7, in <module> lldbsuite.test.run_suite() File "/Users/buildslave/jenkins/workspace/lldb-cmake-sanitized/llvm-project/lldb/packages/Python/lldbsuite/test/dotest.py", line 949, in run_suite import lldb File "/Users/buildslave/jenkins/workspace/lldb-cmake-sanitized/lldb-build/lib/python3.7/site-packages/lldb/__init__.py", line 41, in <module> from . import _lldb ImportError: dynamic module does not define init function (init_lldb)

Hide Details

******************** UNRESOLVED: lldb-api :: functionalities/gdb_remote_client/TestGDBRemoteClient.py (1709 of 1794) ******************** TEST 'lldb-api :: functionalities/gdb_remote_client/TestGDBRemoteClient.py' FAILED ******************** Unable to find 'RESULT: PASSED' in dotest output (exit code 1):

Hide Details

lldb version 10.0.99 (http://labmaster3.local/git/llvm-project.git revision a078c77d72082bf6a06486849735cdeaab1374bc) clang revision a078c77d72082bf6a06486849735cdeaab1374bc llvm revision a078c77d72082bf6a06486849735cdeaab1374bc LLDB library dir: /Users/buildslave/jenkins/workspace/lldb-cmake-sanitized/lldb-build/bin LLDB import library dir: /Users/buildslave/jenkins/workspace/lldb-cmake-sanitized/lldb-build/bin Traceback (most recent call last): File "/Users/buildslave/jenkins/workspace/lldb-cmake-sanitized/llvm-project/lldb/test/API/dotest.py", line 7, in <module> lldbsuite.test.run_suite() File "/Users/buildslave/jenkins/workspace/lldb-cmake-sanitized/llvm-project/lldb/packages/Python/lldbsuite/test/dotest.py", line 949, in run_suite import lldb File "/Users/buildslave/jenkins/workspace/lldb-cmake-sanitized/lldb-build/lib/python3.7/site-packages/lldb/__init__.py", line 41, in <module> from . import _lldb ImportError: dynamic module does not define init function (init_lldb)

Hide Details

******************** PASS: lldb-shell :: SymbolFile/DWARF/dwarf5-partial-index.cpp (1710 of 1794) PASS: lldb-unit :: Utility/./UtilityTests/StringExtractorTest.GetHexU8_Extra_NoEof (1711 of 1794) UNRESOLVED: lldb-api :: functionalities/data-formatter/data-formatter-disabling/TestDataFormatterDisabling.py (1712 of 1794) ******************** TEST 'lldb-api :: functionalities/data-formatter/data-formatter-disabling/TestDataFormatterDisabling.py' FAILED ******************** Unable to find 'RESULT: PASSED' in dotest output (exit code 1):

Hide Details

lldb version 10.0.99 (http://labmaster3.local/git/llvm-project.git revision a078c77d72082bf6a06486849735cdeaab1374bc) clang revision a078c77d72082bf6a06486849735cdeaab1374bc llvm revision a078c77d72082bf6a06486849735cdeaab1374bc LLDB library dir: /Users/buildslave/jenkins/workspace/lldb-cmake-sanitized/lldb-build/bin LLDB import library dir: /Users/buildslave/jenkins/workspace/lldb-cmake-sanitized/lldb-build/bin Traceback (most recent call last): File "/Users/buildslave/jenkins/workspace/lldb-cmake-sanitized/llvm-project/lldb/test/API/dotest.py", line 7, in <module> lldbsuite.test.run_suite() File "/Users/buildslave/jenkins/workspace/lldb-cmake-sanitized/llvm-project/lldb/packages/Python/lldbsuite/test/dotest.py", line 949, in run_suite import lldb File "/Users/buildslave/jenkins/workspace/lldb-cmake-sanitized/lldb-build/lib/python3.7/site-packages/lldb/__init__.py", line 41, in <module> from . import _lldb ImportError: dynamic module does not define init function (init_lldb)

Hide Details

******************** UNRESOLVED: lldb-api :: functionalities/breakpoint/breakpoint_language/TestBreakpointLanguage.py (1713 of 1794) ******************** TEST 'lldb-api :: functionalities/breakpoint/breakpoint_language/TestBreakpointLanguage.py' FAILED ******************** Unable to find 'RESULT: PASSED' in dotest output (exit code 1):

Hide Details

lldb version 10.0.99 (http://labmaster3.local/git/llvm-project.git revision a078c77d72082bf6a06486849735cdeaab1374bc) clang revision a078c77d72082bf6a06486849735cdeaab1374bc llvm revision a078c77d72082bf6a06486849735cdeaab1374bc LLDB library dir: /Users/buildslave/jenkins/workspace/lldb-cmake-sanitized/lldb-build/bin LLDB import library dir: /Users/buildslave/jenkins/workspace/lldb-cmake-sanitized/lldb-build/bin Traceback (most recent call last): File "/Users/buildslave/jenkins/workspace/lldb-cmake-sanitized/llvm-project/lldb/test/API/dotest.py", line 7, in <module> lldbsuite.test.run_suite() File "/Users/buildslave/jenkins/workspace/lldb-cmake-sanitized/llvm-project/lldb/packages/Python/lldbsuite/test/dotest.py", line 949, in run_suite import lldb File "/Users/buildslave/jenkins/workspace/lldb-cmake-sanitized/lldb-build/lib/python3.7/site-packages/lldb/__init__.py", line 41, in <module> from . import _lldb ImportError: dynamic module does not define init function (init_lldb)

Hide Details

******************** UNRESOLVED: lldb-api :: lang/objc/radar-9691614/TestObjCMethodReturningBOOL.py (1714 of 1794) ******************** TEST 'lldb-api :: lang/objc/radar-9691614/TestObjCMethodReturningBOOL.py' FAILED ******************** Unable to find 'RESULT: PASSED' in dotest output (exit code 1):

Hide Details

lldb version 10.0.99 (http://labmaster3.local/git/llvm-project.git revision a078c77d72082bf6a06486849735cdeaab1374bc) clang revision a078c77d72082bf6a06486849735cdeaab1374bc llvm revision a078c77d72082bf6a06486849735cdeaab1374bc LLDB library dir: /Users/buildslave/jenkins/workspace/lldb-cmake-sanitized/lldb-build/bin LLDB import library dir: /Users/buildslave/jenkins/workspace/lldb-cmake-sanitized/lldb-build/bin Traceback (most recent call last): File "/Users/buildslave/jenkins/workspace/lldb-cmake-sanitized/llvm-project/lldb/test/API/dotest.py", line 7, in <module> lldbsuite.test.run_suite() File "/Users/buildslave/jenkins/workspace/lldb-cmake-sanitized/llvm-project/lldb/packages/Python/lldbsuite/test/dotest.py", line 949, in run_suite import lldb File "/Users/buildslave/jenkins/workspace/lldb-cmake-sanitized/lldb-build/lib/python3.7/site-packages/lldb/__init__.py", line 41, in <module> from . import _lldb ImportError: dynamic module does not define init function (init_lldb)

Hide Details

******************** PASS: lldb-unit :: Utility/./UtilityTests/RangeTest.EqualInvalid (1715 of 1794) PASS: lldb-shell :: ObjectFile/ELF/netbsd-core-amd64.test (1716 of 1794) PASS: lldb-unit :: ObjectFile/Breakpad/./ObjectFileBreakpadTests/InfoRecord.parse (1717 of 1794) UNRESOLVED: lldb-api :: functionalities/darwin_log/filter/exact_match/activity/TestDarwinLogFilterMatchActivity.py (1718 of 1794) ******************** TEST 'lldb-api :: functionalities/darwin_log/filter/exact_match/activity/TestDarwinLogFilterMatchActivity.py' FAILED ******************** Unable to find 'RESULT: PASSED' in dotest output (exit code 1):

Hide Details

lldb version 10.0.99 (http://labmaster3.local/git/llvm-project.git revision a078c77d72082bf6a06486849735cdeaab1374bc) clang revision a078c77d72082bf6a06486849735cdeaab1374bc llvm revision a078c77d72082bf6a06486849735cdeaab1374bc LLDB library dir: /Users/buildslave/jenkins/workspace/lldb-cmake-sanitized/lldb-build/bin LLDB import library dir: /Users/buildslave/jenkins/workspace/lldb-cmake-sanitized/lldb-build/bin Traceback (most recent call last): File "/Users/buildslave/jenkins/workspace/lldb-cmake-sanitized/llvm-project/lldb/test/API/dotest.py", line 7, in <module> lldbsuite.test.run_suite() File "/Users/buildslave/jenkins/workspace/lldb-cmake-sanitized/llvm-project/lldb/packages/Python/lldbsuite/test/dotest.py", line 949, in run_suite import lldb File "/Users/buildslave/jenkins/workspace/lldb-cmake-sanitized/lldb-build/lib/python3.7/site-packages/lldb/__init__.py", line 41, in <module> from . import _lldb ImportError: dynamic module does not define init function (init_lldb)

Hide Details

******************** UNRESOLVED: lldb-api :: tools/lldb-server/TestGdbRemoteExitCode.py (1719 of 1794) ******************** TEST 'lldb-api :: tools/lldb-server/TestGdbRemoteExitCode.py' FAILED ******************** Unable to find 'RESULT: PASSED' in dotest output (exit code 1):

Hide Details

lldb version 10.0.99 (http://labmaster3.local/git/llvm-project.git revision a078c77d72082bf6a06486849735cdeaab1374bc) clang revision a078c77d72082bf6a06486849735cdeaab1374bc llvm revision a078c77d72082bf6a06486849735cdeaab1374bc LLDB library dir: /Users/buildslave/jenkins/workspace/lldb-cmake-sanitized/lldb-build/bin LLDB import library dir: /Users/buildslave/jenkins/workspace/lldb-cmake-sanitized/lldb-build/bin Traceback (most recent call last): File "/Users/buildslave/jenkins/workspace/lldb-cmake-sanitized/llvm-project/lldb/test/API/dotest.py", line 7, in <module> lldbsuite.test.run_suite() File "/Users/buildslave/jenkins/workspace/lldb-cmake-sanitized/llvm-project/lldb/packages/Python/lldbsuite/test/dotest.py", line 949, in run_suite import lldb File "/Users/buildslave/jenkins/workspace/lldb-cmake-sanitized/lldb-build/lib/python3.7/site-packages/lldb/__init__.py", line 41, in <module> from . import _lldb ImportError: dynamic module does not define init function (init_lldb)

Hide Details

******************** UNRESOLVED: lldb-api :: commands/expression/char/TestExprsChar.py (1720 of 1794) ******************** TEST 'lldb-api :: commands/expression/char/TestExprsChar.py' FAILED ******************** Unable to find 'RESULT: PASSED' in dotest output (exit code 1):

Hide Details

lldb version 10.0.99 (http://labmaster3.local/git/llvm-project.git revision a078c77d72082bf6a06486849735cdeaab1374bc) clang revision a078c77d72082bf6a06486849735cdeaab1374bc llvm revision a078c77d72082bf6a06486849735cdeaab1374bc LLDB library dir: /Users/buildslave/jenkins/workspace/lldb-cmake-sanitized/lldb-build/bin LLDB import library dir: /Users/buildslave/jenkins/workspace/lldb-cmake-sanitized/lldb-build/bin Traceback (most recent call last): File "/Users/buildslave/jenkins/workspace/lldb-cmake-sanitized/llvm-project/lldb/test/API/dotest.py", line 7, in <module> lldbsuite.test.run_suite() File "/Users/buildslave/jenkins/workspace/lldb-cmake-sanitized/llvm-project/lldb/packages/Python/lldbsuite/test/dotest.py", line 949, in run_suite import lldb File "/Users/buildslave/jenkins/workspace/lldb-cmake-sanitized/lldb-build/lib/python3.7/site-packages/lldb/__init__.py", line 41, in <module> from . import _lldb ImportError: dynamic module does not define init function (init_lldb)

Hide Details

******************** PASS: lldb-unit :: Utility/./UtilityTests/DataExtractorTest.GetCStrAtEnd (1721 of 1794) PASS: lldb-unit :: ScriptInterpreter/Python/./ScriptInterpreterPythonTests/PythonDataObjectsTest.TestPythonCallableCheck (1722 of 1794) UNRESOLVED: lldb-api :: commands/expression/ir-interpreter-phi-nodes/TestIRInterpreterPHINodes.py (1723 of 1794) ******************** TEST 'lldb-api :: commands/expression/ir-interpreter-phi-nodes/TestIRInterpreterPHINodes.py' FAILED ******************** Unable to find 'RESULT: PASSED' in dotest output (exit code 1):

Hide Details

lldb version 10.0.99 (http://labmaster3.local/git/llvm-project.git revision a078c77d72082bf6a06486849735cdeaab1374bc) clang revision a078c77d72082bf6a06486849735cdeaab1374bc llvm revision a078c77d72082bf6a06486849735cdeaab1374bc LLDB library dir: /Users/buildslave/jenkins/workspace/lldb-cmake-sanitized/lldb-build/bin LLDB import library dir: /Users/buildslave/jenkins/workspace/lldb-cmake-sanitized/lldb-build/bin Traceback (most recent call last): File "/Users/buildslave/jenkins/workspace/lldb-cmake-sanitized/llvm-project/lldb/test/API/dotest.py", line 7, in <module> lldbsuite.test.run_suite() File "/Users/buildslave/jenkins/workspace/lldb-cmake-sanitized/llvm-project/lldb/packages/Python/lldbsuite/test/dotest.py", line 949, in run_suite import lldb File "/Users/buildslave/jenkins/workspace/lldb-cmake-sanitized/lldb-build/lib/python3.7/site-packages/lldb/__init__.py", line 41, in <module> from . import _lldb ImportError: dynamic module does not define init function (init_lldb)

Hide Details

******************** UNRESOLVED: lldb-api :: functionalities/data-formatter/data-formatter-objc/nsstring/TestDataFormatterNSString.py (1724 of 1794) ******************** TEST 'lldb-api :: functionalities/data-formatter/data-formatter-objc/nsstring/TestDataFormatterNSString.py' FAILED ******************** Unable to find 'RESULT: PASSED' in dotest output (exit code 1):

Hide Details

lldb version 10.0.99 (http://labmaster3.local/git/llvm-project.git revision a078c77d72082bf6a06486849735cdeaab1374bc) clang revision a078c77d72082bf6a06486849735cdeaab1374bc llvm revision a078c77d72082bf6a06486849735cdeaab1374bc LLDB library dir: /Users/buildslave/jenkins/workspace/lldb-cmake-sanitized/lldb-build/bin LLDB import library dir: /Users/buildslave/jenkins/workspace/lldb-cmake-sanitized/lldb-build/bin Traceback (most recent call last): File "/Users/buildslave/jenkins/workspace/lldb-cmake-sanitized/llvm-project/lldb/test/API/dotest.py", line 7, in <module> lldbsuite.test.run_suite() File "/Users/buildslave/jenkins/workspace/lldb-cmake-sanitized/llvm-project/lldb/packages/Python/lldbsuite/test/dotest.py", line 949, in run_suite import lldb File "/Users/buildslave/jenkins/workspace/lldb-cmake-sanitized/lldb-build/lib/python3.7/site-packages/lldb/__init__.py", line 41, in <module> from . import _lldb ImportError: dynamic module does not define init function (init_lldb)

Hide Details

******************** PASS: lldb-shell :: Breakpoint/single-file-split-dwarf.test (1725 of 1794) UNRESOLVED: lldb-api :: functionalities/load_using_paths/TestLoadUsingPaths.py (1726 of 1794) ******************** TEST 'lldb-api :: functionalities/load_using_paths/TestLoadUsingPaths.py' FAILED ******************** Unable to find 'RESULT: PASSED' in dotest output (exit code 1):

Hide Details

lldb version 10.0.99 (http://labmaster3.local/git/llvm-project.git revision a078c77d72082bf6a06486849735cdeaab1374bc) clang revision a078c77d72082bf6a06486849735cdeaab1374bc llvm revision a078c77d72082bf6a06486849735cdeaab1374bc LLDB library dir: /Users/buildslave/jenkins/workspace/lldb-cmake-sanitized/lldb-build/bin LLDB import library dir: /Users/buildslave/jenkins/workspace/lldb-cmake-sanitized/lldb-build/bin Traceback (most recent call last): File "/Users/buildslave/jenkins/workspace/lldb-cmake-sanitized/llvm-project/lldb/test/API/dotest.py", line 7, in <module> lldbsuite.test.run_suite() File "/Users/buildslave/jenkins/workspace/lldb-cmake-sanitized/llvm-project/lldb/packages/Python/lldbsuite/test/dotest.py", line 949, in run_suite import lldb File "/Users/buildslave/jenkins/workspace/lldb-cmake-sanitized/lldb-build/lib/python3.7/site-packages/lldb/__init__.py", line 41, in <module> from . import _lldb ImportError: dynamic module does not define init function (init_lldb)

Hide Details

******************** PASS: lldb-unit :: Breakpoint/./LLDBBreakpointTests/BreakpointIDTest.StringIsBreakpointName (1727 of 1794) UNRESOLVED: lldb-api :: lang/cpp/function_refs/TestFunctionRefs.py (1728 of 1794) ******************** TEST 'lldb-api :: lang/cpp/function_refs/TestFunctionRefs.py' FAILED ******************** Unable to find 'RESULT: PASSED' in dotest output (exit code 1):

Hide Details

lldb version 10.0.99 (http://labmaster3.local/git/llvm-project.git revision a078c77d72082bf6a06486849735cdeaab1374bc) clang revision a078c77d72082bf6a06486849735cdeaab1374bc llvm revision a078c77d72082bf6a06486849735cdeaab1374bc LLDB library dir: /Users/buildslave/jenkins/workspace/lldb-cmake-sanitized/lldb-build/bin LLDB import library dir: /Users/buildslave/jenkins/workspace/lldb-cmake-sanitized/lldb-build/bin Traceback (most recent call last): File "/Users/buildslave/jenkins/workspace/lldb-cmake-sanitized/llvm-project/lldb/test/API/dotest.py", line 7, in <module> lldbsuite.test.run_suite() File "/Users/buildslave/jenkins/workspace/lldb-cmake-sanitized/llvm-project/lldb/packages/Python/lldbsuite/test/dotest.py", line 949, in run_suite import lldb File "/Users/buildslave/jenkins/workspace/lldb-cmake-sanitized/lldb-build/lib/python3.7/site-packages/lldb/__init__.py", line 41, in <module> from . import _lldb ImportError: dynamic module does not define init function (init_lldb)

Hide Details

******************** PASS: lldb-unit :: Utility/./UtilityTests/BinaryStreamTest.PutULEB128FiveBytes (1729 of 1794) PASS: lldb-unit :: Utility/./UtilityTests/StringLexerTest.GetUnlexed (1730 of 1794) UNRESOLVED: lldb-api :: commands/frame/diagnose/complicated-expression/TestComplicatedExpression.py (1731 of 1794) ******************** TEST 'lldb-api :: commands/frame/diagnose/complicated-expression/TestComplicatedExpression.py' FAILED ******************** Unable to find 'RESULT: PASSED' in dotest output (exit code 1):

Hide Details

lldb version 10.0.99 (http://labmaster3.local/git/llvm-project.git revision a078c77d72082bf6a06486849735cdeaab1374bc) clang revision a078c77d72082bf6a06486849735cdeaab1374bc llvm revision a078c77d72082bf6a06486849735cdeaab1374bc LLDB library dir: /Users/buildslave/jenkins/workspace/lldb-cmake-sanitized/lldb-build/bin LLDB import library dir: /Users/buildslave/jenkins/workspace/lldb-cmake-sanitized/lldb-build/bin Traceback (most recent call last): File "/Users/buildslave/jenkins/workspace/lldb-cmake-sanitized/llvm-project/lldb/test/API/dotest.py", line 7, in <module> lldbsuite.test.run_suite() File "/Users/buildslave/jenkins/workspace/lldb-cmake-sanitized/llvm-project/lldb/packages/Python/lldbsuite/test/dotest.py", line 949, in run_suite import lldb File "/Users/buildslave/jenkins/workspace/lldb-cmake-sanitized/lldb-build/lib/python3.7/site-packages/lldb/__init__.py", line 41, in <module> from . import _lldb ImportError: dynamic module does not define init function (init_lldb)

Hide Details

******************** UNRESOLVED: lldb-api :: commands/watchpoints/watchpoint_commands/command/TestWatchpointCommandPython.py (1732 of 1794) ******************** TEST 'lldb-api :: commands/watchpoints/watchpoint_commands/command/TestWatchpointCommandPython.py' FAILED ******************** Unable to find 'RESULT: PASSED' in dotest output (exit code 1):

Hide Details

lldb version 10.0.99 (http://labmaster3.local/git/llvm-project.git revision a078c77d72082bf6a06486849735cdeaab1374bc) clang revision a078c77d72082bf6a06486849735cdeaab1374bc llvm revision a078c77d72082bf6a06486849735cdeaab1374bc LLDB library dir: /Users/buildslave/jenkins/workspace/lldb-cmake-sanitized/lldb-build/bin LLDB import library dir: /Users/buildslave/jenkins/workspace/lldb-cmake-sanitized/lldb-build/bin Traceback (most recent call last): File "/Users/buildslave/jenkins/workspace/lldb-cmake-sanitized/llvm-project/lldb/test/API/dotest.py", line 7, in <module> lldbsuite.test.run_suite() File "/Users/buildslave/jenkins/workspace/lldb-cmake-sanitized/llvm-project/lldb/packages/Python/lldbsuite/test/dotest.py", line 949, in run_suite import lldb File "/Users/buildslave/jenkins/workspace/lldb-cmake-sanitized/lldb-build/lib/python3.7/site-packages/lldb/__init__.py", line 41, in <module> from . import _lldb ImportError: dynamic module does not define init function (init_lldb)

Hide Details

******************** PASS: lldb-unit :: Utility/./UtilityTests/BinaryStreamTest.PutULEB128NineBytes (1733 of 1794) UNRESOLVED: lldb-api :: commands/expression/import-std-module/shared_ptr/TestSharedPtr.py (1734 of 1794) ******************** TEST 'lldb-api :: commands/expression/import-std-module/shared_ptr/TestSharedPtr.py' FAILED ******************** Unable to find 'RESULT: PASSED' in dotest output (exit code 1):

Hide Details

lldb version 10.0.99 (http://labmaster3.local/git/llvm-project.git revision a078c77d72082bf6a06486849735cdeaab1374bc) clang revision a078c77d72082bf6a06486849735cdeaab1374bc llvm revision a078c77d72082bf6a06486849735cdeaab1374bc LLDB library dir: /Users/buildslave/jenkins/workspace/lldb-cmake-sanitized/lldb-build/bin LLDB import library dir: /Users/buildslave/jenkins/workspace/lldb-cmake-sanitized/lldb-build/bin Traceback (most recent call last): File "/Users/buildslave/jenkins/workspace/lldb-cmake-sanitized/llvm-project/lldb/test/API/dotest.py", line 7, in <module> lldbsuite.test.run_suite() File "/Users/buildslave/jenkins/workspace/lldb-cmake-sanitized/llvm-project/lldb/packages/Python/lldbsuite/test/dotest.py", line 949, in run_suite import lldb File "/Users/buildslave/jenkins/workspace/lldb-cmake-sanitized/lldb-build/lib/python3.7/site-packages/lldb/__init__.py", line 41, in <module> from . import _lldb ImportError: dynamic module does not define init function (init_lldb)

Hide Details

******************** PASS: lldb-unit :: Expression/./ExpressionTests/CppModuleConfigurationTest.Xcode (1735 of 1794) PASS: lldb-unit :: ScriptInterpreter/Python/./ScriptInterpreterPythonTests/PythonDataObjectsTest.TestPythonCallableInvoke (1736 of 1794) UNRESOLVED: lldb-api :: lang/cpp/namespace_definitions/TestNamespaceDefinitions.py (1737 of 1794) ******************** TEST 'lldb-api :: lang/cpp/namespace_definitions/TestNamespaceDefinitions.py' FAILED ******************** Unable to find 'RESULT: PASSED' in dotest output (exit code 1):

Hide Details

lldb version 10.0.99 (http://labmaster3.local/git/llvm-project.git revision a078c77d72082bf6a06486849735cdeaab1374bc) clang revision a078c77d72082bf6a06486849735cdeaab1374bc llvm revision a078c77d72082bf6a06486849735cdeaab1374bc LLDB library dir: /Users/buildslave/jenkins/workspace/lldb-cmake-sanitized/lldb-build/bin LLDB import library dir: /Users/buildslave/jenkins/workspace/lldb-cmake-sanitized/lldb-build/bin Traceback (most recent call last): File "/Users/buildslave/jenkins/workspace/lldb-cmake-sanitized/llvm-project/lldb/test/API/dotest.py", line 7, in <module> lldbsuite.test.run_suite() File "/Users/buildslave/jenkins/workspace/lldb-cmake-sanitized/llvm-project/lldb/packages/Python/lldbsuite/test/dotest.py", line 949, in run_suite import lldb File "/Users/buildslave/jenkins/workspace/lldb-cmake-sanitized/lldb-build/lib/python3.7/site-packages/lldb/__init__.py", line 41, in <module> from . import _lldb ImportError: dynamic module does not define init function (init_lldb)

Hide Details

******************** UNRESOLVED: lldb-api :: commands/watchpoints/hello_watchlocation/TestWatchLocation.py (1738 of 1794) ******************** TEST 'lldb-api :: commands/watchpoints/hello_watchlocation/TestWatchLocation.py' FAILED ******************** Unable to find 'RESULT: PASSED' in dotest output (exit code 1):

Hide Details

lldb version 10.0.99 (http://labmaster3.local/git/llvm-project.git revision a078c77d72082bf6a06486849735cdeaab1374bc) clang revision a078c77d72082bf6a06486849735cdeaab1374bc llvm revision a078c77d72082bf6a06486849735cdeaab1374bc LLDB library dir: /Users/buildslave/jenkins/workspace/lldb-cmake-sanitized/lldb-build/bin LLDB import library dir: /Users/buildslave/jenkins/workspace/lldb-cmake-sanitized/lldb-build/bin Traceback (most recent call last): File "/Users/buildslave/jenkins/workspace/lldb-cmake-sanitized/llvm-project/lldb/test/API/dotest.py", line 7, in <module> lldbsuite.test.run_suite() File "/Users/buildslave/jenkins/workspace/lldb-cmake-sanitized/llvm-project/lldb/packages/Python/lldbsuite/test/dotest.py", line 949, in run_suite import lldb File "/Users/buildslave/jenkins/workspace/lldb-cmake-sanitized/lldb-build/lib/python3.7/site-packages/lldb/__init__.py", line 41, in <module> from . import _lldb ImportError: dynamic module does not define init function (init_lldb)

Hide Details

******************** UNRESOLVED: lldb-api :: commands/expression/test/TestExprs2.py (1739 of 1794) ******************** TEST 'lldb-api :: commands/expression/test/TestExprs2.py' FAILED ******************** Unable to find 'RESULT: PASSED' in dotest output (exit code 1):

Hide Details

lldb version 10.0.99 (http://labmaster3.local/git/llvm-project.git revision a078c77d72082bf6a06486849735cdeaab1374bc) clang revision a078c77d72082bf6a06486849735cdeaab1374bc llvm revision a078c77d72082bf6a06486849735cdeaab1374bc LLDB library dir: /Users/buildslave/jenkins/workspace/lldb-cmake-sanitized/lldb-build/bin LLDB import library dir: /Users/buildslave/jenkins/workspace/lldb-cmake-sanitized/lldb-build/bin Traceback (most recent call last): File "/Users/buildslave/jenkins/workspace/lldb-cmake-sanitized/llvm-project/lldb/test/API/dotest.py", line 7, in <module> lldbsuite.test.run_suite() File "/Users/buildslave/jenkins/workspace/lldb-cmake-sanitized/llvm-project/lldb/packages/Python/lldbsuite/test/dotest.py", line 949, in run_suite import lldb File "/Users/buildslave/jenkins/workspace/lldb-cmake-sanitized/lldb-build/lib/python3.7/site-packages/lldb/__init__.py", line 41, in <module> from . import _lldb ImportError: dynamic module does not define init function (init_lldb)

Hide Details

******************** UNRESOLVED: lldb-api :: lang/objc/objc-class-method/TestObjCClassMethod.py (1740 of 1794) ******************** TEST 'lldb-api :: lang/objc/objc-class-method/TestObjCClassMethod.py' FAILED ******************** Unable to find 'RESULT: PASSED' in dotest output (exit code 1):

Hide Details

lldb version 10.0.99 (http://labmaster3.local/git/llvm-project.git revision a078c77d72082bf6a06486849735cdeaab1374bc) clang revision a078c77d72082bf6a06486849735cdeaab1374bc llvm revision a078c77d72082bf6a06486849735cdeaab1374bc LLDB library dir: /Users/buildslave/jenkins/workspace/lldb-cmake-sanitized/lldb-build/bin LLDB import library dir: /Users/buildslave/jenkins/workspace/lldb-cmake-sanitized/lldb-build/bin Traceback (most recent call last): File "/Users/buildslave/jenkins/workspace/lldb-cmake-sanitized/llvm-project/lldb/test/API/dotest.py", line 7, in <module> lldbsuite.test.run_suite() File "/Users/buildslave/jenkins/workspace/lldb-cmake-sanitized/llvm-project/lldb/packages/Python/lldbsuite/test/dotest.py", line 949, in run_suite import lldb File "/Users/buildslave/jenkins/workspace/lldb-cmake-sanitized/lldb-build/lib/python3.7/site-packages/lldb/__init__.py", line 41, in <module> from . import _lldb ImportError: dynamic module does not define init function (init_lldb)

Hide Details

******************** PASS: lldb-unit :: UnwindAssembly/x86/./UnwindAssemblyx86Tests/Testx86AssemblyInspectionEngine.TestSimple32bitFrameFunction (1741 of 1794) PASS: lldb-unit :: ScriptInterpreter/Python/./ScriptInterpreterPythonTests/PythonDataObjectsTest.TestDictionaryResolutionWithDot (1742 of 1794) UNRESOLVED: lldb-api :: functionalities/breakpoint/objc/TestObjCBreakpoints.py (1743 of 1794) ******************** TEST 'lldb-api :: functionalities/breakpoint/objc/TestObjCBreakpoints.py' FAILED ******************** Unable to find 'RESULT: PASSED' in dotest output (exit code 1):

Hide Details

lldb version 10.0.99 (http://labmaster3.local/git/llvm-project.git revision a078c77d72082bf6a06486849735cdeaab1374bc) clang revision a078c77d72082bf6a06486849735cdeaab1374bc llvm revision a078c77d72082bf6a06486849735cdeaab1374bc LLDB library dir: /Users/buildslave/jenkins/workspace/lldb-cmake-sanitized/lldb-build/bin LLDB import library dir: /Users/buildslave/jenkins/workspace/lldb-cmake-sanitized/lldb-build/bin Traceback (most recent call last): File "/Users/buildslave/jenkins/workspace/lldb-cmake-sanitized/llvm-project/lldb/test/API/dotest.py", line 7, in <module> lldbsuite.test.run_suite() File "/Users/buildslave/jenkins/workspace/lldb-cmake-sanitized/llvm-project/lldb/packages/Python/lldbsuite/test/dotest.py", line 949, in run_suite import lldb File "/Users/buildslave/jenkins/workspace/lldb-cmake-sanitized/lldb-build/lib/python3.7/site-packages/lldb/__init__.py", line 41, in <module> from . import _lldb ImportError: dynamic module does not define init function (init_lldb)

Hide Details

******************** PASS: lldb-unit :: Utility/./UtilityTests/ConstStringTest.CompareConstString (1744 of 1794) PASS: lldb-unit :: Utility/./UtilityTests/NameMatchesTest.RegularExpression (1745 of 1794) UNRESOLVED: lldb-api :: python_api/file_handle/TestFileHandle.py (1746 of 1794) ******************** TEST 'lldb-api :: python_api/file_handle/TestFileHandle.py' FAILED ******************** Unable to find 'RESULT: PASSED' in dotest output (exit code 1):

Hide Details

lldb version 10.0.99 (http://labmaster3.local/git/llvm-project.git revision a078c77d72082bf6a06486849735cdeaab1374bc) clang revision a078c77d72082bf6a06486849735cdeaab1374bc llvm revision a078c77d72082bf6a06486849735cdeaab1374bc LLDB library dir: /Users/buildslave/jenkins/workspace/lldb-cmake-sanitized/lldb-build/bin LLDB import library dir: /Users/buildslave/jenkins/workspace/lldb-cmake-sanitized/lldb-build/bin Traceback (most recent call last): File "/Users/buildslave/jenkins/workspace/lldb-cmake-sanitized/llvm-project/lldb/test/API/dotest.py", line 7, in <module> lldbsuite.test.run_suite() File "/Users/buildslave/jenkins/workspace/lldb-cmake-sanitized/llvm-project/lldb/packages/Python/lldbsuite/test/dotest.py", line 949, in run_suite import lldb File "/Users/buildslave/jenkins/workspace/lldb-cmake-sanitized/lldb-build/lib/python3.7/site-packages/lldb/__init__.py", line 41, in <module> from . import _lldb ImportError: dynamic module does not define init function (init_lldb)

Hide Details

******************** UNRESOLVED: lldb-api :: functionalities/dead-strip/TestDeadStrip.py (1747 of 1794) ******************** TEST 'lldb-api :: functionalities/dead-strip/TestDeadStrip.py' FAILED ******************** Unable to find 'RESULT: PASSED' in dotest output (exit code 1):

Hide Details

lldb version 10.0.99 (http://labmaster3.local/git/llvm-project.git revision a078c77d72082bf6a06486849735cdeaab1374bc) clang revision a078c77d72082bf6a06486849735cdeaab1374bc llvm revision a078c77d72082bf6a06486849735cdeaab1374bc LLDB library dir: /Users/buildslave/jenkins/workspace/lldb-cmake-sanitized/lldb-build/bin LLDB import library dir: /Users/buildslave/jenkins/workspace/lldb-cmake-sanitized/lldb-build/bin Traceback (most recent call last): File "/Users/buildslave/jenkins/workspace/lldb-cmake-sanitized/llvm-project/lldb/test/API/dotest.py", line 7, in <module> lldbsuite.test.run_suite() File "/Users/buildslave/jenkins/workspace/lldb-cmake-sanitized/llvm-project/lldb/packages/Python/lldbsuite/test/dotest.py", line 949, in run_suite import lldb File "/Users/buildslave/jenkins/workspace/lldb-cmake-sanitized/lldb-build/lib/python3.7/site-packages/lldb/__init__.py", line 41, in <module> from . import _lldb ImportError: dynamic module does not define init function (init_lldb)

Hide Details

******************** UNRESOLVED: lldb-api :: macosx/order/TestOrderFile.py (1748 of 1794) ******************** TEST 'lldb-api :: macosx/order/TestOrderFile.py' FAILED ******************** Unable to find 'RESULT: PASSED' in dotest output (exit code 1):

Hide Details

lldb version 10.0.99 (http://labmaster3.local/git/llvm-project.git revision a078c77d72082bf6a06486849735cdeaab1374bc) clang revision a078c77d72082bf6a06486849735cdeaab1374bc llvm revision a078c77d72082bf6a06486849735cdeaab1374bc LLDB library dir: /Users/buildslave/jenkins/workspace/lldb-cmake-sanitized/lldb-build/bin LLDB import library dir: /Users/buildslave/jenkins/workspace/lldb-cmake-sanitized/lldb-build/bin Traceback (most recent call last): File "/Users/buildslave/jenkins/workspace/lldb-cmake-sanitized/llvm-project/lldb/test/API/dotest.py", line 7, in <module> lldbsuite.test.run_suite() File "/Users/buildslave/jenkins/workspace/lldb-cmake-sanitized/llvm-project/lldb/packages/Python/lldbsuite/test/dotest.py", line 949, in run_suite import lldb File "/Users/buildslave/jenkins/workspace/lldb-cmake-sanitized/lldb-build/lib/python3.7/site-packages/lldb/__init__.py", line 41, in <module> from . import _lldb ImportError: dynamic module does not define init function (init_lldb)

Hide Details

******************** PASS: lldb-shell :: ObjectFile/ELF/PT_TLS-overlap-PT_LOAD.yaml (1749 of 1794) PASS: lldb-unit :: Utility/./UtilityTests/StringListTest.ForRangeEmpty (1750 of 1794) PASS: lldb-unit :: Utility/./UtilityTests/DataExtractorTest.GetMaxU64_unchecked (1751 of 1794) PASS: lldb-unit :: Utility/./UtilityTests/LogChannelTest.Disable (1752 of 1794) UNRESOLVED: lldb-api :: python_api/value/change_values/TestChangeValueAPI.py (1753 of 1794) ******************** TEST 'lldb-api :: python_api/value/change_values/TestChangeValueAPI.py' FAILED ******************** Unable to find 'RESULT: PASSED' in dotest output (exit code 1):

Hide Details

lldb version 10.0.99 (http://labmaster3.local/git/llvm-project.git revision a078c77d72082bf6a06486849735cdeaab1374bc) clang revision a078c77d72082bf6a06486849735cdeaab1374bc llvm revision a078c77d72082bf6a06486849735cdeaab1374bc LLDB library dir: /Users/buildslave/jenkins/workspace/lldb-cmake-sanitized/lldb-build/bin LLDB import library dir: /Users/buildslave/jenkins/workspace/lldb-cmake-sanitized/lldb-build/bin Traceback (most recent call last): File "/Users/buildslave/jenkins/workspace/lldb-cmake-sanitized/llvm-project/lldb/test/API/dotest.py", line 7, in <module> lldbsuite.test.run_suite() File "/Users/buildslave/jenkins/workspace/lldb-cmake-sanitized/llvm-project/lldb/packages/Python/lldbsuite/test/dotest.py", line 949, in run_suite import lldb File "/Users/buildslave/jenkins/workspace/lldb-cmake-sanitized/lldb-build/lib/python3.7/site-packages/lldb/__init__.py", line 41, in <module> from . import _lldb ImportError: dynamic module does not define init function (init_lldb)

Hide Details

******************** UNRESOLVED: lldb-api :: functionalities/breakpoint/serialize/TestBreakpointSerialization.py (1754 of 1794) ******************** TEST 'lldb-api :: functionalities/breakpoint/serialize/TestBreakpointSerialization.py' FAILED ******************** Unable to find 'RESULT: PASSED' in dotest output (exit code 1):

Hide Details

lldb version 10.0.99 (http://labmaster3.local/git/llvm-project.git revision a078c77d72082bf6a06486849735cdeaab1374bc) clang revision a078c77d72082bf6a06486849735cdeaab1374bc llvm revision a078c77d72082bf6a06486849735cdeaab1374bc LLDB library dir: /Users/buildslave/jenkins/workspace/lldb-cmake-sanitized/lldb-build/bin LLDB import library dir: /Users/buildslave/jenkins/workspace/lldb-cmake-sanitized/lldb-build/bin Traceback (most recent call last): File "/Users/buildslave/jenkins/workspace/lldb-cmake-sanitized/llvm-project/lldb/test/API/dotest.py", line 7, in <module> lldbsuite.test.run_suite() File "/Users/buildslave/jenkins/workspace/lldb-cmake-sanitized/llvm-project/lldb/packages/Python/lldbsuite/test/dotest.py", line 949, in run_suite import lldb File "/Users/buildslave/jenkins/workspace/lldb-cmake-sanitized/lldb-build/lib/python3.7/site-packages/lldb/__init__.py", line 41, in <module> from . import _lldb ImportError: dynamic module does not define init function (init_lldb)

Hide Details

******************** PASS: lldb-unit :: Utility/./UtilityTests/VASprintfTest.BufferResize (1755 of 1794) PASS: lldb-unit :: ScriptInterpreter/Python/./ScriptInterpreterPythonTests/PythonDataObjectsTest.TestGlobalNameResolutionWithDot (1756 of 1794) UNRESOLVED: lldb-api :: functionalities/darwin_log/source/debug/TestDarwinLogSourceDebug.py (1757 of 1794) ******************** TEST 'lldb-api :: functionalities/darwin_log/source/debug/TestDarwinLogSourceDebug.py' FAILED ******************** Unable to find 'RESULT: PASSED' in dotest output (exit code 1):

Hide Details

lldb version 10.0.99 (http://labmaster3.local/git/llvm-project.git revision a078c77d72082bf6a06486849735cdeaab1374bc) clang revision a078c77d72082bf6a06486849735cdeaab1374bc llvm revision a078c77d72082bf6a06486849735cdeaab1374bc LLDB library dir: /Users/buildslave/jenkins/workspace/lldb-cmake-sanitized/lldb-build/bin LLDB import library dir: /Users/buildslave/jenkins/workspace/lldb-cmake-sanitized/lldb-build/bin Traceback (most recent call last): File "/Users/buildslave/jenkins/workspace/lldb-cmake-sanitized/llvm-project/lldb/test/API/dotest.py", line 7, in <module> lldbsuite.test.run_suite() File "/Users/buildslave/jenkins/workspace/lldb-cmake-sanitized/llvm-project/lldb/packages/Python/lldbsuite/test/dotest.py", line 949, in run_suite import lldb File "/Users/buildslave/jenkins/workspace/lldb-cmake-sanitized/lldb-build/lib/python3.7/site-packages/lldb/__init__.py", line 41, in <module> from . import _lldb ImportError: dynamic module does not define init function (init_lldb)

Hide Details

******************** PASS: lldb-unit :: ScriptInterpreter/Python/./ScriptInterpreterPythonTests/PythonDataObjectsTest.TestObjectAttributes (1758 of 1794) PASS: lldb-unit :: tools/lldb-server/tests/./LLDBServerTests/TestBase.DebugserverEnv (1759 of 1794) PASS: lldb-unit :: Utility/./UtilityTests/BinaryStreamTest.PutSLEB128MaxValue (1760 of 1794) UNRESOLVED: lldb-api :: functionalities/postmortem/minidump-new/TestMiniDumpNew.py (1761 of 1794) ******************** TEST 'lldb-api :: functionalities/postmortem/minidump-new/TestMiniDumpNew.py' FAILED ******************** Unable to find 'RESULT: PASSED' in dotest output (exit code 1):

Hide Details

lldb version 10.0.99 (http://labmaster3.local/git/llvm-project.git revision a078c77d72082bf6a06486849735cdeaab1374bc) clang revision a078c77d72082bf6a06486849735cdeaab1374bc llvm revision a078c77d72082bf6a06486849735cdeaab1374bc LLDB library dir: /Users/buildslave/jenkins/workspace/lldb-cmake-sanitized/lldb-build/bin LLDB import library dir: /Users/buildslave/jenkins/workspace/lldb-cmake-sanitized/lldb-build/bin Traceback (most recent call last): File "/Users/buildslave/jenkins/workspace/lldb-cmake-sanitized/llvm-project/lldb/test/API/dotest.py", line 7, in <module> lldbsuite.test.run_suite() File "/Users/buildslave/jenkins/workspace/lldb-cmake-sanitized/llvm-project/lldb/packages/Python/lldbsuite/test/dotest.py", line 949, in run_suite import lldb File "/Users/buildslave/jenkins/workspace/lldb-cmake-sanitized/lldb-build/lib/python3.7/site-packages/lldb/__init__.py", line 41, in <module> from . import _lldb ImportError: dynamic module does not define init function (init_lldb)

Hide Details

******************** UNRESOLVED: lldb-api :: python_api/section/TestSectionAPI.py (1762 of 1794) ******************** TEST 'lldb-api :: python_api/section/TestSectionAPI.py' FAILED ******************** Unable to find 'RESULT: PASSED' in dotest output (exit code 1):

Hide Details

lldb version 10.0.99 (http://labmaster3.local/git/llvm-project.git revision a078c77d72082bf6a06486849735cdeaab1374bc) clang revision a078c77d72082bf6a06486849735cdeaab1374bc llvm revision a078c77d72082bf6a06486849735cdeaab1374bc LLDB library dir: /Users/buildslave/jenkins/workspace/lldb-cmake-sanitized/lldb-build/bin LLDB import library dir: /Users/buildslave/jenkins/workspace/lldb-cmake-sanitized/lldb-build/bin Traceback (most recent call last): File "/Users/buildslave/jenkins/workspace/lldb-cmake-sanitized/llvm-project/lldb/test/API/dotest.py", line 7, in <module> lldbsuite.test.run_suite() File "/Users/buildslave/jenkins/workspace/lldb-cmake-sanitized/llvm-project/lldb/packages/Python/lldbsuite/test/dotest.py", line 949, in run_suite import lldb File "/Users/buildslave/jenkins/workspace/lldb-cmake-sanitized/lldb-build/lib/python3.7/site-packages/lldb/__init__.py", line 41, in <module> from . import _lldb ImportError: dynamic module does not define init function (init_lldb)

Hide Details

******************** UNRESOLVED: lldb-api :: functionalities/breakpoint/inlined_breakpoints/TestInlinedBreakpoints.py (1763 of 1794) ******************** TEST 'lldb-api :: functionalities/breakpoint/inlined_breakpoints/TestInlinedBreakpoints.py' FAILED ******************** Unable to find 'RESULT: PASSED' in dotest output (exit code 1):

Hide Details

lldb version 10.0.99 (http://labmaster3.local/git/llvm-project.git revision a078c77d72082bf6a06486849735cdeaab1374bc) clang revision a078c77d72082bf6a06486849735cdeaab1374bc llvm revision a078c77d72082bf6a06486849735cdeaab1374bc LLDB library dir: /Users/buildslave/jenkins/workspace/lldb-cmake-sanitized/lldb-build/bin LLDB import library dir: /Users/buildslave/jenkins/workspace/lldb-cmake-sanitized/lldb-build/bin Traceback (most recent call last): File "/Users/buildslave/jenkins/workspace/lldb-cmake-sanitized/llvm-project/lldb/test/API/dotest.py", line 7, in <module> lldbsuite.test.run_suite() File "/Users/buildslave/jenkins/workspace/lldb-cmake-sanitized/llvm-project/lldb/packages/Python/lldbsuite/test/dotest.py", line 949, in run_suite import lldb File "/Users/buildslave/jenkins/workspace/lldb-cmake-sanitized/lldb-build/lib/python3.7/site-packages/lldb/__init__.py", line 41, in <module> from . import _lldb ImportError: dynamic module does not define init function (init_lldb)

Hide Details

******************** UNRESOLVED: lldb-api :: lang/cpp/scope/TestCppScope.py (1764 of 1794) ******************** TEST 'lldb-api :: lang/cpp/scope/TestCppScope.py' FAILED ******************** Unable to find 'RESULT: PASSED' in dotest output (exit code 1):

Hide Details

lldb version 10.0.99 (http://labmaster3.local/git/llvm-project.git revision a078c77d72082bf6a06486849735cdeaab1374bc) clang revision a078c77d72082bf6a06486849735cdeaab1374bc llvm revision a078c77d72082bf6a06486849735cdeaab1374bc LLDB library dir: /Users/buildslave/jenkins/workspace/lldb-cmake-sanitized/lldb-build/bin LLDB import library dir: /Users/buildslave/jenkins/workspace/lldb-cmake-sanitized/lldb-build/bin Traceback (most recent call last): File "/Users/buildslave/jenkins/workspace/lldb-cmake-sanitized/llvm-project/lldb/test/API/dotest.py", line 7, in <module> lldbsuite.test.run_suite() File "/Users/buildslave/jenkins/workspace/lldb-cmake-sanitized/llvm-project/lldb/packages/Python/lldbsuite/test/dotest.py", line 949, in run_suite import lldb File "/Users/buildslave/jenkins/workspace/lldb-cmake-sanitized/lldb-build/lib/python3.7/site-packages/lldb/__init__.py", line 41, in <module> from . import _lldb ImportError: dynamic module does not define init function (init_lldb)

Hide Details

******************** UNRESOLVED: lldb-api :: lang/cpp/global_operators/TestCppGlobalOperators.py (1765 of 1794) ******************** TEST 'lldb-api :: lang/cpp/global_operators/TestCppGlobalOperators.py' FAILED ******************** Unable to find 'RESULT: PASSED' in dotest output (exit code 1):

Hide Details

lldb version 10.0.99 (http://labmaster3.local/git/llvm-project.git revision a078c77d72082bf6a06486849735cdeaab1374bc) clang revision a078c77d72082bf6a06486849735cdeaab1374bc llvm revision a078c77d72082bf6a06486849735cdeaab1374bc LLDB library dir: /Users/buildslave/jenkins/workspace/lldb-cmake-sanitized/lldb-build/bin LLDB import library dir: /Users/buildslave/jenkins/workspace/lldb-cmake-sanitized/lldb-build/bin Traceback (most recent call last): File "/Users/buildslave/jenkins/workspace/lldb-cmake-sanitized/llvm-project/lldb/test/API/dotest.py", line 7, in <module> lldbsuite.test.run_suite() File "/Users/buildslave/jenkins/workspace/lldb-cmake-sanitized/llvm-project/lldb/packages/Python/lldbsuite/test/dotest.py", line 949, in run_suite import lldb File "/Users/buildslave/jenkins/workspace/lldb-cmake-sanitized/lldb-build/lib/python3.7/site-packages/lldb/__init__.py", line 41, in <module> from . import _lldb ImportError: dynamic module does not define init function (init_lldb)

Hide Details

******************** UNRESOLVED: lldb-api :: lang/cpp/namespace/TestNamespace.py (1766 of 1794) ******************** TEST 'lldb-api :: lang/cpp/namespace/TestNamespace.py' FAILED ******************** Unable to find 'RESULT: PASSED' in dotest output (exit code 1):

Hide Details

lldb version 10.0.99 (http://labmaster3.local/git/llvm-project.git revision a078c77d72082bf6a06486849735cdeaab1374bc) clang revision a078c77d72082bf6a06486849735cdeaab1374bc llvm revision a078c77d72082bf6a06486849735cdeaab1374bc LLDB library dir: /Users/buildslave/jenkins/workspace/lldb-cmake-sanitized/lldb-build/bin LLDB import library dir: /Users/buildslave/jenkins/workspace/lldb-cmake-sanitized/lldb-build/bin Traceback (most recent call last): File "/Users/buildslave/jenkins/workspace/lldb-cmake-sanitized/llvm-project/lldb/test/API/dotest.py", line 7, in <module> lldbsuite.test.run_suite() File "/Users/buildslave/jenkins/workspace/lldb-cmake-sanitized/llvm-project/lldb/packages/Python/lldbsuite/test/dotest.py", line 949, in run_suite import lldb File "/Users/buildslave/jenkins/workspace/lldb-cmake-sanitized/lldb-build/lib/python3.7/site-packages/lldb/__init__.py", line 41, in <module> from . import _lldb ImportError: dynamic module does not define init function (init_lldb)

Hide Details

******************** PASS: lldb-unit :: Utility/./UtilityTests/OptionsWithRawTest.ArgsButNoLeadingDash (1767 of 1794) UNRESOLVED: lldb-api :: api/multiple-debuggers/TestMultipleDebuggers.py (1768 of 1794) ******************** TEST 'lldb-api :: api/multiple-debuggers/TestMultipleDebuggers.py' FAILED ******************** Unable to find 'RESULT: PASSED' in dotest output (exit code 1):

Hide Details

lldb version 10.0.99 (http://labmaster3.local/git/llvm-project.git revision a078c77d72082bf6a06486849735cdeaab1374bc) clang revision a078c77d72082bf6a06486849735cdeaab1374bc llvm revision a078c77d72082bf6a06486849735cdeaab1374bc LLDB library dir: /Users/buildslave/jenkins/workspace/lldb-cmake-sanitized/lldb-build/bin LLDB import library dir: /Users/buildslave/jenkins/workspace/lldb-cmake-sanitized/lldb-build/bin Traceback (most recent call last): File "/Users/buildslave/jenkins/workspace/lldb-cmake-sanitized/llvm-project/lldb/test/API/dotest.py", line 7, in <module> lldbsuite.test.run_suite() File "/Users/buildslave/jenkins/workspace/lldb-cmake-sanitized/llvm-project/lldb/packages/Python/lldbsuite/test/dotest.py", line 949, in run_suite import lldb File "/Users/buildslave/jenkins/workspace/lldb-cmake-sanitized/lldb-build/lib/python3.7/site-packages/lldb/__init__.py", line 41, in <module> from . import _lldb ImportError: dynamic module does not define init function (init_lldb)

Hide Details

******************** PASS: lldb-unit :: Interpreter/./InterpreterTests/OptionArgParserTest.toBoolean (1769 of 1794) UNRESOLVED: lldb-api :: functionalities/data-formatter/data-formatter-stl/libcxx/unordered/TestDataFormatterUnordered.py (1770 of 1794) ******************** TEST 'lldb-api :: functionalities/data-formatter/data-formatter-stl/libcxx/unordered/TestDataFormatterUnordered.py' FAILED ******************** Unable to find 'RESULT: PASSED' in dotest output (exit code 1):

Hide Details

lldb version 10.0.99 (http://labmaster3.local/git/llvm-project.git revision a078c77d72082bf6a06486849735cdeaab1374bc) clang revision a078c77d72082bf6a06486849735cdeaab1374bc llvm revision a078c77d72082bf6a06486849735cdeaab1374bc LLDB library dir: /Users/buildslave/jenkins/workspace/lldb-cmake-sanitized/lldb-build/bin LLDB import library dir: /Users/buildslave/jenkins/workspace/lldb-cmake-sanitized/lldb-build/bin Traceback (most recent call last): File "/Users/buildslave/jenkins/workspace/lldb-cmake-sanitized/llvm-project/lldb/test/API/dotest.py", line 7, in <module> lldbsuite.test.run_suite() File "/Users/buildslave/jenkins/workspace/lldb-cmake-sanitized/llvm-project/lldb/packages/Python/lldbsuite/test/dotest.py", line 949, in run_suite import lldb File "/Users/buildslave/jenkins/workspace/lldb-cmake-sanitized/lldb-build/lib/python3.7/site-packages/lldb/__init__.py", line 41, in <module> from . import _lldb ImportError: dynamic module does not define init function (init_lldb)

Hide Details

******************** UNRESOLVED: lldb-api :: functionalities/thread/concurrent_events/TestConcurrentManyBreakpoints.py (1771 of 1794) ******************** TEST 'lldb-api :: functionalities/thread/concurrent_events/TestConcurrentManyBreakpoints.py' FAILED ******************** Unable to find 'RESULT: PASSED' in dotest output (exit code 1):

Hide Details

lldb version 10.0.99 (http://labmaster3.local/git/llvm-project.git revision a078c77d72082bf6a06486849735cdeaab1374bc) clang revision a078c77d72082bf6a06486849735cdeaab1374bc llvm revision a078c77d72082bf6a06486849735cdeaab1374bc LLDB library dir: /Users/buildslave/jenkins/workspace/lldb-cmake-sanitized/lldb-build/bin LLDB import library dir: /Users/buildslave/jenkins/workspace/lldb-cmake-sanitized/lldb-build/bin Traceback (most recent call last): File "/Users/buildslave/jenkins/workspace/lldb-cmake-sanitized/llvm-project/lldb/test/API/dotest.py", line 7, in <module> lldbsuite.test.run_suite() File "/Users/buildslave/jenkins/workspace/lldb-cmake-sanitized/llvm-project/lldb/packages/Python/lldbsuite/test/dotest.py", line 949, in run_suite import lldb File "/Users/buildslave/jenkins/workspace/lldb-cmake-sanitized/lldb-build/lib/python3.7/site-packages/lldb/__init__.py", line 41, in <module> from . import _lldb ImportError: dynamic module does not define init function (init_lldb)

Hide Details

******************** PASS: lldb-unit :: Utility/./UtilityTests/StringExtractorTest.InitEmpty (1772 of 1794) PASS: lldb-unit :: Symbol/./SymbolTests/TestClangASTContext.TestUnifyAccessSpecifiers (1773 of 1794) UNRESOLVED: lldb-api :: functionalities/breakpoint/breakpoint_set_restart/TestBreakpointSetRestart.py (1774 of 1794) ******************** TEST 'lldb-api :: functionalities/breakpoint/breakpoint_set_restart/TestBreakpointSetRestart.py' FAILED ******************** Unable to find 'RESULT: PASSED' in dotest output (exit code 1):

Hide Details

lldb version 10.0.99 (http://labmaster3.local/git/llvm-project.git revision a078c77d72082bf6a06486849735cdeaab1374bc) clang revision a078c77d72082bf6a06486849735cdeaab1374bc llvm revision a078c77d72082bf6a06486849735cdeaab1374bc LLDB library dir: /Users/buildslave/jenkins/workspace/lldb-cmake-sanitized/lldb-build/bin LLDB import library dir: /Users/buildslave/jenkins/workspace/lldb-cmake-sanitized/lldb-build/bin Traceback (most recent call last): File "/Users/buildslave/jenkins/workspace/lldb-cmake-sanitized/llvm-project/lldb/test/API/dotest.py", line 7, in <module> lldbsuite.test.run_suite() File "/Users/buildslave/jenkins/workspace/lldb-cmake-sanitized/llvm-project/lldb/packages/Python/lldbsuite/test/dotest.py", line 949, in run_suite import lldb File "/Users/buildslave/jenkins/workspace/lldb-cmake-sanitized/lldb-build/lib/python3.7/site-packages/lldb/__init__.py", line 41, in <module> from . import _lldb ImportError: dynamic module does not define init function (init_lldb)

Hide Details

******************** PASS: lldb-shell :: Breakpoint/debug_rnglist_offset_pair.test (1775 of 1794) PASS: lldb-unit :: Utility/./UtilityTests/StringListTest.AppendStringCString (1776 of 1794) UNRESOLVED: lldb-api :: lang/c/function_types/TestFunctionTypes.py (1777 of 1794) ******************** TEST 'lldb-api :: lang/c/function_types/TestFunctionTypes.py' FAILED ******************** Unable to find 'RESULT: PASSED' in dotest output (exit code 1):

Hide Details

lldb version 10.0.99 (http://labmaster3.local/git/llvm-project.git revision a078c77d72082bf6a06486849735cdeaab1374bc) clang revision a078c77d72082bf6a06486849735cdeaab1374bc llvm revision a078c77d72082bf6a06486849735cdeaab1374bc LLDB library dir: /Users/buildslave/jenkins/workspace/lldb-cmake-sanitized/lldb-build/bin LLDB import library dir: /Users/buildslave/jenkins/workspace/lldb-cmake-sanitized/lldb-build/bin Traceback (most recent call last): File "/Users/buildslave/jenkins/workspace/lldb-cmake-sanitized/llvm-project/lldb/test/API/dotest.py", line 7, in <module> lldbsuite.test.run_suite() File "/Users/buildslave/jenkins/workspace/lldb-cmake-sanitized/llvm-project/lldb/packages/Python/lldbsuite/test/dotest.py", line 949, in run_suite import lldb File "/Users/buildslave/jenkins/workspace/lldb-cmake-sanitized/lldb-build/lib/python3.7/site-packages/lldb/__init__.py", line 41, in <module> from . import _lldb ImportError: dynamic module does not define init function (init_lldb)

Hide Details

******************** PASS: lldb-unit :: Utility/./UtilityTests/StringExtractorTest.GetU64BigEndian (1778 of 1794) UNRESOLVED: lldb-api :: macosx/macabi/TestMacABImacOSFramework.py (1779 of 1794) ******************** TEST 'lldb-api :: macosx/macabi/TestMacABImacOSFramework.py' FAILED ******************** Unable to find 'RESULT: PASSED' in dotest output (exit code 1):

Hide Details

lldb version 10.0.99 (http://labmaster3.local/git/llvm-project.git revision a078c77d72082bf6a06486849735cdeaab1374bc) clang revision a078c77d72082bf6a06486849735cdeaab1374bc llvm revision a078c77d72082bf6a06486849735cdeaab1374bc LLDB library dir: /Users/buildslave/jenkins/workspace/lldb-cmake-sanitized/lldb-build/bin LLDB import library dir: /Users/buildslave/jenkins/workspace/lldb-cmake-sanitized/lldb-build/bin Traceback (most recent call last): File "/Users/buildslave/jenkins/workspace/lldb-cmake-sanitized/llvm-project/lldb/test/API/dotest.py", line 7, in <module> lldbsuite.test.run_suite() File "/Users/buildslave/jenkins/workspace/lldb-cmake-sanitized/llvm-project/lldb/packages/Python/lldbsuite/test/dotest.py", line 949, in run_suite import lldb File "/Users/buildslave/jenkins/workspace/lldb-cmake-sanitized/lldb-build/lib/python3.7/site-packages/lldb/__init__.py", line 41, in <module> from . import _lldb ImportError: dynamic module does not define init function (init_lldb)

Hide Details

******************** PASS: lldb-unit :: Utility/./UtilityTests/ScalarTest.Scalar_512 (1780 of 1794) PASS: lldb-unit :: ObjectFile/Breakpad/./ObjectFileBreakpadTests/StackCFIRecord.parse (1781 of 1794) UNRESOLVED: lldb-api :: python_api/process/read-mem-cstring/TestReadMemCString.py (1782 of 1794) ******************** TEST 'lldb-api :: python_api/process/read-mem-cstring/TestReadMemCString.py' FAILED ******************** Unable to find 'RESULT: PASSED' in dotest output (exit code 1):

Hide Details

lldb version 10.0.99 (http://labmaster3.local/git/llvm-project.git revision a078c77d72082bf6a06486849735cdeaab1374bc) clang revision a078c77d72082bf6a06486849735cdeaab1374bc llvm revision a078c77d72082bf6a06486849735cdeaab1374bc LLDB library dir: /Users/buildslave/jenkins/workspace/lldb-cmake-sanitized/lldb-build/bin LLDB import library dir: /Users/buildslave/jenkins/workspace/lldb-cmake-sanitized/lldb-build/bin Traceback (most recent call last): File "/Users/buildslave/jenkins/workspace/lldb-cmake-sanitized/llvm-project/lldb/test/API/dotest.py", line 7, in <module> lldbsuite.test.run_suite() File "/Users/buildslave/jenkins/workspace/lldb-cmake-sanitized/llvm-project/lldb/packages/Python/lldbsuite/test/dotest.py", line 949, in run_suite import lldb File "/Users/buildslave/jenkins/workspace/lldb-cmake-sanitized/lldb-build/lib/python3.7/site-packages/lldb/__init__.py", line 41, in <module> from . import _lldb ImportError: dynamic module does not define init function (init_lldb)

Hide Details

******************** UNRESOLVED: lldb-api :: lang/objc/objc-stepping/TestObjCStepping.py (1783 of 1794) ******************** TEST 'lldb-api :: lang/objc/objc-stepping/TestObjCStepping.py' FAILED ******************** Unable to find 'RESULT: PASSED' in dotest output (exit code 1):

Hide Details

lldb version 10.0.99 (http://labmaster3.local/git/llvm-project.git revision a078c77d72082bf6a06486849735cdeaab1374bc) clang revision a078c77d72082bf6a06486849735cdeaab1374bc llvm revision a078c77d72082bf6a06486849735cdeaab1374bc LLDB library dir: /Users/buildslave/jenkins/workspace/lldb-cmake-sanitized/lldb-build/bin LLDB import library dir: /Users/buildslave/jenkins/workspace/lldb-cmake-sanitized/lldb-build/bin Traceback (most recent call last): File "/Users/buildslave/jenkins/workspace/lldb-cmake-sanitized/llvm-project/lldb/test/API/dotest.py", line 7, in <module> lldbsuite.test.run_suite() File "/Users/buildslave/jenkins/workspace/lldb-cmake-sanitized/llvm-project/lldb/packages/Python/lldbsuite/test/dotest.py", line 949, in run_suite import lldb File "/Users/buildslave/jenkins/workspace/lldb-cmake-sanitized/lldb-build/lib/python3.7/site-packages/lldb/__init__.py", line 41, in <module> from . import _lldb ImportError: dynamic module does not define init function (init_lldb)

Hide Details

******************** UNRESOLVED: lldb-api :: python_api/event/TestEvents.py (1784 of 1794) ******************** TEST 'lldb-api :: python_api/event/TestEvents.py' FAILED ******************** Unable to find 'RESULT: PASSED' in dotest output (exit code 1):

Hide Details

lldb version 10.0.99 (http://labmaster3.local/git/llvm-project.git revision a078c77d72082bf6a06486849735cdeaab1374bc) clang revision a078c77d72082bf6a06486849735cdeaab1374bc llvm revision a078c77d72082bf6a06486849735cdeaab1374bc LLDB library dir: /Users/buildslave/jenkins/workspace/lldb-cmake-sanitized/lldb-build/bin LLDB import library dir: /Users/buildslave/jenkins/workspace/lldb-cmake-sanitized/lldb-build/bin Traceback (most recent call last): File "/Users/buildslave/jenkins/workspace/lldb-cmake-sanitized/llvm-project/lldb/test/API/dotest.py", line 7, in <module> lldbsuite.test.run_suite() File "/Users/buildslave/jenkins/workspace/lldb-cmake-sanitized/llvm-project/lldb/packages/Python/lldbsuite/test/dotest.py", line 949, in run_suite import lldb File "/Users/buildslave/jenkins/workspace/lldb-cmake-sanitized/lldb-build/lib/python3.7/site-packages/lldb/__init__.py", line 41, in <module> from . import _lldb ImportError: dynamic module does not define init function (init_lldb)

Hide Details

******************** PASS: lldb-shell :: Commands/command-regex-delete.test (1785 of 1794) UNRESOLVED: lldb-api :: functionalities/conditional_break/TestConditionalBreak.py (1786 of 1794) ******************** TEST 'lldb-api :: functionalities/conditional_break/TestConditionalBreak.py' FAILED ******************** Unable to find 'RESULT: PASSED' in dotest output (exit code 1):

Hide Details

lldb version 10.0.99 (http://labmaster3.local/git/llvm-project.git revision a078c77d72082bf6a06486849735cdeaab1374bc) clang revision a078c77d72082bf6a06486849735cdeaab1374bc llvm revision a078c77d72082bf6a06486849735cdeaab1374bc LLDB library dir: /Users/buildslave/jenkins/workspace/lldb-cmake-sanitized/lldb-build/bin LLDB import library dir: /Users/buildslave/jenkins/workspace/lldb-cmake-sanitized/lldb-build/bin Traceback (most recent call last): File "/Users/buildslave/jenkins/workspace/lldb-cmake-sanitized/llvm-project/lldb/test/API/dotest.py", line 7, in <module> lldbsuite.test.run_suite() File "/Users/buildslave/jenkins/workspace/lldb-cmake-sanitized/llvm-project/lldb/packages/Python/lldbsuite/test/dotest.py", line 949, in run_suite import lldb File "/Users/buildslave/jenkins/workspace/lldb-cmake-sanitized/lldb-build/lib/python3.7/site-packages/lldb/__init__.py", line 41, in <module> from . import _lldb ImportError: dynamic module does not define init function (init_lldb)

Hide Details

******************** UNRESOLVED: lldb-api :: functionalities/target-new-solib-notifications/TestModuleLoadedNotifys.py (1787 of 1794) ******************** TEST 'lldb-api :: functionalities/target-new-solib-notifications/TestModuleLoadedNotifys.py' FAILED ******************** Unable to find 'RESULT: PASSED' in dotest output (exit code 1):

Hide Details

lldb version 10.0.99 (http://labmaster3.local/git/llvm-project.git revision a078c77d72082bf6a06486849735cdeaab1374bc) clang revision a078c77d72082bf6a06486849735cdeaab1374bc llvm revision a078c77d72082bf6a06486849735cdeaab1374bc LLDB library dir: /Users/buildslave/jenkins/workspace/lldb-cmake-sanitized/lldb-build/bin LLDB import library dir: /Users/buildslave/jenkins/workspace/lldb-cmake-sanitized/lldb-build/bin Traceback (most recent call last): File "/Users/buildslave/jenkins/workspace/lldb-cmake-sanitized/llvm-project/lldb/test/API/dotest.py", line 7, in <module> lldbsuite.test.run_suite() File "/Users/buildslave/jenkins/workspace/lldb-cmake-sanitized/llvm-project/lldb/packages/Python/lldbsuite/test/dotest.py", line 949, in run_suite import lldb File "/Users/buildslave/jenkins/workspace/lldb-cmake-sanitized/lldb-build/lib/python3.7/site-packages/lldb/__init__.py", line 41, in <module> from . import _lldb ImportError: dynamic module does not define init function (init_lldb)

Hide Details

******************** PASS: lldb-shell :: Reproducer/TestSynchronous.test (1788 of 1794) UNRESOLVED: lldb-api :: functionalities/data-formatter/data-formatter-categories/TestDataFormatterCategories.py (1789 of 1794) ******************** TEST 'lldb-api :: functionalities/data-formatter/data-formatter-categories/TestDataFormatterCategories.py' FAILED ******************** Unable to find 'RESULT: PASSED' in dotest output (exit code 1):

Hide Details

lldb version 10.0.99 (http://labmaster3.local/git/llvm-project.git revision a078c77d72082bf6a06486849735cdeaab1374bc) clang revision a078c77d72082bf6a06486849735cdeaab1374bc llvm revision a078c77d72082bf6a06486849735cdeaab1374bc LLDB library dir: /Users/buildslave/jenkins/workspace/lldb-cmake-sanitized/lldb-build/bin LLDB import library dir: /Users/buildslave/jenkins/workspace/lldb-cmake-sanitized/lldb-build/bin Traceback (most recent call last): File "/Users/buildslave/jenkins/workspace/lldb-cmake-sanitized/llvm-project/lldb/test/API/dotest.py", line 7, in <module> lldbsuite.test.run_suite() File "/Users/buildslave/jenkins/workspace/lldb-cmake-sanitized/llvm-project/lldb/packages/Python/lldbsuite/test/dotest.py", line 949, in run_suite import lldb File "/Users/buildslave/jenkins/workspace/lldb-cmake-sanitized/lldb-build/lib/python3.7/site-packages/lldb/__init__.py", line 41, in <module> from . import _lldb ImportError: dynamic module does not define init function (init_lldb)

Hide Details

******************** UNRESOLVED: lldb-api :: functionalities/breakpoint/consecutive_breakpoints/TestConsecutiveBreakpoints.py (1790 of 1794) ******************** TEST 'lldb-api :: functionalities/breakpoint/consecutive_breakpoints/TestConsecutiveBreakpoints.py' FAILED ******************** Unable to find 'RESULT: PASSED' in dotest output (exit code 1):

Hide Details

lldb version 10.0.99 (http://labmaster3.local/git/llvm-project.git revision a078c77d72082bf6a06486849735cdeaab1374bc) clang revision a078c77d72082bf6a06486849735cdeaab1374bc llvm revision a078c77d72082bf6a06486849735cdeaab1374bc LLDB library dir: /Users/buildslave/jenkins/workspace/lldb-cmake-sanitized/lldb-build/bin LLDB import library dir: /Users/buildslave/jenkins/workspace/lldb-cmake-sanitized/lldb-build/bin Traceback (most recent call last): File "/Users/buildslave/jenkins/workspace/lldb-cmake-sanitized/llvm-project/lldb/test/API/dotest.py", line 7, in <module> lldbsuite.test.run_suite() File "/Users/buildslave/jenkins/workspace/lldb-cmake-sanitized/llvm-project/lldb/packages/Python/lldbsuite/test/dotest.py", line 949, in run_suite import lldb File "/Users/buildslave/jenkins/workspace/lldb-cmake-sanitized/lldb-build/lib/python3.7/site-packages/lldb/__init__.py", line 41, in <module> from . import _lldb ImportError: dynamic module does not define init function (init_lldb)

Hide Details

******************** UNRESOLVED: lldb-api :: functionalities/data-formatter/data-formatter-objc/nsindexpath/TestDataFormatterNSIndexPath.py (1791 of 1794) ******************** TEST 'lldb-api :: functionalities/data-formatter/data-formatter-objc/nsindexpath/TestDataFormatterNSIndexPath.py' FAILED ******************** Unable to find 'RESULT: PASSED' in dotest output (exit code 1):

Hide Details

lldb version 10.0.99 (http://labmaster3.local/git/llvm-project.git revision a078c77d72082bf6a06486849735cdeaab1374bc) clang revision a078c77d72082bf6a06486849735cdeaab1374bc llvm revision a078c77d72082bf6a06486849735cdeaab1374bc LLDB library dir: /Users/buildslave/jenkins/workspace/lldb-cmake-sanitized/lldb-build/bin LLDB import library dir: /Users/buildslave/jenkins/workspace/lldb-cmake-sanitized/lldb-build/bin Traceback (most recent call last): File "/Users/buildslave/jenkins/workspace/lldb-cmake-sanitized/llvm-project/lldb/test/API/dotest.py", line 7, in <module> lldbsuite.test.run_suite() File "/Users/buildslave/jenkins/workspace/lldb-cmake-sanitized/llvm-project/lldb/packages/Python/lldbsuite/test/dotest.py", line 949, in run_suite import lldb File "/Users/buildslave/jenkins/workspace/lldb-cmake-sanitized/lldb-build/lib/python3.7/site-packages/lldb/__init__.py", line 41, in <module> from . import _lldb ImportError: dynamic module does not define init function (init_lldb)

Hide Details

******************** UNRESOLVED: lldb-api :: functionalities/data-formatter/poarray/TestPrintObjectArray.py (1792 of 1794) ******************** TEST 'lldb-api :: functionalities/data-formatter/poarray/TestPrintObjectArray.py' FAILED ******************** Unable to find 'RESULT: PASSED' in dotest output (exit code 1):

Hide Details

lldb version 10.0.99 (http://labmaster3.local/git/llvm-project.git revision a078c77d72082bf6a06486849735cdeaab1374bc) clang revision a078c77d72082bf6a06486849735cdeaab1374bc llvm revision a078c77d72082bf6a06486849735cdeaab1374bc LLDB library dir: /Users/buildslave/jenkins/workspace/lldb-cmake-sanitized/lldb-build/bin LLDB import library dir: /Users/buildslave/jenkins/workspace/lldb-cmake-sanitized/lldb-build/bin Traceback (most recent call last): File "/Users/buildslave/jenkins/workspace/lldb-cmake-sanitized/llvm-project/lldb/test/API/dotest.py", line 7, in <module> lldbsuite.test.run_suite() File "/Users/buildslave/jenkins/workspace/lldb-cmake-sanitized/llvm-project/lldb/packages/Python/lldbsuite/test/dotest.py", line 949, in run_suite import lldb File "/Users/buildslave/jenkins/workspace/lldb-cmake-sanitized/lldb-build/lib/python3.7/site-packages/lldb/__init__.py", line 41, in <module> from . import _lldb ImportError: dynamic module does not define init function (init_lldb)

Hide Details

******************** UNRESOLVED: lldb-api :: commands/expression/pr35310/TestExprsBug35310.py (1793 of 1794) ******************** TEST 'lldb-api :: commands/expression/pr35310/TestExprsBug35310.py' FAILED ******************** Unable to find 'RESULT: PASSED' in dotest output (exit code 1):

Hide Details

lldb version 10.0.99 (http://labmaster3.local/git/llvm-project.git revision a078c77d72082bf6a06486849735cdeaab1374bc) clang revision a078c77d72082bf6a06486849735cdeaab1374bc llvm revision a078c77d72082bf6a06486849735cdeaab1374bc LLDB library dir: /Users/buildslave/jenkins/workspace/lldb-cmake-sanitized/lldb-build/bin LLDB import library dir: /Users/buildslave/jenkins/workspace/lldb-cmake-sanitized/lldb-build/bin Traceback (most recent call last): File "/Users/buildslave/jenkins/workspace/lldb-cmake-sanitized/llvm-project/lldb/test/API/dotest.py", line 7, in <module> lldbsuite.test.run_suite() File "/Users/buildslave/jenkins/workspace/lldb-cmake-sanitized/llvm-project/lldb/packages/Python/lldbsuite/test/dotest.py", line 949, in run_suite import lldb File "/Users/buildslave/jenkins/workspace/lldb-cmake-sanitized/lldb-build/lib/python3.7/site-packages/lldb/__init__.py", line 41, in <module> from . import _lldb ImportError: dynamic module does not define init function (init_lldb)

Hide Details

******************** UNRESOLVED: lldb-api :: commands/watchpoints/watchpoint_set_command/TestWatchLocationWithWatchSet.py (1794 of 1794) ******************** TEST 'lldb-api :: commands/watchpoints/watchpoint_set_command/TestWatchLocationWithWatchSet.py' FAILED ******************** Unable to find 'RESULT: PASSED' in dotest output (exit code 1):

Hide Details

lldb version 10.0.99 (http://labmaster3.local/git/llvm-project.git revision a078c77d72082bf6a06486849735cdeaab1374bc) clang revision a078c77d72082bf6a06486849735cdeaab1374bc llvm revision a078c77d72082bf6a06486849735cdeaab1374bc LLDB library dir: /Users/buildslave/jenkins/workspace/lldb-cmake-sanitized/lldb-build/bin LLDB import library dir: /Users/buildslave/jenkins/workspace/lldb-cmake-sanitized/lldb-build/bin Traceback (most recent call last): File "/Users/buildslave/jenkins/workspace/lldb-cmake-sanitized/llvm-project/lldb/test/API/dotest.py", line 7, in <module> lldbsuite.test.run_suite() File "/Users/buildslave/jenkins/workspace/lldb-cmake-sanitized/llvm-project/lldb/packages/Python/lldbsuite/test/dotest.py", line 949, in run_suite import lldb File "/Users/buildslave/jenkins/workspace/lldb-cmake-sanitized/lldb-build/lib/python3.7/site-packages/lldb/__init__.py", line 41, in <module> from . import _lldb ImportError: dynamic module does not define init function (init_lldb)

Hide Details

********************

Hide Details

Testing Time: 847.96s ******************** Unresolved Tests (764): lldb-api :: functionalities/unwind/standard/TestStandardUnwind.py lldb-api :: functionalities/dynamic_value_child_count/TestDynamicValueChildCount.py lldb-api :: lang/objc/modules/TestObjCModules.py lldb-api :: python_api/sbtype_typeclass/TestSBTypeTypeClass.py lldb-api :: macosx/lc-note/kern-ver-str/TestKernVerStrLCNOTE.py lldb-api :: functionalities/tty/TestTerminal.py lldb-api :: functionalities/darwin_log/filter/regex/activity/TestDarwinLogFilterRegexActivity.py lldb-api :: functionalities/data-formatter/hexcaps/TestDataFormatterHexCaps.py lldb-api :: lang/cpp/overloaded-functions/TestOverloadedFunctions.py lldb-api :: functionalities/data-formatter/language_category_updates/TestDataFormatterLanguageCategoryUpdates.py lldb-api :: lang/objc/objc-foundation-dictionary-empty/TestNSDictionary0.py lldb-api :: functionalities/thread/num_threads/TestNumThreads.py lldb-api :: commands/expression/call-overridden-method/TestCallOverriddenMethod.py lldb-api :: functionalities/tail_call_frames/sbapi_support/TestTailCallFrameSBAPI.py lldb-api :: commands/process/attach/TestProcessAttach.py lldb-api :: functionalities/thread/thread_exit/TestThreadExit.py lldb-api :: commands/watchpoints/watchpoint_on_vectors/TestValueOfVectorVariable.py lldb-api :: lang/objc/objc-ivar-protocols/TestIvarProtocols.py lldb-api :: commands/expression/radar_9673664/TestExprHelpExamples.py lldb-api :: commands/expression/entry-bp/TestExprEntryBP.py lldb-api :: lang/c/anonymous/TestAnonymous.py lldb-api :: lang/objc/objc-static-method-stripped/TestObjCStaticMethodStripped.py lldb-api :: types/TestIntegerTypes.py lldb-api :: functionalities/breakpoint/breakpoint_names/TestBreakpointNames.py lldb-api :: tools/lldb-server/TestLldbGdbServer.py lldb-api :: commands/expression/completion-crash-incomplete-record/TestCompletionCrashIncompleteRecord.py lldb-api :: lang/cpp/call-function/TestCallCPPFunction.py lldb-api :: lang/c/typedef/Testtypedef.py lldb-api :: python_api/findvalue_duplist/TestSBFrameFindValue.py lldb-api :: commands/expression/expr-in-syscall/TestExpressionInSyscall.py lldb-api :: python_api/objc_type/TestObjCType.py lldb-api :: lang/cpp/member-and-local-vars-with-same-name/TestMembersAndLocalsWithSameName.py lldb-api :: tools/lldb-vscode/breakpoint/TestVSCode_setExceptionBreakpoints.py lldb-api :: commands/platform/process/TestProcessList.py lldb-api :: python_api/watchpoint/TestSetWatchpoint.py lldb-api :: lang/cpp/virtual/TestVirtual.py lldb-api :: functionalities/data-formatter/data-formatter-stl/libstdcpp/vector/TestDataFormatterStdVector.py lldb-api :: lang/c/find_struct_type/TestFindStructTypes.py lldb-api :: functionalities/breakpoint/source_regexp/TestSourceRegexBreakpoints.py lldb-api :: commands/target/stop-hooks/TestStopHooks.py lldb-api :: types/TestFloatTypes.py lldb-api :: commands/watchpoints/step_over_watchpoint/TestStepOverWatchpoint.py lldb-api :: functionalities/thread/concurrent_events/TestConcurrentCrashWithWatchpointBreakpointSignal.py lldb-api :: python_api/process/TestProcessAPI.py lldb-api :: lang/cpp/stl/TestStdCXXDisassembly.py lldb-api :: android/platform/TestDefaultCacheLineSize.py lldb-api :: commands/expression/issue_11588/Test11588.py lldb-api :: commands/expression/persistent_variables/TestPersistentVariables.py lldb-api :: commands/gui/basic/TestGuiBasic.py lldb-api :: lang/objc/foundation/TestRuntimeTypes.py lldb-api :: functionalities/deleted-executable/TestDeletedExecutable.py lldb-api :: lang/objc/objc-builtin-types/TestObjCBuiltinTypes.py lldb-api :: commands/settings/TestSettings.py lldb-api :: commands/process/attach-resume/TestAttachResume.py lldb-api :: lang/objc/objc-dyn-sbtype/TestObjCDynamicSBType.py lldb-api :: commands/frame/select/TestFrameSelect.py lldb-api :: commands/expression/call-function/TestCallStdStringFunction.py lldb-api :: functionalities/data-formatter/data-formatter-stl/libcxx/vector/TestDataFormatterLibcxxVector.py lldb-api :: functionalities/modern-type-lookup/basic-objc/TestBasicObjcModernTypeLookup.py lldb-api :: python_api/breakpoint/TestBreakpointAPI.py lldb-api :: functionalities/darwin_log/filter/exact_match/activity-chain/TestDarwinLogFilterMatchActivityChain.py lldb-api :: functionalities/postmortem/netbsd-core/TestNetBSDCore.py lldb-api :: lang/cpp/incomplete-types/TestCppIncompleteTypes.py lldb-api :: commands/expression/invalid-args/TestInvalidArgsExpression.py lldb-api :: commands/expression/weak_symbols/TestWeakSymbols.py lldb-api :: lang/cpp/template/TestTemplateArgs.py lldb-api :: functionalities/data-formatter/data-formatter-proper-plurals/TestFormattersOneIsSingular.py lldb-api :: python_api/class_members/TestSBTypeClassMembers.py lldb-api :: python_api/name_lookup/TestNameLookup.py lldb-api :: functionalities/thread/concurrent_events/TestConcurrentWatchpointWithDelayWatchpointThreads.py lldb-api :: commands/platform/basic/TestPlatformPython.py lldb-api :: python_api/exprpath_synthetic/TestExprPathSynthetic.py lldb-api :: functionalities/data-formatter/compactvectors/TestCompactVectors.py lldb-api :: functionalities/data-formatter/data-formatter-stl/libcxx/string/TestDataFormatterLibcxxString.py lldb-api :: functionalities/data-formatter/user-format-vs-summary/TestUserFormatVsSummary.py lldb-api :: functionalities/data-formatter/synthcapping/TestSyntheticCapping.py lldb-api :: lang/objc/objc-checker/TestObjCCheckers.py lldb-api :: functionalities/multidebugger_commands/TestMultipleDebuggersCommands.py lldb-api :: functionalities/data-formatter/nsarraysynth/TestNSArraySynthetic.py lldb-api :: lang/cpp/inlines/TestInlines.py lldb-api :: functionalities/process_save_core/TestProcessSaveCore.py lldb-api :: lang/c/global_variables/TestGlobalVariables.py lldb-api :: tools/lldb-vscode/attach/TestVSCode_attach.py lldb-api :: functionalities/tail_call_frames/inlining_and_tail_calls/TestInliningAndTailCalls.py lldb-api :: functionalities/ptr_refs/TestPtrRefs.py lldb-api :: commands/watchpoints/variable_out_of_scope/TestWatchedVarHitWhenInScope.py lldb-api :: lang/c/blocks/TestBlocks.py lldb-api :: functionalities/darwin_log/basic/TestDarwinLogBasic.py lldb-api :: functionalities/tail_call_frames/thread_step_out_message/TestArtificialFrameStepOutMessage.py lldb-api :: functionalities/data-formatter/data-formatter-stl/libcxx/optional/TestDataFormatterLibcxxOptional.py lldb-api :: functionalities/breakpoint/require_hw_breakpoints/TestRequireHWBreakpoints.py lldb-api :: functionalities/float-display/TestFloatDisplay.py lldb-api :: commands/expression/import-std-module/conflicts/TestStdModuleWithConflicts.py lldb-api :: functionalities/longjmp/TestLongjmp.py lldb-api :: python_api/process/io/TestProcessIO.py lldb-api :: macosx/version_zero/TestGetVersionZeroVersion.py lldb-api :: functionalities/data-formatter/data-formatter-stl/libcxx/list/loop/TestDataFormatterLibcxxListLoop.py lldb-api :: tools/lldb-server/TestGdbRemoteExpeditedRegisters.py lldb-api :: functionalities/thread/concurrent_events/TestConcurrentManyWatchpoints.py lldb-api :: functionalities/wrong_commands/TestWrongCommands.py lldb-api :: tools/lldb-server/TestAppleSimulatorOSType.py lldb-api :: commands/command/source/TestCommandSource.py lldb-api :: python_api/watchpoint/condition/TestWatchpointConditionAPI.py lldb-api :: functionalities/thread/create_after_attach/TestCreateAfterAttach.py lldb-api :: lang/cpp/dynamic-value/TestDynamicValue.py lldb-api :: functionalities/data-formatter/data-formatter-ptr-to-array/TestPtrToArrayFormatting.py lldb-api :: functionalities/modern-type-lookup/basic/TestBasicModernTypeLookup.py lldb-api :: lang/cpp/frame-var-anon-unions/TestFrameVariableAnonymousUnions.py lldb-api :: api/multithreaded/TestMultithreaded.py lldb-api :: commands/frame/diagnose/dereference-function-return/TestDiagnoseDereferenceFunctionReturn.py lldb-api :: lang/objc/foundation/TestObjCMethodsNSError.py lldb-api :: lang/cpp/char8_t/TestCxxChar8_t.py lldb-api :: functionalities/gdb_remote_client/TestNestedRegDefinitions.py lldb-api :: lang/objcxx/class-name-clash/TestNameClash.py lldb-api :: functionalities/tsan/global_location/TestTsanGlobalLocation.py lldb-api :: lang/objcxx/hide-runtime-values/TestObjCXXHideRuntimeValues.py lldb-api :: lang/c/vla/TestVLA.py lldb-api :: functionalities/unwind/ehframe/TestEhFrameUnwind.py lldb-api :: functionalities/thread/concurrent_events/TestConcurrentDelaySignalBreak.py lldb-api :: functionalities/data-formatter/data-formatter-objc/TestDataFormatterObjCCF.py lldb-api :: lang/c/offsetof/TestOffsetof.py lldb-api :: commands/command/history/TestCommandHistory.py lldb-api :: functionalities/data-formatter/type_summary_list_script/TestTypeSummaryListScript.py lldb-api :: functionalities/data-formatter/data-formatter-objc/TestDataFormatterObjNSException.py lldb-api :: functionalities/exec/TestExec.py lldb-api :: lang/objc/objc-struct-argument/TestObjCStructArgument.py lldb-api :: tools/lldb-server/thread-name/TestGdbRemoteThreadName.py lldb-api :: functionalities/ubsan/user-expression/TestUbsanUserExpression.py lldb-api :: commands/expression/import-std-module/vector-dbg-info-content/TestDbgInfoContentVector.py lldb-api :: macosx/safe-to-func-call/TestSafeFuncCalls.py lldb-api :: lang/cpp/enum_types/TestCPP11EnumTypes.py lldb-api :: functionalities/thread/concurrent_events/TestConcurrentSignalDelayWatch.py lldb-api :: functionalities/data-formatter/data-formatter-objc/TestDataFormatterObjCKVO.py lldb-api :: macosx/duplicate-archive-members/TestDuplicateMembers.py lldb-api :: functionalities/tail_call_frames/ambiguous_tail_call_seq1/TestAmbiguousTailCallSeq1.py lldb-api :: commands/expression/import-std-module/queue/TestQueue.py lldb-api :: python_api/thread/TestThreadAPI.py lldb-api :: lang/c/step-target/TestStepTarget.py lldb-api :: functionalities/thread/break_after_join/TestBreakAfterJoin.py lldb-api :: lang/cpp/wchar_t/TestCxxWCharT.py lldb-api :: functionalities/thread/concurrent_events/TestConcurrentWatchBreak.py lldb-api :: python_api/frame/TestFrames.py lldb-api :: functionalities/backticks/TestBackticksWithoutATarget.py lldb-api :: lang/objc/objc-baseclass-sbtype/TestObjCBaseClassSBType.py lldb-api :: commands/expression/persistent_types/TestNestedPersistentTypes.py lldb-api :: functionalities/data-formatter/data-formatter-globals/TestDataFormatterGlobals.py lldb-api :: commands/expression/completion-in-lambda-and-unnnamed-class/TestCompletionInLambdaAndUnnamedClass.py lldb-api :: functionalities/gdb_remote_client/TestTargetXMLArch.py lldb-api :: lang/cpp/stl/TestSTL.py lldb-api :: api/listeners/TestListener.py lldb-api :: lang/objc/objc-ivar-offsets/TestObjCIvarOffsets.py lldb-api :: functionalities/data-formatter/data-formatter-stl/libstdcpp/list/TestDataFormatterStdList.py lldb-api :: commands/command/delete/TestCommandDelete.py lldb-api :: tools/lldb-server/TestGdbRemote_vCont.py lldb-api :: functionalities/breakpoint/debugbreak/TestDebugBreak.py lldb-api :: lang/c/set_values/TestSetValues.py lldb-api :: lang/objc/objc-ivar-stripped/TestObjCIvarStripped.py lldb-api :: functionalities/thread/concurrent_events/TestConcurrentTwoWatchpointsOneDelayBreakpoint.py lldb-api :: functionalities/signal/handle-segv/TestHandleSegv.py lldb-api :: sanity/TestModuleCacheSanity.py lldb-api :: lang/cpp/rvalue-references/TestRvalueReferences.py lldb-api :: benchmarks/expression/TestExpressionCmd.py lldb-api :: functionalities/data-formatter/data-formatter-advanced/TestDataFormatterAdv.py lldb-api :: lang/c/tls_globals/TestTlsGlobals.py lldb-api :: python_api/lldbutil/frame/TestFrameUtils.py lldb-api :: functionalities/tsan/thread_numbers/TestTsanThreadNumbers.py lldb-api :: commands/register/register/intel_xtended_registers/TestMPXRegisters.py lldb-api :: functionalities/value_md5_crash/TestValueMD5Crash.py lldb-api :: functionalities/step-avoids-no-debug/TestStepNoDebug.py lldb-api :: commands/frame/var-scope/TestFrameVariableScope.py lldb-api :: commands/frame/diagnose/array/TestArray.py lldb-api :: api/multiple-targets/TestMultipleTargets.py lldb-api :: lang/objc/objc-runtime-ivars/TestRuntimeIvars.py lldb-api :: functionalities/darwin_log/format/TestDarwinLogMessageFormat.py lldb-api :: python_api/lldbutil/TestSwigVersion.py lldb-api :: lang/objc/variadic_methods/TestVariadicMethods.py lldb-api :: functionalities/asan/TestMemoryHistory.py lldb-api :: functionalities/thread/concurrent_events/TestConcurrentTwoBreakpointsOneSignal.py lldb-api :: lang/objc/ivar-IMP/TestObjCiVarIMP.py lldb-api :: python_api/symbol-context/TestSymbolContext.py lldb-api :: functionalities/thread/crash_during_step/TestCrashDuringStep.py lldb-api :: commands/process/launch/TestProcessLaunch.py lldb-api :: tools/lldb-vscode/breakpoint/TestVSCode_setFunctionBreakpoints.py lldb-api :: lang/objc/self/TestObjCSelf.py lldb-api :: commands/watchpoints/hello_watchpoint/TestMyFirstWatchpoint.py lldb-api :: lang/cpp/gmodules-templates/TestGModules.py lldb-api :: benchmarks/stepping/TestSteppingSpeed.py lldb-api :: functionalities/breakpoint/address_breakpoints/TestBadAddressBreakpoints.py lldb-api :: functionalities/data-formatter/data-formatter-objc/TestDataFormatterObjCNSBundle.py lldb-api :: lang/cpp/operator-overload/TestOperatorOverload.py lldb-api :: functionalities/data-formatter/data-formatter-stl/libcxx/variant/TestDataFormatterLibcxxVariant.py lldb-api :: lang/cpp/breakpoint_in_member_func_w_non_primitive_params/TestBreakpointInMemberFuncWNonPrimitiveParams.py lldb-api :: functionalities/postmortem/mach-core/TestMachCore.py lldb-api :: commands/expression/import_builtin_fileid/TestImportBuiltinFileID.py lldb-api :: lang/objc/blocks/TestObjCIvarsInBlocks.py lldb-api :: commands/expression/save_jit_objects/TestSaveJITObjects.py lldb-api :: python_api/type/TestTypeList.py lldb-api :: functionalities/thread/concurrent_events/TestConcurrentSignalBreak.py lldb-api :: functionalities/thread/concurrent_events/TestConcurrentDelayWatchBreak.py lldb-api :: sample_test/TestSampleTest.py lldb-api :: lang/objcxx/objcxx-ivar-vector/TestIvarVector.py lldb-api :: lang/cpp/modules-import/TestCXXModulesImport.py lldb-api :: functionalities/breakpoint/move_nearest/TestMoveNearest.py lldb-api :: lang/c/struct_types/TestStructTypes.py lldb-api :: commands/quit/TestQuit.py lldb-api :: python_api/target/TestTargetAPI.py lldb-api :: functionalities/breakpoint/scripted_bkpt/TestScriptedResolver.py lldb-api :: commands/frame/diagnose/dereference-argument/TestDiagnoseDereferenceArgument.py lldb-api :: functionalities/postmortem/elf-core/thread_crash/TestLinuxCoreThreads.py lldb-api :: python_api/rdar-12481949/Test-rdar-12481949.py lldb-api :: functionalities/inline-stepping/TestInlineStepping.py lldb-api :: lang/cpp/const_this/TestConstThis.py lldb-api :: commands/expression/persist_objc_pointeetype/TestPersistObjCPointeeType.py lldb-api :: functionalities/breakpoint/breakpoint_hit_count/TestBreakpointHitCount.py lldb-api :: sample_test/TestSampleInlineTest.py lldb-api :: functionalities/data-formatter/pyobjsynthprovider/TestPyObjSynthProvider.py lldb-api :: python_api/watchpoint/watchlocation/TestTargetWatchAddress.py lldb-api :: functionalities/data-formatter/data-formatter-objc/TestDataFormatterObjCPlain.py lldb-api :: lang/cpp/class_types/TestClassTypesDisassembly.py lldb-api :: functionalities/memory/find/TestMemoryFind.py lldb-api :: functionalities/data-formatter/ptr_ref_typedef/TestPtrRef2Typedef.py lldb-api :: lang/cpp/trivial_abi/TestTrivialABI.py lldb-api :: tools/lldb-server/commandline/TestStubSetSID.py lldb-api :: commands/expression/multiline-completion/TestMultilineCompletion.py lldb-api :: commands/expression/context-object-objc/TestContextObjectObjc.py lldb-api :: lang/cpp/signed_types/TestSignedTypes.py lldb-api :: lang/objc/exceptions/TestObjCExceptions.py lldb-api :: lang/objc/foundation/TestSymbolTable.py lldb-api :: linux/sepdebugsymlink/TestTargetSymbolsSepDebugSymlink.py lldb-api :: functionalities/data-formatter/boolreference/TestFormattersBoolRefPtr.py lldb-api :: commands/expression/radar_9531204/TestPrintfAfterUp.py lldb-api :: commands/command/script_alias/TestCommandScriptAlias.py lldb-api :: functionalities/source-map/TestTargetSourceMap.py lldb-api :: tools/lldb-server/TestGdbRemoteAuxvSupport.py lldb-api :: functionalities/data-formatter/data-formatter-synthtype/TestDataFormatterSynthType.py lldb-api :: commands/expression/formatters/TestFormatters.py lldb-api :: functionalities/breakpoint/cpp_exception/TestCPPExceptionBreakpoint.py lldb-api :: lang/objc/conflicting-definition/TestConflictingDefinition.py lldb-api :: commands/expression/rdar44436068/Test128BitsInteger.py lldb-api :: functionalities/history/TestHistoryRecall.py lldb-api :: functionalities/thread/concurrent_events/TestConcurrentDelayedCrashWithBreakpointSignal.py lldb-api :: benchmarks/turnaround/TestCompileRunToBreakpointTurnaround.py lldb-api :: functionalities/thread/concurrent_events/TestConcurrentNWatchNBreak.py lldb-api :: lang/objc/print-obj/TestPrintObj.py lldb-api :: benchmarks/frame_variable/TestFrameVariableResponse.py lldb-api :: python_api/function_symbol/TestSymbolAPI.py lldb-api :: lang/c/strings/TestCStrings.py lldb-api :: functionalities/testid/TestTestId.py lldb-api :: functionalities/postmortem/minidump/TestMiniDump.py lldb-api :: functionalities/signal/TestSendSignal.py lldb-api :: functionalities/plugins/python_os_plugin/TestPythonOSPlugin.py lldb-api :: functionalities/jitloader_gdb/TestJITLoaderGDB.py lldb-api :: lang/cpp/gmodules/TestWithModuleDebugging.py lldb-api :: functionalities/thread/concurrent_events/TestConcurrentSignalWatch.py lldb-api :: functionalities/param_entry_vals/basic_entry_values_x86_64/TestBasicEntryValuesX86_64.py lldb-api :: macosx/thread-names/TestInterruptThreadNames.py lldb-api :: functionalities/non-overlapping-index-variable-i/TestIndexVariable.py lldb-api :: functionalities/return-value/TestReturnValue.py lldb-api :: functionalities/thread/thread_specific_break/TestThreadSpecificBreakpoint.py lldb-api :: functionalities/signal/raise/TestRaise.py lldb-api :: functionalities/paths/TestPaths.py lldb-api :: functionalities/breakpoint/step_over_breakpoint/TestStepOverBreakpoint.py lldb-api :: lang/cpp/diamond/TestDiamond.py lldb-api :: python_api/default-constructor/TestDefaultConstructorForAPIObjects.py lldb-api :: commands/expression/dont_allow_jit/TestAllowJIT.py lldb-api :: lang/cpp/symbols/TestSymbols.py lldb-api :: functionalities/asan/TestReportData.py lldb-api :: functionalities/breakpoint/breakpoint_locations/TestBreakpointLocations.py lldb-api :: functionalities/archives/TestBSDArchives.py lldb-api :: commands/expression/class_template_specialization_empty_pack/TestClassTemplateSpecializationParametersHandling.py lldb-api :: lang/objc/forward-decl/TestForwardDecl.py lldb-api :: lang/cpp/namespace/TestNamespaceLookup.py lldb-api :: functionalities/data-formatter/data-formatter-stl/libcxx/bitset/TestDataFormatterLibcxxBitset.py lldb-api :: macosx/find-dsym/deep-bundle/TestDeepBundle.py lldb-api :: functionalities/unwind/sigtramp/TestSigtrampUnwind.py lldb-api :: python_api/value/empty_class/TestValueAPIEmptyClass.py lldb-api :: functionalities/data-formatter/data-formatter-stl/libcxx/initializerlist/TestInitializerList.py lldb-api :: commands/frame/diagnose/local-variable/TestLocalVariable.py lldb-api :: linux/thread/create_during_instruction_step/TestCreateDuringInstructionStep.py lldb-api :: python_api/hello_world/TestHelloWorld.py lldb-api :: commands/expression/completion-crash2/TestCompletionCrash2.py lldb-api :: functionalities/thread/concurrent_events/TestConcurrentTwoWatchpointThreads.py lldb-api :: functionalities/data-formatter/data-formatter-stl/libstdcpp/string/TestDataFormatterStdString.py lldb-api :: lang/objc/modules-auto-import/TestModulesAutoImport.py lldb-api :: functionalities/gdb_remote_client/TestGDBRemoteLoad.py lldb-api :: functionalities/thread/exit_during_step/TestExitDuringStep.py lldb-api :: benchmarks/libcxxmap/TestBenchmarkLibcxxMap.py lldb-api :: functionalities/tail_call_frames/unambiguous_sequence/TestUnambiguousTailCalls.py lldb-api :: lang/cpp/offsetof/TestOffsetofCpp.py lldb-api :: api/command-return-object/TestSBCommandReturnObject.py lldb-api :: functionalities/pre_run_dylibs/TestPreRunDylibs.py lldb-api :: functionalities/modern-type-lookup/libcxx/TestLibCxxModernTypeLookup.py lldb-api :: lang/objc/foundation/TestObjCMethodsNSArray.py lldb-api :: lang/cpp/unicode-literals/TestUnicodeLiterals.py lldb-api :: lang/objc/objc-new-syntax/TestObjCNewSyntaxDictionary.py lldb-api :: functionalities/darwin_log/filter/exact_match/category/TestDarwinLogFilterMatchCategory.py lldb-api :: commands/expression/import-std-module/no-std-module/TestMissingStdModule.py lldb-api :: lang/cpp/nested-class-other-compilation-unit/TestNestedClassWithParentInAnotherCU.py lldb-api :: functionalities/thread/concurrent_events/TestConcurrentBreakpointOneDelayBreakpointThreads.py lldb-api :: macosx/queues/TestQueues.py lldb-api :: functionalities/thread/concurrent_events/TestConcurrentTwoWatchpointsOneBreakpoint.py lldb-api :: commands/command/invalid-args/TestInvalidArgsCommand.py lldb-api :: macosx/nslog/TestDarwinNSLogOutput.py lldb-api :: commands/help/TestHelp.py lldb-api :: functionalities/gdb_remote_client/TestThreadSelectionBug.py lldb-api :: tools/lldb-server/TestGdbRemoteModuleInfo.py lldb-api :: commands/log/invalid-args/TestInvalidArgsLog.py lldb-api :: functionalities/data-formatter/stringprinter/TestStringPrinter.py lldb-api :: lang/objc/foundation/TestObjectDescriptionAPI.py lldb-api :: commands/expression/xvalue/TestXValuePrinting.py lldb-api :: commands/expression/top-level/TestTopLevelExprs.py lldb-api :: commands/expression/calculator_mode/TestCalculatorMode.py lldb-api :: commands/expression/import-std-module/sysroot/TestStdModuleSysroot.py lldb-api :: commands/expression/persistent_types/TestPersistentTypes.py lldb-api :: commands/frame/recognizer/TestFrameRecognizer.py lldb-api :: functionalities/data-formatter/data-formatter-named-summaries/TestDataFormatterNamedSummaries.py lldb-api :: python_api/disassemble-raw-data/TestDisassembleRawData.py lldb-api :: lang/c/local_types/TestUseClosestType.py lldb-api :: lang/objc/foundation/TestObjCMethods2.py lldb-api :: commands/expression/namespace_local_var_same_name_cpp_and_c/TestNamespaceLocalVarSameNameCppAndC.py lldb-api :: functionalities/thread/concurrent_events/TestConcurrentTwoBreakpointsOneWatchpoint.py lldb-api :: lang/c/conflicting-symbol/TestConflictingSymbol.py lldb-api :: commands/frame/language/TestGuessLanguage.py lldb-api :: python_api/disassemble-raw-data/TestDisassemble_VST1_64.py lldb-api :: lang/c/shared_lib_stripped_symbols/TestSharedLibStrippedSymbols.py lldb-api :: lang/cpp/printf/TestPrintf.py lldb-api :: functionalities/thread/concurrent_events/TestConcurrentBreakpointDelayBreakpointOneSignal.py lldb-api :: functionalities/ubsan/basic/TestUbsanBasic.py lldb-api :: types/TestDoubleTypes.py lldb-api :: commands/expression/test/TestExprs.py lldb-api :: python_api/sblaunchinfo/TestSBLaunchInfo.py lldb-api :: functionalities/gdb_remote_client/TestRecognizeBreakpoint.py lldb-api :: commands/expression/options/TestExprOptions.py lldb-api :: tools/lldb-vscode/step/TestVSCode_step.py lldb-api :: commands/expression/import-std-module/unique_ptr/TestUniquePtr.py lldb-api :: functionalities/breakpoint/breakpoint_conditions/TestBreakpointConditions.py lldb-api :: macosx/find-dsym/bundle-with-dot-in-filename/TestBundleWithDotInFilename.py lldb-api :: tools/lldb-server/platform-process-connect/TestPlatformProcessConnect.py lldb-api :: functionalities/recursion/TestValueObjectRecursion.py lldb-api :: lang/cpp/exceptions/TestCPPExceptionBreakpoints.py lldb-api :: lang/objc/objc-struct-return/TestObjCStructReturn.py lldb-api :: commands/expression/import-std-module/empty-module/TestEmptyStdModule.py lldb-api :: lang/c/inlines/TestRedefinitionsInInlines.py lldb-api :: linux/mix-dwo-and-regular-objects/TestMixedDwarfBinary.py lldb-api :: lang/cpp/bool/TestCPPBool.py lldb-api :: functionalities/show_location/TestShowLocationDwarf5.py lldb-api :: functionalities/abbreviation/TestCommonShortSpellings.py lldb-api :: lang/cpp/global_variables/TestCPPGlobalVariables.py lldb-api :: commands/frame/diagnose/bad-reference/TestBadReference.py lldb-api :: functionalities/breakpoint/auto_continue/TestBreakpointAutoContinue.py lldb-api :: functionalities/thread/step_out/TestThreadStepOut.py lldb-api :: commands/expression/call-restarts/TestCallThatRestarts.py lldb-api :: lang/c/shared_lib/TestSharedLib.py lldb-api :: functionalities/breakpoint/breakpoint_by_line_and_column/TestBreakpointByLineAndColumn.py lldb-api :: functionalities/data-formatter/summary-string-onfail/Test-rdar-9974002.py lldb-api :: functionalities/data-formatter/data-formatter-stl/libstdcpp/unique_ptr/TestDataFormatterStdUniquePtr.py lldb-api :: functionalities/data-formatter/data-formatter-script/TestDataFormatterScript.py lldb-api :: functionalities/tail_call_frames/thread_step_out_or_return/TestSteppingOutWithArtificialFrames.py lldb-api :: tools/lldb-server/TestGdbRemoteHostInfo.py lldb-api :: benchmarks/libcxxlist/TestBenchmarkLibcxxList.py lldb-api :: functionalities/data-formatter/data-formatter-stl/libcxx/vbool/TestDataFormatterLibcxxVBool.py lldb-api :: commands/expression/radar_8638051/Test8638051.py lldb-api :: functionalities/tsan/multiple/TestTsanMultiple.py lldb-api :: commands/expression/import-std-module/deque-dbg-info-content/TestDbgInfoContentDeque.py lldb-api :: commands/target/create-deps/TestTargetCreateDeps.py lldb-api :: functionalities/thread/concurrent_events/TestConcurrentWatchpointDelayWatchpointOneBreakpoint.py lldb-api :: commands/command/script/import/rdar-12586188/TestRdar12586188.py lldb-api :: commands/expression/call-function/TestCallUserDefinedFunction.py lldb-api :: functionalities/thread/multi_break/TestMultipleBreakpoints.py lldb-api :: functionalities/data-formatter/data-formatter-stl/libcxx/map/TestDataFormatterLibccMap.py lldb-api :: commands/frame/diagnose/inheritance/TestDiagnoseInheritance.py lldb-api :: lang/mixed/TestMixedLanguages.py lldb-api :: functionalities/data-formatter/data-formatter-skip-summary/TestDataFormatterSkipSummary.py lldb-api :: commands/expression/unwind_expression/TestUnwindExpression.py lldb-api :: functionalities/breakpoint/dummy_target_breakpoints/TestBreakpointsWithNoTargets.py lldb-api :: functionalities/tail_call_frames/disambiguate_call_site/TestDisambiguateCallSite.py lldb-api :: lang/cpp/std-function-step-into-callable/TestStdFunctionStepIntoCallable.py lldb-api :: tools/lldb-server/signal-filtering/TestGdbRemote_QPassSignals.py lldb-api :: functionalities/thread/jump/TestThreadJump.py lldb-api :: functionalities/data-formatter/nsdictionarysynth/TestNSDictionarySynthetic.py lldb-api :: lang/cpp/chained-calls/TestCppChainedCalls.py lldb-api :: lang/cpp/unique-types/TestUniqueTypes.py lldb-api :: functionalities/thread/concurrent_events/TestConcurrentDelaySignalWatch.py lldb-api :: commands/source/info/TestSourceInfo.py lldb-api :: lang/objc/unicode-string/TestUnicodeString.py lldb-api :: lang/cpp/breakpoint-commands/TestCPPBreakpointCommands.py lldb-api :: functionalities/thread/concurrent_events/TestConcurrentTwoBreakpointThreads.py lldb-api :: lang/cpp/nsimport/TestCppNsImport.py lldb-api :: functionalities/postmortem/wow64_minidump/TestWow64MiniDump.py lldb-api :: commands/process/attach/attach_denied/TestAttachDenied.py lldb-api :: python_api/interpreter/TestCommandInterpreterAPI.py lldb-api :: benchmarks/continue/TestBenchmarkContinue.py lldb-api :: lang/cpp/llvm-style/TestLLVMStyle.py lldb-api :: functionalities/memory-region/TestMemoryRegion.py lldb-api :: python_api/module_section/TestModuleAndSection.py lldb-api :: python_api/lldbutil/iter/TestLLDBIterator.py lldb-api :: functionalities/abbreviation/TestAbbreviations.py lldb-api :: functionalities/data-formatter/data-formatter-stl/libstdcpp/map/TestDataFormatterStdMap.py lldb-api :: commands/expression/completion/TestExprCompletion.py lldb-api :: lang/cpp/class_static/TestStaticVariables.py lldb-api :: commands/expression/import-std-module/forward_list-dbg-info-content/TestDbgInfoContentForwardList.py lldb-api :: macosx/load-kext/TestLoadKext.py lldb-api :: python_api/formatters/TestFormattersSBAPI.py lldb-api :: functionalities/stats_api/TestStatisticsAPI.py lldb-api :: functionalities/breakpoint/breakpoint_command/TestRegexpBreakCommand.py lldb-api :: lang/c/bitfields/TestBitfields.py lldb-api :: functionalities/thread/concurrent_events/TestConcurrentWatchBreakDelay.py lldb-api :: functionalities/data-formatter/data-formatter-stl/libcxx/tuple/TestDataFormatterLibcxxTuple.py lldb-api :: functionalities/data-formatter/data-formatter-stl/libcxx/list/TestDataFormatterLibcxxList.py lldb-api :: lang/objc/objc-new-syntax/TestObjCNewSyntaxLiteral.py lldb-api :: lang/cpp/this/TestCPPThis.py lldb-api :: lang/c/enum_types/TestEnumTypes.py lldb-api :: functionalities/data-formatter/data-formatter-stl/libstdcpp/iterator/TestDataFormatterStdIterator.py lldb-api :: commands/expression/import-std-module/vector-bool/TestBoolVector.py lldb-api :: functionalities/data-formatter/setvaluefromcstring/TestSetValueFromCString.py lldb-api :: commands/expression/function_template_specialization_temp_args/TestFunctionTemplateSpecializationTempArgs.py lldb-api :: commands/expression/import-std-module/weak_ptr/TestWeakPtr.py lldb-api :: types/TestFloatTypesExpr.py lldb-api :: functionalities/data-formatter/data-formatter-stl/libcxx/multiset/TestDataFormatterLibcxxMultiSet.py lldb-api :: lang/objc/objc-new-syntax/TestObjCNewSyntaxArray.py lldb-api :: functionalities/inferior-crashing/recursive-inferior/TestRecursiveInferior.py lldb-api :: functionalities/data-formatter/type_summary_list_arg/TestTypeSummaryListArg.py lldb-api :: commands/command/script/TestCommandScript.py lldb-api :: commands/disassemble/basic/TestDisassembleBreakpoint.py lldb-api :: commands/expression/import-std-module/list-basic/TestBasicList.py lldb-api :: python_api/frame/get-variables/TestGetVariables.py lldb-api :: functionalities/data-formatter/format-propagation/TestFormatPropagation.py lldb-api :: commands/expression/vector_of_enums/TestVectorOfEnums.py lldb-api :: functionalities/breakpoint/address_breakpoints/TestAddressBreakpoints.py lldb-api :: commands/expression/import-std-module/shared_ptr-dbg-info-content/TestSharedPtrDbgInfoContent.py lldb-api :: functionalities/data-formatter/typedef_array/TestTypedefArray.py lldb-api :: functionalities/thread/state/TestThreadStates.py lldb-api :: lang/cpp/dynamic-value-same-basename/TestDynamicValueSameBase.py lldb-api :: commands/watchpoints/watchpoint_disable/TestWatchpointDisable.py lldb-api :: functionalities/postmortem/elf-core/TestLinuxCore.py lldb-api :: functionalities/multiword-commands/TestMultiWordCommands.py lldb-api :: tools/lldb-server/register-reading/TestGdbRemoteGPacket.py lldb-api :: functionalities/data-formatter/refpointer-recursion/TestDataFormatterRefPtrRecursion.py lldb-api :: functionalities/darwin_log/source/info/TestDarwinLogSourceInfo.py lldb-api :: lang/c/stepping/TestStepAndBreakpoints.py lldb-api :: lang/cpp/template-function/TestTemplateFunctions.py lldb-api :: python_api/value_var_update/TestValueVarUpdate.py lldb-api :: functionalities/object-file/TestImageListMultiArchitecture.py lldb-api :: commands/expression/macros/TestMacros.py lldb-api :: commands/expression/scoped_enums/TestScopedEnumType.py lldb-api :: functionalities/thread/backtrace_all/TestBacktraceAll.py lldb-api :: functionalities/tsan/thread_leak/TestTsanThreadLeak.py lldb-api :: lang/cpp/static_methods/TestCPPStaticMethods.py lldb-api :: tools/lldb-server/TestGdbRemoteKill.py lldb-api :: functionalities/data-formatter/data-formatter-stl/libstdcpp/smart_ptr/TestDataFormatterStdSmartPtr.py lldb-api :: functionalities/tsan/cpp_global_location/TestTsanCPPGlobalLocation.py lldb-api :: commands/expression/rdar42038760/TestScalarURem.py lldb-api :: functionalities/tsan/basic/TestTsanBasic.py lldb-api :: functionalities/darwin_log/filter/regex/activity-chain/TestDarwinLogFilterRegexActivityChain.py lldb-api :: functionalities/breakpoint/global_constructor/TestBreakpointInGlobalConstructor.py lldb-api :: functionalities/avoids-fd-leak/TestFdLeak.py lldb-api :: commands/expression/anonymous-struct/TestCallUserAnonTypedef.py lldb-api :: tools/lldb-vscode/variables/TestVSCode_variables.py lldb-api :: functionalities/data-formatter/synthupdate/TestSyntheticFilterRecompute.py lldb-api :: functionalities/breakpoint/comp_dir_symlink/TestCompDirSymLink.py lldb-api :: functionalities/gdb_remote_client/TestStopPCs.py lldb-api :: commands/disassemble/basic/TestFrameDisassemble.py lldb-api :: commands/watchpoints/watchpoint_commands/command/TestWatchpointCommandLLDB.py lldb-api :: lang/cpp/dynamic-value/TestCppValueCast.py lldb-api :: functionalities/thread/thread_specific_break_plus_condition/TestThreadSpecificBpPlusCondition.py lldb-api :: functionalities/breakpoint/cpp/TestCPPBreakpointLocations.py lldb-api :: commands/expression/call-function/TestCallBuiltinFunction.py lldb-api :: functionalities/plugins/command_plugin/TestPluginCommands.py lldb-api :: commands/watchpoints/watchpoint_commands/condition/TestWatchpointConditionCmd.py lldb-api :: functionalities/data-formatter/data-formatter-stl/libcxx/set/TestDataFormatterLibcxxSet.py lldb-api :: commands/expression/namespace_local_var_same_name_obj_c/TestNamespaceLocalVarSameNameObjC.py lldb-api :: python_api/sbdata/TestSBData.py lldb-api :: tools/lldb-server/TestGdbRemoteAttach.py lldb-api :: functionalities/thread/concurrent_events/TestConcurrentBreakpointsDelayedBreakpointOneWatchpoint.py lldb-api :: functionalities/unwind/noreturn/TestNoreturnUnwind.py lldb-api :: lang/objc/objc-optimized/TestObjcOptimized.py lldb-api :: lang/objc/real-definition/TestRealDefinition.py lldb-api :: functionalities/data-formatter/data-formatter-cpp/TestDataFormatterCpp.py lldb-api :: commands/expression/fixits/TestFixIts.py lldb-api :: commands/watchpoints/multiple_threads/TestWatchpointMultipleThreads.py lldb-api :: functionalities/darwin_log/filter/exact_match/subsystem/TestDarwinLogFilterMatchSubsystem.py lldb-api :: lang/objc/modules-inline-functions/TestModulesInlineFunctions.py lldb-api :: functionalities/data-formatter/data-formatter-objc/TestDataFormatterObjCExpr.py lldb-api :: tools/lldb-server/TestGdbRemoteProcessInfo.py lldb-api :: lang/cpp/limit-debug-info/TestWithLimitDebugInfo.py lldb-api :: commands/watchpoints/watchpoint_size/TestWatchpointSizes.py lldb-api :: functionalities/process_group/TestChangeProcessGroup.py lldb-api :: lang/objc/single-entry-dictionary/TestObjCSingleEntryDictionary.py lldb-api :: lang/cpp/type_lookup/TestCppTypeLookup.py lldb-api :: commands/expression/timeout/TestCallWithTimeout.py lldb-api :: functionalities/breakpoint/breakpoint_in_delayslot/TestAvoidBreakpointInDelaySlot.py lldb-api :: functionalities/data-formatter/data-formatter-stl/libstdcpp/tuple/TestDataFormatterStdTuple.py lldb-api :: commands/settings/quoting/TestQuoting.py lldb-api :: types/TestIntegerTypesExpr.py lldb-api :: lang/cpp/extern_c/TestExternCSymbols.py lldb-api :: functionalities/inferior-assert/TestInferiorAssert.py lldb-api :: commands/register/register/intel_xtended_registers/mpx_bound_violation/TestBoundViolation.py lldb-api :: python_api/function_symbol/TestDisasmAPI.py lldb-api :: macosx/add-dsym/TestAddDsymMidExecutionCommand.py lldb-api :: functionalities/data-formatter/dump_dynamic/TestDumpDynamic.py lldb-api :: tools/lldb-server/TestGdbRemoteSingleStep.py lldb-api :: functionalities/thread/create_during_step/TestCreateDuringStep.py lldb-api :: api/log/TestAPILog.py lldb-api :: macosx/universal/TestUniversal.py lldb-api :: functionalities/postmortem/elf-core/gcore/TestGCore.py lldb-api :: commands/platform/basic/TestPlatformCommand.py lldb-api :: python_api/symbol-context/two-files/TestSymbolContextTwoFiles.py lldb-api :: functionalities/signal/handle-abrt/TestHandleAbort.py lldb-api :: tools/lldb-vscode/breakpoint/TestVSCode_setBreakpoints.py lldb-api :: commands/watchpoints/multiple_hits/TestMultipleHits.py lldb-api :: commands/expression/static-initializers/TestStaticInitializers.py lldb-api :: functionalities/gdb_remote_client/TestNoWatchpointSupportInfo.py lldb-api :: lang/objc/foundation/TestObjCMethodsString.py lldb-api :: python_api/sbstructureddata/TestStructuredDataAPI.py lldb-api :: lang/cpp/operators/TestCppOperators.py lldb-api :: linux/builtin_trap/TestBuiltinTrap.py lldb-api :: functionalities/thread/concurrent_events/TestConcurrentCrashWithBreak.py lldb-api :: functionalities/data-formatter/parray/TestPrintArray.py lldb-api :: arm/breakpoint-thumb-codesection/TestBreakpointThumbCodesection.py lldb-api :: lang/objc/modules-incomplete/TestIncompleteModules.py lldb-api :: lang/c/unicode/TestUnicodeSymbols.py lldb-api :: functionalities/data-formatter/data-formatter-objc/TestDataFormatterObjCNSDate.py lldb-api :: types/TestRecursiveTypes.py lldb-api :: tools/lldb-server/TestGdbRemote_qThreadStopInfo.py lldb-api :: functionalities/breakpoint/breakpoint_options/TestBreakpointOptions.py lldb-api :: commands/expression/import-std-module/weak_ptr-dbg-info-content/TestDbgInfoContentWeakPtr.py lldb-api :: commands/expression/context-object/TestContextObject.py lldb-api :: commands/expression/import-std-module/vector-basic/TestBasicVector.py lldb-api :: python_api/sbvalue_persist/TestSBValuePersist.py lldb-api :: commands/expression/argument_passing_restrictions/TestArgumentPassingRestrictions.py lldb-api :: functionalities/darwin_log/filter/exact_match/message/TestDarwinLogFilterMatchMessage.py lldb-api :: functionalities/unwind/noreturn/module-end/TestNoReturnModuleEnd.py lldb-api :: commands/expression/unicode-in-variable/TestUnicodeInVariable.py lldb-api :: commands/frame/var/TestFrameVar.py lldb-api :: functionalities/thread/concurrent_events/TestConcurrentTwoBreakpointsOneDelaySignal.py lldb-api :: commands/expression/no-deadlock/TestExprDoesntBlock.py lldb-api :: functionalities/data-formatter/data-formatter-stl/libcxx/iterator/TestDataFormatterLibccIterator.py lldb-api :: functionalities/data-formatter/data-formatter-stl/libstdcpp/vbool/TestDataFormatterStdVBool.py lldb-api :: macosx/indirect_symbol/TestIndirectSymbols.py lldb-api :: commands/expression/import-std-module/list-dbg-info-content/TestDbgInfoContentList.py lldb-api :: functionalities/postmortem/minidump-new/TestMiniDumpUUID.py lldb-api :: functionalities/gdb_remote_client/TestWriteMemory.py lldb-api :: lang/objc/objc-static-method/TestObjCStaticMethod.py lldb-api :: commands/expression/dollar-in-variable/TestDollarInVariable.py lldb-api :: python_api/lldbutil/iter/TestRegistersIterator.py lldb-api :: commands/expression/two-files/TestObjCTypeQueryFromOtherCompileUnit.py lldb-api :: lang/cpp/auto/TestCPPAuto.py lldb-api :: commands/expression/inline-namespace/TestInlineNamespace.py lldb-api :: lang/c/register_variables/TestRegisterVariables.py lldb-api :: tools/lldb-vscode/stackTrace/TestVSCode_stackTrace.py lldb-api :: commands/expression/call-throws/TestCallThatThrows.py lldb-api :: functionalities/mtc/simple/TestMTCSimple.py lldb-api :: python_api/lldbutil/process/TestPrintStackTraces.py lldb-api :: api/check_public_api_headers/TestPublicAPIHeaders.py lldb-api :: lang/objc/foundation/TestFoundationDisassembly.py lldb-api :: types/TestDoubleTypesExpr.py lldb-api :: functionalities/data-formatter/data-formatter-stl/libcxx/atomic/TestLibCxxAtomic.py lldb-api :: functionalities/data-formatter/data-formatter-objc/TestDataFormatterObjCNSError.py lldb-api :: commands/expression/import-std-module/deque-basic/TestBasicDeque.py lldb-api :: lang/objc/objc++/TestObjCXX.py lldb-api :: functionalities/data-formatter/data-formatter-stl/libstdcpp/unique_ptr/invalid/TestDataFormatterInvalidStdUniquePtr.py lldb-api :: terminal/TestSTTYBeforeAndAfter.py lldb-api :: commands/apropos/basic/TestApropos.py lldb-api :: arm/breakpoint-it/TestBreakpointIt.py lldb-api :: benchmarks/startup/TestStartupDelays.py lldb-api :: lang/objc/objc-property/TestObjCProperty.py lldb-api :: python_api/watchpoint/TestWatchpointIgnoreCount.py lldb-api :: functionalities/data-formatter/data-formatter-stl/libcxx/multimap/TestDataFormatterLibccMultiMap.py lldb-api :: functionalities/thread/step_until/TestStepUntil.py lldb-api :: commands/register/register/register_command/TestRegisters.py lldb-api :: lang/objc/objc-super/TestObjCSuper.py lldb-api :: functionalities/type_lookup/TestTypeLookup.py lldb-api :: python_api/watchpoint/watchlocation/TestSetWatchlocation.py lldb-api :: functionalities/step_scripted/TestStepScripted.py lldb-api :: lang/objc/foundation/TestObjCMethods.py lldb-api :: source-manager/TestSourceManager.py lldb-api :: commands/watchpoints/watchpoint_events/TestWatchpointEvents.py lldb-api :: functionalities/target_var/TestTargetVar.py lldb-api :: tools/lldb-server/TestGdbRemoteThreadsInStopReply.py lldb-api :: functionalities/data-formatter/data-formatter-python-synth/TestDataFormatterPythonSynth.py lldb-api :: commands/target/create-no-such-arch/TestNoSuchArch.py lldb-api :: functionalities/data-formatter/varscript_formatting/TestDataFormatterVarScriptFormatting.py lldb-api :: functionalities/inferior-crashing/TestInferiorCrashing.py lldb-api :: functionalities/data-formatter/nssetsynth/TestNSSetSynthetic.py lldb-api :: functionalities/modern-type-lookup/objc-modules/TestObjModulesModernTypeLookup.py lldb-api :: commands/frame/diagnose/virtual-method-call/TestDiagnoseDereferenceVirtualMethodCall.py lldb-api :: commands/watchpoints/multi_watchpoint_slots/TestWatchpointMultipleSlots.py lldb-api :: commands/expression/cast_int_to_anonymous_enum/TestCastIntToAnonymousEnum.py lldb-api :: functionalities/data-formatter/data-formatter-synthval/TestDataFormatterSynthVal.py lldb-api :: python_api/value/linked_list/TestValueAPILinkedList.py lldb-api :: commands/expression/import-std-module/stack/TestStack.py lldb-api :: functionalities/breakpoint/breakpoint_ids/TestBreakpointIDs.py lldb-api :: functionalities/inferior-changed/TestInferiorChanged.py lldb-api :: lang/objc/rdar-11355592/TestRdar11355592.py lldb-api :: lang/objcxx/cxx-bridged-po/TestObjCXXBridgedPO.py lldb-api :: lang/objc/objc-dynamic-value/TestObjCDynamicValue.py lldb-api :: lang/cpp/virtual-overload/TestVirtualOverload.py lldb-api :: functionalities/tail_call_frames/ambiguous_tail_call_seq2/TestAmbiguousTailCallSeq2.py lldb-api :: tools/lldb-server/TestGdbRemoteRegisterState.py lldb-api :: functionalities/gdb_remote_client/TestPlatformClient.py lldb-api :: functionalities/thread/concurrent_events/TestConcurrentSignalNWatchNBreak.py lldb-api :: functionalities/memory/cache/TestMemoryCache.py lldb-api :: functionalities/thread/concurrent_events/TestConcurrentSignalDelayBreak.py lldb-api :: tools/lldb-server/inferior-crash/TestGdbRemoteAbort.py lldb-api :: python_api/frame/inlines/TestInlinedFrame.py lldb-api :: lang/c/forward/TestForwardDeclaration.py lldb-api :: commands/statistics/basic/TestStats.py lldb-api :: functionalities/var_path/TestVarPath.py lldb-api :: functionalities/thread/exit_during_break/TestExitDuringBreak.py lldb-api :: functionalities/set-data/TestSetData.py lldb-api :: benchmarks/expression/TestRepeatedExprs.py lldb-api :: functionalities/data-formatter/data-formatter-stl/libcxx/forward_list/TestDataFormatterLibcxxForwardList.py lldb-api :: functionalities/data-formatter/var-in-aggregate-misuse/TestVarInAggregateMisuse.py lldb-api :: commands/expression/import-std-module/vector-of-vectors/TestVectorOfVectors.py lldb-api :: lang/cpp/unsigned_types/TestUnsignedTypes.py lldb-api :: functionalities/thread/backtrace_limit/TestBacktraceLimit.py lldb-api :: functionalities/thread/concurrent_events/TestConcurrentCrashWithSignal.py lldb-api :: commands/expression/import-std-module/basic/TestImportStdModule.py lldb-api :: driver/batch_mode/TestBatchMode.py lldb-api :: functionalities/data-formatter/frameformat_smallstruct/TestFrameFormatSmallStruct.py lldb-api :: lang/cpp/namespace_conflicts/TestNamespaceConflicts.py lldb-api :: functionalities/completion/TestCompletion.py lldb-api :: functionalities/thread/concurrent_events/TestConcurrentManySignals.py lldb-api :: commands/process/launch-with-shellexpand/TestLaunchWithShellExpand.py lldb-api :: commands/version/TestVersion.py lldb-api :: functionalities/data-formatter/data-formatter-objc/TestDataFormatterObjCNSContainer.py lldb-api :: functionalities/tail_call_frames/disambiguate_paths_to_common_sink/TestDisambiguatePathsToCommonSink.py lldb-api :: functionalities/thread/concurrent_events/TestConcurrentDelayedCrashWithBreakpointWatchpoint.py lldb-api :: commands/apropos/with-process/TestAproposWithProcess.py lldb-api :: lang/cpp/accelerator-table/TestCPPAccelerator.py lldb-api :: lang/c/stepping/TestThreadStepping.py lldb-api :: python_api/value/TestValueAPI.py lldb-api :: lang/objc/rdar-10967107/TestRdar10967107.py lldb-api :: commands/expression/diagnostics/TestExprDiagnostics.py lldb-api :: commands/expression/persistent_ptr_update/TestPersistentPtrUpdate.py lldb-api :: functionalities/thread/concurrent_events/TestConcurrentCrashWithWatchpoint.py lldb-api :: commands/target/basic/TestTargetCommand.py lldb-api :: lang/cpp/lambdas/TestLambdas.py lldb-api :: lang/objc/foundation/TestConstStrings.py lldb-api :: python_api/sbvalue_const_addrof/TestSBValueConstAddrOf.py lldb-api :: functionalities/data-formatter/data-formatter-enum-format/TestDataFormatterEnumFormat.py lldb-api :: tools/lldb-vscode/launch/TestVSCode_launch.py lldb-api :: lang/c/local_variables/TestLocalVariables.py lldb-api :: functionalities/data-formatter/ostypeformatting/TestFormattersOsType.py lldb-api :: commands/command/script/import/TestImport.py lldb-api :: functionalities/breakpoint/breakpoint_ignore_count/TestBreakpointIgnoreCount.py lldb-api :: lang/cpp/thread_local/TestThreadLocal.py lldb-api :: tools/lldb-server/libraries-svr4/TestGdbRemoteLibrariesSvr4Support.py lldb-api :: functionalities/data-formatter/data-formatter-smart-array/TestDataFormatterSmartArray.py lldb-api :: commands/frame/diagnose/dereference-this/TestDiagnoseDereferenceThis.py lldb-api :: functionalities/darwin_log/filter/regex/message/TestDarwinLogFilterRegexMessage.py lldb-api :: macosx/function-starts/TestFunctionStarts.py lldb-api :: commands/gui/invalid-args/TestInvalidArgsGui.py lldb-api :: arm/emulation/TestEmulations.py lldb-api :: functionalities/thread/concurrent_events/TestConcurrentTwoWatchpointsOneSignal.py lldb-api :: lang/objc/modules-cache/TestClangModulesCache.py lldb-api :: functionalities/breakpoint/breakpoint_command/TestBreakpointCommand.py lldb-api :: lang/c/unions/TestUnionMembers.py lldb-api :: tools/lldb-server/inferior-crash/TestGdbRemoteSegFault.py lldb-api :: macosx/find-app-in-bundle/TestFindAppInBundle.py lldb-api :: functionalities/thread/concurrent_events/TestConcurrentSignalWatchBreak.py lldb-api :: commands/expression/po_verbosity/TestPoVerbosity.py lldb-api :: python_api/debugger/TestDebuggerAPI.py lldb-api :: functionalities/breakpoint/breakpoint_command/TestBreakpointCommandsFromPython.py lldb-api :: lang/objc/global_ptrs/TestGlobalObjects.py lldb-api :: functionalities/data-formatter/data-formatter-objc/TestDataFormatterObjCNSURL.py lldb-api :: commands/add-dsym/uuid/TestAddDsymCommand.py lldb-api :: functionalities/data-formatter/data-formatter-objc/TestDataFormatterObjCNSData.py lldb-api :: functionalities/inferior-crashing/TestInferiorCrashingStep.py lldb-api :: lang/c/modules/TestCModules.py lldb-api :: functionalities/gdb_remote_client/TestArmRegisterDefinition.py lldb-api :: lang/cpp/char1632_t/TestChar1632T.py lldb-api :: lang/objc/rdar-12408181/TestRdar12408181.py lldb-api :: linux/add-symbols/TestTargetSymbolsAddCommand.py lldb-api :: functionalities/gdb_remote_client/TestRestartBug.py lldb-api :: functionalities/data-formatter/data-formatter-stl/libcxx/queue/TestDataFormatterLibcxxQueue.py lldb-api :: lang/objc/hidden-ivars/TestHiddenIvars.py lldb-api :: functionalities/type_completion/TestTypeCompletion.py lldb-api :: commands/expression/call-function/TestCallStopAndContinue.py lldb-api :: python_api/signals/TestSignalsAPI.py lldb-api :: commands/reproducer/invalid-args/TestInvalidArgsReproducer.py lldb-api :: lang/cpp/static_members/TestCPPStaticMembers.py lldb-api :: commands/command/nested_alias/TestNestedAlias.py lldb-api :: commands/expression/completion-crash1/TestCompletionCrash1.py lldb-api :: functionalities/thread/concurrent_events/TestConcurrentManyCrash.py lldb-api :: functionalities/darwin_log/filter/regex/subsystem/TestDarwinLogFilterRegexSubsystem.py lldb-api :: functionalities/fat_archives/TestFatArchives.py lldb-api :: lang/objc/bitfield_ivars/TestBitfieldIvars.py lldb-api :: tools/lldb-server/commandline/TestStubReverseConnect.py lldb-api :: commands/watchpoints/watchpoint_commands/TestWatchpointCommands.py lldb-api :: commands/register/register/intel_xtended_registers/mpx_offset_intersection/TestMPXOffsetIntersection.py lldb-api :: functionalities/rerun/TestRerun.py lldb-api :: commands/log/basic/TestLogging.py lldb-api :: commands/expression/ignore-artificial-constructors/TestIgnoreArtificialConstructors.py lldb-api :: functionalities/data-formatter/vector-types/TestVectorTypesFormatting.py lldb-api :: functionalities/data-formatter/data-formatter-stl/libcxx/function/TestLibCxxFunction.py lldb-api :: python_api/watchpoint/TestWatchpointIter.py lldb-api :: lang/objc/orderedset/TestOrderedSet.py lldb-api :: commands/expression/import-std-module/unique_ptr-dbg-info-content/TestUniquePtrDbgInfoContent.py lldb-api :: functionalities/tail_call_frames/disambiguate_tail_call_seq/TestDisambiguateTailCallSeq.py lldb-api :: python_api/interpreter/TestRunCommandInterpreterAPI.py lldb-api :: lang/c/array_types/TestArrayTypes.py lldb-api :: functionalities/breakpoint/hardware_breakpoints/hardware_breakpoint_on_multiple_threads/TestHWBreakMultiThread.py lldb-api :: lang/cpp/function-template-parameter-pack/TestFunctionTemplateParameterPack.py lldb-api :: functionalities/data-formatter/data-formatter-synth/TestDataFormatterSynth.py lldb-api :: lang/cpp/class_types/TestClassTypes.py lldb-api :: functionalities/load_unload/TestLoadUnload.py lldb-api :: iohandler/completion/TestIOHandlerCompletion.py lldb-api :: lang/cpp/class-template-parameter-pack/TestClassTemplateParameterPack.py lldb-api :: functionalities/darwin_log/filter/regex/category/TestDarwinLogFilterRegexCategory.py lldb-api :: commands/expression/import-std-module/forward_list-basic/TestBasicForwardList.py lldb-api :: functionalities/inferior-crashing/recursive-inferior/TestRecursiveInferiorStep.py lldb-api :: functionalities/memory/read/TestMemoryRead.py lldb-api :: lang/objc/ptr_refs/TestPtrRefsObjC.py lldb-api :: commands/expression/ir-interpreter/TestIRInterpreter.py lldb-api :: lang/c/const_variables/TestConstVariables.py lldb-api :: functionalities/gdb_remote_client/TestGDBRemoteClient.py lldb-api :: functionalities/data-formatter/data-formatter-disabling/TestDataFormatterDisabling.py lldb-api :: functionalities/breakpoint/breakpoint_language/TestBreakpointLanguage.py lldb-api :: lang/objc/radar-9691614/TestObjCMethodReturningBOOL.py lldb-api :: functionalities/darwin_log/filter/exact_match/activity/TestDarwinLogFilterMatchActivity.py lldb-api :: tools/lldb-server/TestGdbRemoteExitCode.py lldb-api :: commands/expression/char/TestExprsChar.py lldb-api :: commands/expression/ir-interpreter-phi-nodes/TestIRInterpreterPHINodes.py lldb-api :: functionalities/data-formatter/data-formatter-objc/nsstring/TestDataFormatterNSString.py lldb-api :: functionalities/load_using_paths/TestLoadUsingPaths.py lldb-api :: lang/cpp/function_refs/TestFunctionRefs.py lldb-api :: commands/frame/diagnose/complicated-expression/TestComplicatedExpression.py lldb-api :: commands/watchpoints/watchpoint_commands/command/TestWatchpointCommandPython.py lldb-api :: commands/expression/import-std-module/shared_ptr/TestSharedPtr.py lldb-api :: commands/watchpoints/hello_watchlocation/TestWatchLocation.py lldb-api :: lang/cpp/namespace_definitions/TestNamespaceDefinitions.py lldb-api :: commands/expression/test/TestExprs2.py lldb-api :: lang/objc/objc-class-method/TestObjCClassMethod.py lldb-api :: python_api/file_handle/TestFileHandle.py lldb-api :: functionalities/breakpoint/objc/TestObjCBreakpoints.py lldb-api :: functionalities/dead-strip/TestDeadStrip.py lldb-api :: macosx/order/TestOrderFile.py lldb-api :: functionalities/breakpoint/serialize/TestBreakpointSerialization.py lldb-api :: python_api/value/change_values/TestChangeValueAPI.py lldb-api :: functionalities/darwin_log/source/debug/TestDarwinLogSourceDebug.py lldb-api :: python_api/section/TestSectionAPI.py lldb-api :: functionalities/postmortem/minidump-new/TestMiniDumpNew.py lldb-api :: functionalities/breakpoint/inlined_breakpoints/TestInlinedBreakpoints.py lldb-api :: lang/cpp/scope/TestCppScope.py lldb-api :: lang/cpp/namespace/TestNamespace.py lldb-api :: lang/cpp/global_operators/TestCppGlobalOperators.py lldb-api :: api/multiple-debuggers/TestMultipleDebuggers.py lldb-api :: functionalities/data-formatter/data-formatter-stl/libcxx/unordered/TestDataFormatterUnordered.py lldb-api :: functionalities/thread/concurrent_events/TestConcurrentManyBreakpoints.py lldb-api :: functionalities/breakpoint/breakpoint_set_restart/TestBreakpointSetRestart.py lldb-api :: lang/c/function_types/TestFunctionTypes.py lldb-api :: macosx/macabi/TestMacABImacOSFramework.py lldb-api :: lang/objc/objc-stepping/TestObjCStepping.py lldb-api :: python_api/process/read-mem-cstring/TestReadMemCString.py lldb-api :: python_api/event/TestEvents.py lldb-api :: functionalities/target-new-solib-notifications/TestModuleLoadedNotifys.py lldb-api :: functionalities/conditional_break/TestConditionalBreak.py lldb-api :: functionalities/breakpoint/consecutive_breakpoints/TestConsecutiveBreakpoints.py lldb-api :: functionalities/data-formatter/data-formatter-categories/TestDataFormatterCategories.py lldb-api :: functionalities/data-formatter/data-formatter-objc/nsindexpath/TestDataFormatterNSIndexPath.py lldb-api :: functionalities/data-formatter/poarray/TestPrintObjectArray.py lldb-api :: commands/expression/pr35310/TestExprsBug35310.py lldb-api :: commands/watchpoints/watchpoint_set_command/TestWatchLocationWithWatchSet.py

Hide Details

Hide Details

Slowest Tests: -------------------------------------------------------------------------- 25.38s: lldb-shell :: Reproducer/Modules/TestModuleCXX.test 25.38s: lldb-shell :: Reproducer/TestWorkingDir.test 25.45s: lldb-shell :: Reproducer/TestFileRepro.test 26.12s: lldb-shell :: Reproducer/Functionalities/TestExpressionEvaluation.test 28.18s: lldb-shell :: Process/TestEnvironment.test 28.39s: lldb-shell :: SymbolFile/DWARF/debug-types-missing-signature.test 29.45s: lldb-shell :: SymbolFile/DWARF/find-function-regex.cpp 31.75s: lldb-shell :: ObjectFile/Breakpad/breakpad-identification.test 34.12s: lldb-shell :: ExecControl/StopHook/stop-hook.test 35.40s: lldb-shell :: Reproducer/TestDump.test 39.71s: lldb-shell :: Reproducer/TestReuseDirectory.test 45.48s: lldb-shell :: SymbolFile/DWARF/debug-types-basic.test 50.71s: lldb-shell :: SymbolFile/DWARF/find-basic-type.cpp 52.47s: lldb-shell :: Minidump/fb-dump.test 53.50s: lldb-shell :: SymbolFile/DWARF/find-basic-namespace.cpp 58.24s: lldb-shell :: SymbolFile/DWARF/find-variable-file.cpp 63.11s: lldb-shell :: SymbolFile/DWARF/find-basic-variable.cpp 69.81s: lldb-shell :: Expr/TestIRMemoryMap.test 81.53s: lldb-shell :: SymbolFile/DWARF/find-basic-function.cpp 91.37s: lldb-shell :: Minidump/dump-all.test

Hide Details

Tests Times: -------------------------------------------------------------------------- [ Range ] :: [ Percentage ] :: [ Count ] -------------------------------------------------------------------------- [ 0.0s, 5.0s) :: [****************** ] :: [ 845/1794] [ 5.0s,10.0s) :: [** ] :: [ 106/1794] [10.0s,15.0s) :: [***************** ] :: [ 796/1794] [15.0s,20.0s) :: [ ] :: [ 13/1794] [20.0s,25.0s) :: [ ] :: [ 12/1794] [25.0s,30.0s) :: [ ] :: [ 8/1794] [30.0s,35.0s) :: [ ] :: [ 2/1794] [35.0s,40.0s) :: [ ] :: [ 2/1794] [40.0s,45.0s) :: [ ] :: [ 1/1794] [45.0s,50.0s) :: [ ] :: [ 1/1794] [50.0s,55.0s) :: [ ] :: [ 2/1794] [55.0s,60.0s) :: [ ] :: [ 1/1794] [60.0s,65.0s) :: [ ] :: [ 1/1794] [65.0s,70.0s) :: [ ] :: [ 1/1794] [70.0s,75.0s) :: [ ] :: [ 1/1794] [75.0s,80.0s) :: [ ] :: [ 0/1794] [80.0s,85.0s) :: [ ] :: [ 1/1794] [85.0s,90.0s) :: [ ] :: [ 0/1794] [90.0s,95.0s) :: [ ] :: [ 1/1794] Expected Passes : 973 Expected Failures : 6 Unsupported Tests : 51 Unresolved Tests : 764 FAILED: tools/lldb/test/CMakeFiles/check-lldb-lit cd /Users/buildslave/jenkins/workspace/lldb-cmake-sanitized/lldb-build/tools/lldb/test && /usr/local/bin/python /Users/buildslave/jenkins/workspace/lldb-cmake-sanitized/lldb-build/./bin/llvm-lit -v --time-tests --shuffle --xunit-xml-output=/Users/buildslave/jenkins/workspace/lldb-cmake-sanitized/test/results.xml -v --timeout 1200 /Users/buildslave/jenkins/workspace/lldb-cmake-sanitized/lldb-build/tools/lldb/test ninja: build stopped: subcommand failed. Command failed: Command '['/usr/bin/env', 'TERM=vt100', '/usr/local/bin/ninja', '-v', 'check-lldb']' returned non-zero exit status 1. Command: ['/usr/bin/env', 'TERM=vt100', '/usr/local/bin/ninja', '-v', 'check-lldb'] [Pipeline] } [Pipeline] // timeout [Pipeline] } [Pipeline] // stage [Pipeline] stage [Pipeline] { (Declarative: Post Actions) [Pipeline] scanForIssues No credentials specified [Clang (LLVM based)] Sleeping for 5 seconds due to JENKINS-32191... [Clang (LLVM based)] Parsing console log (workspace: '/Users/buildslave/jenkins/workspace/lldb-cmake-sanitized') [Pipeline] junit Recording test results [Pipeline] } [Pipeline] // stage [Pipeline] } [Pipeline] // withEnv [Pipeline] } [Pipeline] // node [Pipeline] End of Pipeline [BFA] Scanning build for known causes... [BFA] Found failure cause(s): [BFA] Regression test failed from category Test [BFA] Ninja target failed from category Compile [BFA] Done. 2s ERROR: script returned exit code 1 Finished: FAILURE