Regression

lldb-unit.Utility/_/UtilityTests.TimerTest.CategoryTimesStats (from lldb-unit)

Failing for the past 1 build (Since Failed#509 )
Took 3 sec.

Stacktrace

Note: Google Test filter = TimerTest.CategoryTimesStats
[==========] Running 1 test from 1 test case.
[----------] Global test environment set-up.
[----------] 1 test from TimerTest
[ RUN      ] TimerTest.CategoryTimesStats
/Users/buildslave/jenkins/workspace/lldb-cmake-sanitized/llvm-project/lldb/unittests/Utility/TimerTest.cpp:102: Failure
      Expected: 6
To be equal to: sscanf(ss.GetData(), "%lf sec (total: %lfs; child: %lfs; count: %d) for CAT1%*[\n ]" "%lf sec (total: %*fs; child: %*fs; count: %d) for CAT2", &seconds1, &total1, &child1, &count1, &seconds2, &count2)
      Which is: 4
String: 0.152082173 sec (total: 0.152s; child: 0.000s; count: 2) for CAT2
0.106696039 sec (total: 0.259s; child: 0.152s; count: 1) for CAT1

[  FAILED  ] TimerTest.CategoryTimesStats (261 ms)
[----------] 1 test from TimerTest (261 ms total)

[----------] Global test environment tear-down
[==========] 1 test from 1 test case ran. (261 ms total)
[  PASSED  ] 0 tests.
[  FAILED  ] 1 test, listed below:
[  FAILED  ] TimerTest.CategoryTimesStats

 1 FAILED TEST