FailedConsole Output

Skipping 3,039 KB.. Full Log
: Interceptors are not working. This may be because AddressSanitizer is loaded too late (e.g. via dlopen). Please launch the executable with:
DYLD_INSERT_LIBRARIES=/Users/buildslave/jenkins/workspace/lldb-cmake-sanitized/host-compiler/lib/clang/10.0.0/lib/darwin/libclang_rt.asan_osx_dynamic.dylib
"interceptors not installed" && 0
********************
UNRESOLVED: lldb-api :: commands/frame/diagnose/complicated-expression/TestComplicatedExpression.py (1611 of 1799)
******************** TEST 'lldb-api :: commands/frame/diagnose/complicated-expression/TestComplicatedExpression.py' FAILED ********************
Unable to find 'RESULT: PASSED' in dotest output (exit code -6):

Hide Details

lldb version 10.0.99 (http://labmaster3.local/git/llvm-project.git revision 0e0dea82681a86a09ceed0afd321367a35bfa051) clang revision a75f8d98d7ac9e557b238a229a9a2647c71feed1 llvm revision a75f8d98d7ac9e557b238a229a9a2647c71feed1 ==82833==ERROR: Interceptors are not working. This may be because AddressSanitizer is loaded too late (e.g. via dlopen). Please launch the executable with: DYLD_INSERT_LIBRARIES=/Users/buildslave/jenkins/workspace/lldb-cmake-sanitized/host-compiler/lib/clang/10.0.0/lib/darwin/libclang_rt.asan_osx_dynamic.dylib "interceptors not installed" && 0 ******************** UNRESOLVED: lldb-api :: commands/log/invalid-args/TestInvalidArgsLog.py (1612 of 1799) ******************** TEST 'lldb-api :: commands/log/invalid-args/TestInvalidArgsLog.py' FAILED ******************** Unable to find 'RESULT: PASSED' in dotest output (exit code -6):

Hide Details

lldb version 10.0.99 (http://labmaster3.local/git/llvm-project.git revision 0e0dea82681a86a09ceed0afd321367a35bfa051) clang revision a75f8d98d7ac9e557b238a229a9a2647c71feed1 llvm revision a75f8d98d7ac9e557b238a229a9a2647c71feed1 ==82832==ERROR: Interceptors are not working. This may be because AddressSanitizer is loaded too late (e.g. via dlopen). Please launch the executable with: DYLD_INSERT_LIBRARIES=/Users/buildslave/jenkins/workspace/lldb-cmake-sanitized/host-compiler/lib/clang/10.0.0/lib/darwin/libclang_rt.asan_osx_dynamic.dylib "interceptors not installed" && 0 ******************** PASS: lldb-unit :: Utility/./UtilityTests/StringExtractorTest.GetHexBytesAvail_Underflow (1613 of 1799) UNRESOLVED: lldb-api :: commands/expression/pr35310/TestExprsBug35310.py (1614 of 1799) ******************** TEST 'lldb-api :: commands/expression/pr35310/TestExprsBug35310.py' FAILED ******************** Unable to find 'RESULT: PASSED' in dotest output (exit code -6):

Hide Details

lldb version 10.0.99 (http://labmaster3.local/git/llvm-project.git revision 0e0dea82681a86a09ceed0afd321367a35bfa051) clang revision a75f8d98d7ac9e557b238a229a9a2647c71feed1 llvm revision a75f8d98d7ac9e557b238a229a9a2647c71feed1 ==82853==ERROR: Interceptors are not working. This may be because AddressSanitizer is loaded too late (e.g. via dlopen). Please launch the executable with: DYLD_INSERT_LIBRARIES=/Users/buildslave/jenkins/workspace/lldb-cmake-sanitized/host-compiler/lib/clang/10.0.0/lib/darwin/libclang_rt.asan_osx_dynamic.dylib "interceptors not installed" && 0 ******************** UNRESOLVED: lldb-api :: functionalities/gdb_remote_client/TestGDBRemoteClient.py (1615 of 1799) ******************** TEST 'lldb-api :: functionalities/gdb_remote_client/TestGDBRemoteClient.py' FAILED ******************** Unable to find 'RESULT: PASSED' in dotest output (exit code -6):

Hide Details

lldb version 10.0.99 (http://labmaster3.local/git/llvm-project.git revision 0e0dea82681a86a09ceed0afd321367a35bfa051) clang revision a75f8d98d7ac9e557b238a229a9a2647c71feed1 llvm revision a75f8d98d7ac9e557b238a229a9a2647c71feed1 ==82838==ERROR: Interceptors are not working. This may be because AddressSanitizer is loaded too late (e.g. via dlopen). Please launch the executable with: DYLD_INSERT_LIBRARIES=/Users/buildslave/jenkins/workspace/lldb-cmake-sanitized/host-compiler/lib/clang/10.0.0/lib/darwin/libclang_rt.asan_osx_dynamic.dylib "interceptors not installed" && 0 ******************** UNRESOLVED: lldb-api :: python_api/disassemble-raw-data/TestDisassemble_VST1_64.py (1616 of 1799) ******************** TEST 'lldb-api :: python_api/disassemble-raw-data/TestDisassemble_VST1_64.py' FAILED ******************** Unable to find 'RESULT: PASSED' in dotest output (exit code -6):

Hide Details

lldb version 10.0.99 (http://labmaster3.local/git/llvm-project.git revision 0e0dea82681a86a09ceed0afd321367a35bfa051) clang revision a75f8d98d7ac9e557b238a229a9a2647c71feed1 llvm revision a75f8d98d7ac9e557b238a229a9a2647c71feed1 ==82851==ERROR: Interceptors are not working. This may be because AddressSanitizer is loaded too late (e.g. via dlopen). Please launch the executable with: DYLD_INSERT_LIBRARIES=/Users/buildslave/jenkins/workspace/lldb-cmake-sanitized/host-compiler/lib/clang/10.0.0/lib/darwin/libclang_rt.asan_osx_dynamic.dylib "interceptors not installed" && 0 ******************** UNRESOLVED: lldb-api :: functionalities/gdb_remote_client/TestNoGPacketSupported.py (1617 of 1799) ******************** TEST 'lldb-api :: functionalities/gdb_remote_client/TestNoGPacketSupported.py' FAILED ******************** Unable to find 'RESULT: PASSED' in dotest output (exit code -6):

Hide Details

lldb version 10.0.99 (http://labmaster3.local/git/llvm-project.git revision 0e0dea82681a86a09ceed0afd321367a35bfa051) clang revision a75f8d98d7ac9e557b238a229a9a2647c71feed1 llvm revision a75f8d98d7ac9e557b238a229a9a2647c71feed1 ==82862==ERROR: Interceptors are not working. This may be because AddressSanitizer is loaded too late (e.g. via dlopen). Please launch the executable with: DYLD_INSERT_LIBRARIES=/Users/buildslave/jenkins/workspace/lldb-cmake-sanitized/host-compiler/lib/clang/10.0.0/lib/darwin/libclang_rt.asan_osx_dynamic.dylib "interceptors not installed" && 0 ******************** UNRESOLVED: lldb-api :: commands/expression/test/TestExprs2.py (1618 of 1799) ******************** TEST 'lldb-api :: commands/expression/test/TestExprs2.py' FAILED ******************** Unable to find 'RESULT: PASSED' in dotest output (exit code -6):

Hide Details

lldb version 10.0.99 (http://labmaster3.local/git/llvm-project.git revision 0e0dea82681a86a09ceed0afd321367a35bfa051) clang revision a75f8d98d7ac9e557b238a229a9a2647c71feed1 llvm revision a75f8d98d7ac9e557b238a229a9a2647c71feed1 ==82879==ERROR: Interceptors are not working. This may be because AddressSanitizer is loaded too late (e.g. via dlopen). Please launch the executable with: DYLD_INSERT_LIBRARIES=/Users/buildslave/jenkins/workspace/lldb-cmake-sanitized/host-compiler/lib/clang/10.0.0/lib/darwin/libclang_rt.asan_osx_dynamic.dylib "interceptors not installed" && 0 ******************** UNRESOLVED: lldb-api :: functionalities/tsan/cpp_global_location/TestTsanCPPGlobalLocation.py (1619 of 1799) ******************** TEST 'lldb-api :: functionalities/tsan/cpp_global_location/TestTsanCPPGlobalLocation.py' FAILED ******************** Unable to find 'RESULT: PASSED' in dotest output (exit code -6):

Hide Details

lldb version 10.0.99 (http://labmaster3.local/git/llvm-project.git revision 0e0dea82681a86a09ceed0afd321367a35bfa051) clang revision a75f8d98d7ac9e557b238a229a9a2647c71feed1 llvm revision a75f8d98d7ac9e557b238a229a9a2647c71feed1 ==82880==ERROR: Interceptors are not working. This may be because AddressSanitizer is loaded too late (e.g. via dlopen). Please launch the executable with: DYLD_INSERT_LIBRARIES=/Users/buildslave/jenkins/workspace/lldb-cmake-sanitized/host-compiler/lib/clang/10.0.0/lib/darwin/libclang_rt.asan_osx_dynamic.dylib "interceptors not installed" && 0 ******************** PASS: lldb-unit :: Utility/./UtilityTests/StringListTest.Clear (1620 of 1799) PASS: lldb-unit :: Process/minidump/./LLDBMinidumpTests/MinidumpParserTest.GetMemoryRegionInfoLinuxMaps (1621 of 1799) PASS: lldb-shell :: Minidump/Windows/Sigsegv/sigsegv.test (1622 of 1799) PASS: lldb-shell :: ObjectFile/PECOFF/basic-info-arm.yaml (1623 of 1799) PASS: lldb-unit :: Process/minidump/./LLDBMinidumpTests/MinidumpParserTest.GetExceptionStream (1624 of 1799) UNRESOLVED: lldb-api :: commands/expression/vector_of_enums/TestVectorOfEnums.py (1625 of 1799) ******************** TEST 'lldb-api :: commands/expression/vector_of_enums/TestVectorOfEnums.py' FAILED ******************** Unable to find 'RESULT: PASSED' in dotest output (exit code -6):

Hide Details

lldb version 10.0.99 (http://labmaster3.local/git/llvm-project.git revision 0e0dea82681a86a09ceed0afd321367a35bfa051) clang revision a75f8d98d7ac9e557b238a229a9a2647c71feed1 llvm revision a75f8d98d7ac9e557b238a229a9a2647c71feed1 ==82913==ERROR: Interceptors are not working. This may be because AddressSanitizer is loaded too late (e.g. via dlopen). Please launch the executable with: DYLD_INSERT_LIBRARIES=/Users/buildslave/jenkins/workspace/lldb-cmake-sanitized/host-compiler/lib/clang/10.0.0/lib/darwin/libclang_rt.asan_osx_dynamic.dylib "interceptors not installed" && 0 ******************** UNRESOLVED: lldb-api :: functionalities/data-formatter/parray/TestPrintArray.py (1626 of 1799) ******************** TEST 'lldb-api :: functionalities/data-formatter/parray/TestPrintArray.py' FAILED ******************** Unable to find 'RESULT: PASSED' in dotest output (exit code -6):

Hide Details

lldb version 10.0.99 (http://labmaster3.local/git/llvm-project.git revision 0e0dea82681a86a09ceed0afd321367a35bfa051) clang revision a75f8d98d7ac9e557b238a229a9a2647c71feed1 llvm revision a75f8d98d7ac9e557b238a229a9a2647c71feed1 ==82914==ERROR: Interceptors are not working. This may be because AddressSanitizer is loaded too late (e.g. via dlopen). Please launch the executable with: DYLD_INSERT_LIBRARIES=/Users/buildslave/jenkins/workspace/lldb-cmake-sanitized/host-compiler/lib/clang/10.0.0/lib/darwin/libclang_rt.asan_osx_dynamic.dylib "interceptors not installed" && 0 ******************** UNRESOLVED: lldb-api :: lang/cpp/dynamic-value/TestCppValueCast.py (1627 of 1799) ******************** TEST 'lldb-api :: lang/cpp/dynamic-value/TestCppValueCast.py' FAILED ******************** Unable to find 'RESULT: PASSED' in dotest output (exit code -6):

Hide Details

lldb version 10.0.99 (http://labmaster3.local/git/llvm-project.git revision 0e0dea82681a86a09ceed0afd321367a35bfa051) clang revision a75f8d98d7ac9e557b238a229a9a2647c71feed1 llvm revision a75f8d98d7ac9e557b238a229a9a2647c71feed1 ==82920==ERROR: Interceptors are not working. This may be because AddressSanitizer is loaded too late (e.g. via dlopen). Please launch the executable with: DYLD_INSERT_LIBRARIES=/Users/buildslave/jenkins/workspace/lldb-cmake-sanitized/host-compiler/lib/clang/10.0.0/lib/darwin/libclang_rt.asan_osx_dynamic.dylib "interceptors not installed" && 0 ******************** PASS: lldb-unit :: Host/./HostTests/FileSystemTest.Exists (1628 of 1799) UNRESOLVED: lldb-api :: functionalities/breakpoint/global_constructor/TestBreakpointInGlobalConstructor.py (1629 of 1799) ******************** TEST 'lldb-api :: functionalities/breakpoint/global_constructor/TestBreakpointInGlobalConstructor.py' FAILED ******************** Unable to find 'RESULT: PASSED' in dotest output (exit code -6):

Hide Details

lldb version 10.0.99 (http://labmaster3.local/git/llvm-project.git revision 0e0dea82681a86a09ceed0afd321367a35bfa051) clang revision a75f8d98d7ac9e557b238a229a9a2647c71feed1 llvm revision a75f8d98d7ac9e557b238a229a9a2647c71feed1 ==82930==ERROR: Interceptors are not working. This may be because AddressSanitizer is loaded too late (e.g. via dlopen). Please launch the executable with: DYLD_INSERT_LIBRARIES=/Users/buildslave/jenkins/workspace/lldb-cmake-sanitized/host-compiler/lib/clang/10.0.0/lib/darwin/libclang_rt.asan_osx_dynamic.dylib "interceptors not installed" && 0 ******************** PASS: lldb-unit :: Utility/./UtilityTests/BinaryStreamTest.PutSLEB128SevenBytes (1630 of 1799) PASS: lldb-unit :: Host/./HostTests/FileSystemTest.GetPermissions (1631 of 1799) UNRESOLVED: lldb-api :: functionalities/data-formatter/data-formatter-stl/libstdcpp/vbool/TestDataFormatterStdVBool.py (1632 of 1799) ******************** TEST 'lldb-api :: functionalities/data-formatter/data-formatter-stl/libstdcpp/vbool/TestDataFormatterStdVBool.py' FAILED ******************** Unable to find 'RESULT: PASSED' in dotest output (exit code -6):

Hide Details

lldb version 10.0.99 (http://labmaster3.local/git/llvm-project.git revision 0e0dea82681a86a09ceed0afd321367a35bfa051) clang revision a75f8d98d7ac9e557b238a229a9a2647c71feed1 llvm revision a75f8d98d7ac9e557b238a229a9a2647c71feed1 ==82936==ERROR: Interceptors are not working. This may be because AddressSanitizer is loaded too late (e.g. via dlopen). Please launch the executable with: DYLD_INSERT_LIBRARIES=/Users/buildslave/jenkins/workspace/lldb-cmake-sanitized/host-compiler/lib/clang/10.0.0/lib/darwin/libclang_rt.asan_osx_dynamic.dylib "interceptors not installed" && 0 ******************** PASS: lldb-unit :: Utility/./UtilityTests/UUIDTest.StringConverion (1633 of 1799) PASS: lldb-unit :: Utility/./UtilityTests/StatusTest.Formatv (1634 of 1799) UNRESOLVED: lldb-api :: functionalities/thread/concurrent_events/TestConcurrentWatchBreak.py (1635 of 1799) ******************** TEST 'lldb-api :: functionalities/thread/concurrent_events/TestConcurrentWatchBreak.py' FAILED ******************** Unable to find 'RESULT: PASSED' in dotest output (exit code -6):

Hide Details

lldb version 10.0.99 (http://labmaster3.local/git/llvm-project.git revision 0e0dea82681a86a09ceed0afd321367a35bfa051) clang revision a75f8d98d7ac9e557b238a229a9a2647c71feed1 llvm revision a75f8d98d7ac9e557b238a229a9a2647c71feed1 ==82963==ERROR: Interceptors are not working. This may be because AddressSanitizer is loaded too late (e.g. via dlopen). Please launch the executable with: DYLD_INSERT_LIBRARIES=/Users/buildslave/jenkins/workspace/lldb-cmake-sanitized/host-compiler/lib/clang/10.0.0/lib/darwin/libclang_rt.asan_osx_dynamic.dylib "interceptors not installed" && 0 ******************** PASS: lldb-unit :: Utility/./UtilityTests/BinaryStreamTest.PutULEB128NineBytes (1636 of 1799) PASS: lldb-unit :: UnwindAssembly/x86/./UnwindAssemblyx86Tests/Testx86AssemblyInspectionEngine.TestPushEDI (1637 of 1799) UNRESOLVED: lldb-api :: functionalities/thread/thread_specific_break_plus_condition/TestThreadSpecificBpPlusCondition.py (1638 of 1799) ******************** TEST 'lldb-api :: functionalities/thread/thread_specific_break_plus_condition/TestThreadSpecificBpPlusCondition.py' FAILED ******************** Unable to find 'RESULT: PASSED' in dotest output (exit code -6):

Hide Details

lldb version 10.0.99 (http://labmaster3.local/git/llvm-project.git revision 0e0dea82681a86a09ceed0afd321367a35bfa051) clang revision a75f8d98d7ac9e557b238a229a9a2647c71feed1 llvm revision a75f8d98d7ac9e557b238a229a9a2647c71feed1 ==82988==ERROR: Interceptors are not working. This may be because AddressSanitizer is loaded too late (e.g. via dlopen). Please launch the executable with: DYLD_INSERT_LIBRARIES=/Users/buildslave/jenkins/workspace/lldb-cmake-sanitized/host-compiler/lib/clang/10.0.0/lib/darwin/libclang_rt.asan_osx_dynamic.dylib "interceptors not installed" && 0 ******************** PASS: lldb-unit :: Process/gdb-remote/./ProcessGdbRemoteTests/GDBRemoteClientBaseTest.SendContinueAndLateInterrupt (1639 of 1799) UNRESOLVED: lldb-api :: lang/objc/foundation/TestObjCMethods2.py (1640 of 1799) ******************** TEST 'lldb-api :: lang/objc/foundation/TestObjCMethods2.py' FAILED ******************** Unable to find 'RESULT: PASSED' in dotest output (exit code -6):

Hide Details

lldb version 10.0.99 (http://labmaster3.local/git/llvm-project.git revision 0e0dea82681a86a09ceed0afd321367a35bfa051) clang revision a75f8d98d7ac9e557b238a229a9a2647c71feed1 llvm revision a75f8d98d7ac9e557b238a229a9a2647c71feed1 ==82998==ERROR: Interceptors are not working. This may be because AddressSanitizer is loaded too late (e.g. via dlopen). Please launch the executable with: DYLD_INSERT_LIBRARIES=/Users/buildslave/jenkins/workspace/lldb-cmake-sanitized/host-compiler/lib/clang/10.0.0/lib/darwin/libclang_rt.asan_osx_dynamic.dylib "interceptors not installed" && 0 ******************** UNRESOLVED: lldb-api :: python_api/watchpoint/TestWatchpointIgnoreCount.py (1641 of 1799) ******************** TEST 'lldb-api :: python_api/watchpoint/TestWatchpointIgnoreCount.py' FAILED ******************** Unable to find 'RESULT: PASSED' in dotest output (exit code -6):

Hide Details

lldb version 10.0.99 (http://labmaster3.local/git/llvm-project.git revision 0e0dea82681a86a09ceed0afd321367a35bfa051) clang revision a75f8d98d7ac9e557b238a229a9a2647c71feed1 llvm revision a75f8d98d7ac9e557b238a229a9a2647c71feed1 ==83001==ERROR: Interceptors are not working. This may be because AddressSanitizer is loaded too late (e.g. via dlopen). Please launch the executable with: DYLD_INSERT_LIBRARIES=/Users/buildslave/jenkins/workspace/lldb-cmake-sanitized/host-compiler/lib/clang/10.0.0/lib/darwin/libclang_rt.asan_osx_dynamic.dylib "interceptors not installed" && 0 ******************** UNRESOLVED: lldb-api :: functionalities/data-formatter/data-formatter-stl/libcxx/initializerlist/TestInitializerList.py (1642 of 1799) ******************** TEST 'lldb-api :: functionalities/data-formatter/data-formatter-stl/libcxx/initializerlist/TestInitializerList.py' FAILED ******************** Unable to find 'RESULT: PASSED' in dotest output (exit code -6):

Hide Details

lldb version 10.0.99 (http://labmaster3.local/git/llvm-project.git revision 0e0dea82681a86a09ceed0afd321367a35bfa051) clang revision a75f8d98d7ac9e557b238a229a9a2647c71feed1 llvm revision a75f8d98d7ac9e557b238a229a9a2647c71feed1 ==83003==ERROR: Interceptors are not working. This may be because AddressSanitizer is loaded too late (e.g. via dlopen). Please launch the executable with: DYLD_INSERT_LIBRARIES=/Users/buildslave/jenkins/workspace/lldb-cmake-sanitized/host-compiler/lib/clang/10.0.0/lib/darwin/libclang_rt.asan_osx_dynamic.dylib "interceptors not installed" && 0 ******************** UNRESOLVED: lldb-api :: commands/expression/options/TestExprOptions.py (1643 of 1799) ******************** TEST 'lldb-api :: commands/expression/options/TestExprOptions.py' FAILED ******************** Unable to find 'RESULT: PASSED' in dotest output (exit code -6):

Hide Details

lldb version 10.0.99 (http://labmaster3.local/git/llvm-project.git revision 0e0dea82681a86a09ceed0afd321367a35bfa051) clang revision a75f8d98d7ac9e557b238a229a9a2647c71feed1 llvm revision a75f8d98d7ac9e557b238a229a9a2647c71feed1 ==83006==ERROR: Interceptors are not working. This may be because AddressSanitizer is loaded too late (e.g. via dlopen). Please launch the executable with: DYLD_INSERT_LIBRARIES=/Users/buildslave/jenkins/workspace/lldb-cmake-sanitized/host-compiler/lib/clang/10.0.0/lib/darwin/libclang_rt.asan_osx_dynamic.dylib "interceptors not installed" && 0 ******************** PASS: lldb-unit :: Utility/./UtilityTests/StreamTest.PutULEB128 (1644 of 1799) UNRESOLVED: lldb-api :: tools/lldb-server/thread-name/TestGdbRemoteThreadName.py (1645 of 1799) ******************** TEST 'lldb-api :: tools/lldb-server/thread-name/TestGdbRemoteThreadName.py' FAILED ******************** Unable to find 'RESULT: PASSED' in dotest output (exit code -6):

Hide Details

lldb version 10.0.99 (http://labmaster3.local/git/llvm-project.git revision 0e0dea82681a86a09ceed0afd321367a35bfa051) clang revision a75f8d98d7ac9e557b238a229a9a2647c71feed1 llvm revision a75f8d98d7ac9e557b238a229a9a2647c71feed1 ==83005==ERROR: Interceptors are not working. This may be because AddressSanitizer is loaded too late (e.g. via dlopen). Please launch the executable with: DYLD_INSERT_LIBRARIES=/Users/buildslave/jenkins/workspace/lldb-cmake-sanitized/host-compiler/lib/clang/10.0.0/lib/darwin/libclang_rt.asan_osx_dynamic.dylib "interceptors not installed" && 0 ******************** PASS: lldb-unit :: Utility/./UtilityTests/StringListTest.JoinThree (1646 of 1799) PASS: lldb-shell :: Commands/CommandScriptImmediateOutput/CommandScriptImmediateOutputConsole.test (1647 of 1799) PASS: lldb-unit :: Host/./HostTests/FileSystemTest.OpenErrno (1648 of 1799) PASS: lldb-unit :: Utility/./UtilityTests/UriParserTest.BadPort2 (1649 of 1799) UNRESOLVED: lldb-api :: commands/disassemble/basic/TestFrameDisassemble.py (1650 of 1799) ******************** TEST 'lldb-api :: commands/disassemble/basic/TestFrameDisassemble.py' FAILED ******************** Unable to find 'RESULT: PASSED' in dotest output (exit code -6):

Hide Details

lldb version 10.0.99 (http://labmaster3.local/git/llvm-project.git revision 0e0dea82681a86a09ceed0afd321367a35bfa051) clang revision a75f8d98d7ac9e557b238a229a9a2647c71feed1 llvm revision a75f8d98d7ac9e557b238a229a9a2647c71feed1 ==83048==ERROR: Interceptors are not working. This may be because AddressSanitizer is loaded too late (e.g. via dlopen). Please launch the executable with: DYLD_INSERT_LIBRARIES=/Users/buildslave/jenkins/workspace/lldb-cmake-sanitized/host-compiler/lib/clang/10.0.0/lib/darwin/libclang_rt.asan_osx_dynamic.dylib "interceptors not installed" && 0 ******************** PASS: lldb-unit :: Utility/./UtilityTests/ArgsTest.BareSingleQuote (1651 of 1799) UNRESOLVED: lldb-api :: functionalities/breakpoint/breakpoint_options/TestBreakpointOptions.py (1652 of 1799) ******************** TEST 'lldb-api :: functionalities/breakpoint/breakpoint_options/TestBreakpointOptions.py' FAILED ******************** Unable to find 'RESULT: PASSED' in dotest output (exit code -6):

Hide Details

lldb version 10.0.99 (http://labmaster3.local/git/llvm-project.git revision 0e0dea82681a86a09ceed0afd321367a35bfa051) clang revision a75f8d98d7ac9e557b238a229a9a2647c71feed1 llvm revision a75f8d98d7ac9e557b238a229a9a2647c71feed1 ==83062==ERROR: Interceptors are not working. This may be because AddressSanitizer is loaded too late (e.g. via dlopen). Please launch the executable with: DYLD_INSERT_LIBRARIES=/Users/buildslave/jenkins/workspace/lldb-cmake-sanitized/host-compiler/lib/clang/10.0.0/lib/darwin/libclang_rt.asan_osx_dynamic.dylib "interceptors not installed" && 0 ******************** UNRESOLVED: lldb-api :: lang/cpp/namespace/TestNamespace.py (1653 of 1799) ******************** TEST 'lldb-api :: lang/cpp/namespace/TestNamespace.py' FAILED ******************** Unable to find 'RESULT: PASSED' in dotest output (exit code -6):

Hide Details

lldb version 10.0.99 (http://labmaster3.local/git/llvm-project.git revision 0e0dea82681a86a09ceed0afd321367a35bfa051) clang revision a75f8d98d7ac9e557b238a229a9a2647c71feed1 llvm revision a75f8d98d7ac9e557b238a229a9a2647c71feed1 ==83063==ERROR: Interceptors are not working. This may be because AddressSanitizer is loaded too late (e.g. via dlopen). Please launch the executable with: DYLD_INSERT_LIBRARIES=/Users/buildslave/jenkins/workspace/lldb-cmake-sanitized/host-compiler/lib/clang/10.0.0/lib/darwin/libclang_rt.asan_osx_dynamic.dylib "interceptors not installed" && 0 ******************** UNRESOLVED: lldb-api :: lang/objc/foundation/TestConstStrings.py (1654 of 1799) ******************** TEST 'lldb-api :: lang/objc/foundation/TestConstStrings.py' FAILED ******************** Unable to find 'RESULT: PASSED' in dotest output (exit code -6):

Hide Details

lldb version 10.0.99 (http://labmaster3.local/git/llvm-project.git revision 0e0dea82681a86a09ceed0afd321367a35bfa051) clang revision a75f8d98d7ac9e557b238a229a9a2647c71feed1 llvm revision a75f8d98d7ac9e557b238a229a9a2647c71feed1 ==83064==ERROR: Interceptors are not working. This may be because AddressSanitizer is loaded too late (e.g. via dlopen). Please launch the executable with: DYLD_INSERT_LIBRARIES=/Users/buildslave/jenkins/workspace/lldb-cmake-sanitized/host-compiler/lib/clang/10.0.0/lib/darwin/libclang_rt.asan_osx_dynamic.dylib "interceptors not installed" && 0 ******************** UNRESOLVED: lldb-api :: functionalities/gdb_remote_client/TestGDBRemoteLoad.py (1655 of 1799) ******************** TEST 'lldb-api :: functionalities/gdb_remote_client/TestGDBRemoteLoad.py' FAILED ******************** Unable to find 'RESULT: PASSED' in dotest output (exit code -6):

Hide Details

lldb version 10.0.99 (http://labmaster3.local/git/llvm-project.git revision 0e0dea82681a86a09ceed0afd321367a35bfa051) clang revision a75f8d98d7ac9e557b238a229a9a2647c71feed1 llvm revision a75f8d98d7ac9e557b238a229a9a2647c71feed1 ==83070==ERROR: Interceptors are not working. This may be because AddressSanitizer is loaded too late (e.g. via dlopen). Please launch the executable with: DYLD_INSERT_LIBRARIES=/Users/buildslave/jenkins/workspace/lldb-cmake-sanitized/host-compiler/lib/clang/10.0.0/lib/darwin/libclang_rt.asan_osx_dynamic.dylib "interceptors not installed" && 0 ******************** PASS: lldb-unit :: Host/./HostTests/ConnectionFileDescriptorTest.TCPGetURIv6 (1656 of 1799) PASS: lldb-unit :: ObjectFile/Breakpad/./ObjectFileBreakpadTests/StackWinRecord.parse (1657 of 1799) PASS: lldb-unit :: Core/./LLDBCoreTests/RichManglingContextTest.FromCxxMethodName (1658 of 1799) UNRESOLVED: lldb-api :: functionalities/tsan/global_location/TestTsanGlobalLocation.py (1659 of 1799) ******************** TEST 'lldb-api :: functionalities/tsan/global_location/TestTsanGlobalLocation.py' FAILED ******************** Unable to find 'RESULT: PASSED' in dotest output (exit code -6):

Hide Details

lldb version 10.0.99 (http://labmaster3.local/git/llvm-project.git revision 0e0dea82681a86a09ceed0afd321367a35bfa051) clang revision a75f8d98d7ac9e557b238a229a9a2647c71feed1 llvm revision a75f8d98d7ac9e557b238a229a9a2647c71feed1 ==83108==ERROR: Interceptors are not working. This may be because AddressSanitizer is loaded too late (e.g. via dlopen). Please launch the executable with: DYLD_INSERT_LIBRARIES=/Users/buildslave/jenkins/workspace/lldb-cmake-sanitized/host-compiler/lib/clang/10.0.0/lib/darwin/libclang_rt.asan_osx_dynamic.dylib "interceptors not installed" && 0 ******************** UNRESOLVED: lldb-api :: commands/expression/macros/TestMacros.py (1660 of 1799) ******************** TEST 'lldb-api :: commands/expression/macros/TestMacros.py' FAILED ******************** Unable to find 'RESULT: PASSED' in dotest output (exit code -6):

Hide Details

lldb version 10.0.99 (http://labmaster3.local/git/llvm-project.git revision 0e0dea82681a86a09ceed0afd321367a35bfa051) clang revision a75f8d98d7ac9e557b238a229a9a2647c71feed1 llvm revision a75f8d98d7ac9e557b238a229a9a2647c71feed1 ==83109==ERROR: Interceptors are not working. This may be because AddressSanitizer is loaded too late (e.g. via dlopen). Please launch the executable with: DYLD_INSERT_LIBRARIES=/Users/buildslave/jenkins/workspace/lldb-cmake-sanitized/host-compiler/lib/clang/10.0.0/lib/darwin/libclang_rt.asan_osx_dynamic.dylib "interceptors not installed" && 0 ******************** UNRESOLVED: lldb-api :: linux/mix-dwo-and-regular-objects/TestMixedDwarfBinary.py (1661 of 1799) ******************** TEST 'lldb-api :: linux/mix-dwo-and-regular-objects/TestMixedDwarfBinary.py' FAILED ******************** Unable to find 'RESULT: PASSED' in dotest output (exit code -6):

Hide Details

lldb version 10.0.99 (http://labmaster3.local/git/llvm-project.git revision 0e0dea82681a86a09ceed0afd321367a35bfa051) clang revision a75f8d98d7ac9e557b238a229a9a2647c71feed1 llvm revision a75f8d98d7ac9e557b238a229a9a2647c71feed1 ==83122==ERROR: Interceptors are not working. This may be because AddressSanitizer is loaded too late (e.g. via dlopen). Please launch the executable with: DYLD_INSERT_LIBRARIES=/Users/buildslave/jenkins/workspace/lldb-cmake-sanitized/host-compiler/lib/clang/10.0.0/lib/darwin/libclang_rt.asan_osx_dynamic.dylib "interceptors not installed" && 0 ******************** UNRESOLVED: lldb-api :: commands/expression/char/TestExprsChar.py (1662 of 1799) ******************** TEST 'lldb-api :: commands/expression/char/TestExprsChar.py' FAILED ******************** Unable to find 'RESULT: PASSED' in dotest output (exit code -6):

Hide Details

lldb version 10.0.99 (http://labmaster3.local/git/llvm-project.git revision 0e0dea82681a86a09ceed0afd321367a35bfa051) clang revision a75f8d98d7ac9e557b238a229a9a2647c71feed1 llvm revision a75f8d98d7ac9e557b238a229a9a2647c71feed1 ==83125==ERROR: Interceptors are not working. This may be because AddressSanitizer is loaded too late (e.g. via dlopen). Please launch the executable with: DYLD_INSERT_LIBRARIES=/Users/buildslave/jenkins/workspace/lldb-cmake-sanitized/host-compiler/lib/clang/10.0.0/lib/darwin/libclang_rt.asan_osx_dynamic.dylib "interceptors not installed" && 0 ******************** PASS: lldb-shell :: SymbolFile/DWARF/find-function-regex.cpp (1663 of 1799) PASS: lldb-unit :: UnwindAssembly/x86/./UnwindAssemblyx86Tests/Testx86AssemblyInspectionEngine.TestPopESI (1664 of 1799) PASS: lldb-unit :: Utility/./UtilityTests/StringListTest.AppendStringMove (1665 of 1799) UNRESOLVED: lldb-api :: lang/cpp/dynamic-value-same-basename/TestDynamicValueSameBase.py (1666 of 1799) ******************** TEST 'lldb-api :: lang/cpp/dynamic-value-same-basename/TestDynamicValueSameBase.py' FAILED ******************** Unable to find 'RESULT: PASSED' in dotest output (exit code -6):

Hide Details

lldb version 10.0.99 (http://labmaster3.local/git/llvm-project.git revision 0e0dea82681a86a09ceed0afd321367a35bfa051) clang revision a75f8d98d7ac9e557b238a229a9a2647c71feed1 llvm revision a75f8d98d7ac9e557b238a229a9a2647c71feed1 ==83127==ERROR: Interceptors are not working. This may be because AddressSanitizer is loaded too late (e.g. via dlopen). Please launch the executable with: DYLD_INSERT_LIBRARIES=/Users/buildslave/jenkins/workspace/lldb-cmake-sanitized/host-compiler/lib/clang/10.0.0/lib/darwin/libclang_rt.asan_osx_dynamic.dylib "interceptors not installed" && 0 ******************** UNRESOLVED: lldb-api :: functionalities/thread/step_until/TestStepUntil.py (1667 of 1799) ******************** TEST 'lldb-api :: functionalities/thread/step_until/TestStepUntil.py' FAILED ******************** Unable to find 'RESULT: PASSED' in dotest output (exit code -6):

Hide Details

lldb version 10.0.99 (http://labmaster3.local/git/llvm-project.git revision 0e0dea82681a86a09ceed0afd321367a35bfa051) clang revision a75f8d98d7ac9e557b238a229a9a2647c71feed1 llvm revision a75f8d98d7ac9e557b238a229a9a2647c71feed1 ==83144==ERROR: Interceptors are not working. This may be because AddressSanitizer is loaded too late (e.g. via dlopen). Please launch the executable with: DYLD_INSERT_LIBRARIES=/Users/buildslave/jenkins/workspace/lldb-cmake-sanitized/host-compiler/lib/clang/10.0.0/lib/darwin/libclang_rt.asan_osx_dynamic.dylib "interceptors not installed" && 0 ******************** PASS: lldb-unit :: Utility/./UtilityTests/FileSpecTest.CopyByAppendingPathComponent (1668 of 1799) UNRESOLVED: lldb-api :: commands/expression/completion-crash-incomplete-record/TestCompletionCrashIncompleteRecord.py (1669 of 1799) ******************** TEST 'lldb-api :: commands/expression/completion-crash-incomplete-record/TestCompletionCrashIncompleteRecord.py' FAILED ******************** Unable to find 'RESULT: PASSED' in dotest output (exit code -6):

Hide Details

lldb version 10.0.99 (http://labmaster3.local/git/llvm-project.git revision 0e0dea82681a86a09ceed0afd321367a35bfa051) clang revision a75f8d98d7ac9e557b238a229a9a2647c71feed1 llvm revision a75f8d98d7ac9e557b238a229a9a2647c71feed1 ==83147==ERROR: Interceptors are not working. This may be because AddressSanitizer is loaded too late (e.g. via dlopen). Please launch the executable with: DYLD_INSERT_LIBRARIES=/Users/buildslave/jenkins/workspace/lldb-cmake-sanitized/host-compiler/lib/clang/10.0.0/lib/darwin/libclang_rt.asan_osx_dynamic.dylib "interceptors not installed" && 0 ******************** UNRESOLVED: lldb-api :: functionalities/data-formatter/data-formatter-stl/libstdcpp/unique_ptr/TestDataFormatterStdUniquePtr.py (1670 of 1799) ******************** TEST 'lldb-api :: functionalities/data-formatter/data-formatter-stl/libstdcpp/unique_ptr/TestDataFormatterStdUniquePtr.py' FAILED ******************** Unable to find 'RESULT: PASSED' in dotest output (exit code -6):

Hide Details

lldb version 10.0.99 (http://labmaster3.local/git/llvm-project.git revision 0e0dea82681a86a09ceed0afd321367a35bfa051) clang revision a75f8d98d7ac9e557b238a229a9a2647c71feed1 llvm revision a75f8d98d7ac9e557b238a229a9a2647c71feed1 ==83167==ERROR: Interceptors are not working. This may be because AddressSanitizer is loaded too late (e.g. via dlopen). Please launch the executable with: DYLD_INSERT_LIBRARIES=/Users/buildslave/jenkins/workspace/lldb-cmake-sanitized/host-compiler/lib/clang/10.0.0/lib/darwin/libclang_rt.asan_osx_dynamic.dylib "interceptors not installed" && 0 ******************** UNRESOLVED: lldb-api :: commands/watchpoints/watchpoint_commands/TestWatchpointCommands.py (1671 of 1799) ******************** TEST 'lldb-api :: commands/watchpoints/watchpoint_commands/TestWatchpointCommands.py' FAILED ******************** Unable to find 'RESULT: PASSED' in dotest output (exit code -6):

Hide Details

lldb version 10.0.99 (http://labmaster3.local/git/llvm-project.git revision 0e0dea82681a86a09ceed0afd321367a35bfa051) clang revision a75f8d98d7ac9e557b238a229a9a2647c71feed1 llvm revision a75f8d98d7ac9e557b238a229a9a2647c71feed1 ==83164==ERROR: Interceptors are not working. This may be because AddressSanitizer is loaded too late (e.g. via dlopen). Please launch the executable with: DYLD_INSERT_LIBRARIES=/Users/buildslave/jenkins/workspace/lldb-cmake-sanitized/host-compiler/lib/clang/10.0.0/lib/darwin/libclang_rt.asan_osx_dynamic.dylib "interceptors not installed" && 0 ******************** PASS: lldb-unit :: UnwindAssembly/x86/./UnwindAssemblyx86Tests/Testx86AssemblyInspectionEngine.TestPushR13 (1672 of 1799) PASS: lldb-unit :: Utility/./UtilityTests/StringExtractorTest.GetHexU8_Exact_NoEof (1673 of 1799) UNSUPPORTED: lldb-shell :: Register/x86-gp-write.test (1674 of 1799) PASS: lldb-unit :: Utility/./UtilityTests/StringExtractorTest.GetHexBytesAvail_Partial (1675 of 1799) PASS: lldb-unit :: Utility/./UtilityTests/Flags.AnyClear (1676 of 1799) UNRESOLVED: lldb-api :: commands/expression/multiline-completion/TestMultilineCompletion.py (1677 of 1799) ******************** TEST 'lldb-api :: commands/expression/multiline-completion/TestMultilineCompletion.py' FAILED ******************** Unable to find 'RESULT: PASSED' in dotest output (exit code -6):

Hide Details

lldb version 10.0.99 (http://labmaster3.local/git/llvm-project.git revision 0e0dea82681a86a09ceed0afd321367a35bfa051) clang revision a75f8d98d7ac9e557b238a229a9a2647c71feed1 llvm revision a75f8d98d7ac9e557b238a229a9a2647c71feed1 ==83184==ERROR: Interceptors are not working. This may be because AddressSanitizer is loaded too late (e.g. via dlopen). Please launch the executable with: DYLD_INSERT_LIBRARIES=/Users/buildslave/jenkins/workspace/lldb-cmake-sanitized/host-compiler/lib/clang/10.0.0/lib/darwin/libclang_rt.asan_osx_dynamic.dylib "interceptors not installed" && 0 ******************** UNRESOLVED: lldb-api :: tools/lldb-server/TestGdbRemoteKill.py (1678 of 1799) ******************** TEST 'lldb-api :: tools/lldb-server/TestGdbRemoteKill.py' FAILED ******************** Unable to find 'RESULT: PASSED' in dotest output (exit code -6):

Hide Details

lldb version 10.0.99 (http://labmaster3.local/git/llvm-project.git revision 0e0dea82681a86a09ceed0afd321367a35bfa051) clang revision a75f8d98d7ac9e557b238a229a9a2647c71feed1 llvm revision a75f8d98d7ac9e557b238a229a9a2647c71feed1 ==83185==ERROR: Interceptors are not working. This may be because AddressSanitizer is loaded too late (e.g. via dlopen). Please launch the executable with: DYLD_INSERT_LIBRARIES=/Users/buildslave/jenkins/workspace/lldb-cmake-sanitized/host-compiler/lib/clang/10.0.0/lib/darwin/libclang_rt.asan_osx_dynamic.dylib "interceptors not installed" && 0 ******************** PASS: lldb-unit :: Utility/./UtilityTests/DataExtractorTest.GetMaxS64 (1679 of 1799) PASS: lldb-unit :: Utility/./UtilityTests/StreamTest.PutBytesAsRawHex8ToLittleEndian (1680 of 1799) UNRESOLVED: lldb-api :: lang/objc/objc-foundation-dictionary-empty/TestNSDictionary0.py (1681 of 1799) ******************** TEST 'lldb-api :: lang/objc/objc-foundation-dictionary-empty/TestNSDictionary0.py' FAILED ******************** Unable to find 'RESULT: PASSED' in dotest output (exit code -6):

Hide Details

lldb version 10.0.99 (http://labmaster3.local/git/llvm-project.git revision 0e0dea82681a86a09ceed0afd321367a35bfa051) clang revision a75f8d98d7ac9e557b238a229a9a2647c71feed1 llvm revision a75f8d98d7ac9e557b238a229a9a2647c71feed1 ==83201==ERROR: Interceptors are not working. This may be because AddressSanitizer is loaded too late (e.g. via dlopen). Please launch the executable with: DYLD_INSERT_LIBRARIES=/Users/buildslave/jenkins/workspace/lldb-cmake-sanitized/host-compiler/lib/clang/10.0.0/lib/darwin/libclang_rt.asan_osx_dynamic.dylib "interceptors not installed" && 0 ******************** PASS: lldb-unit :: Utility/./UtilityTests/ScalarTest.Promotion (1682 of 1799) PASS: lldb-unit :: SymbolFile/NativePDB/./SymbolFileNativePDBTests/PDBFPOProgramToDWARFExpressionTests.InvalidOpBinary (1683 of 1799) PASS: lldb-unit :: Utility/./UtilityTests/StringExtractorTest.GetHexBytes_FullString (1684 of 1799) PASS: lldb-unit :: ScriptInterpreter/Python/./ScriptInterpreterPythonTests/PythonDataObjectsTest.TestExtractingUInt64ThroughStructuredData (1685 of 1799) UNRESOLVED: lldb-api :: functionalities/data-formatter/data-formatter-objc/nsstring/TestDataFormatterNSString.py (1686 of 1799) ******************** TEST 'lldb-api :: functionalities/data-formatter/data-formatter-objc/nsstring/TestDataFormatterNSString.py' FAILED ******************** Unable to find 'RESULT: PASSED' in dotest output (exit code -6):

Hide Details

lldb version 10.0.99 (http://labmaster3.local/git/llvm-project.git revision 0e0dea82681a86a09ceed0afd321367a35bfa051) clang revision a75f8d98d7ac9e557b238a229a9a2647c71feed1 llvm revision a75f8d98d7ac9e557b238a229a9a2647c71feed1 ==83223==ERROR: Interceptors are not working. This may be because AddressSanitizer is loaded too late (e.g. via dlopen). Please launch the executable with: DYLD_INSERT_LIBRARIES=/Users/buildslave/jenkins/workspace/lldb-cmake-sanitized/host-compiler/lib/clang/10.0.0/lib/darwin/libclang_rt.asan_osx_dynamic.dylib "interceptors not installed" && 0 ******************** PASS: lldb-unit :: Expression/./ExpressionTests/CppModuleConfigurationTest.Xcode (1687 of 1799) PASS: lldb-shell :: Minidump/memory-region.yaml (1688 of 1799) PASS: lldb-shell :: SymbolFile/DWARF/debug-types-dwo-cross-reference.cpp (1689 of 1799) PASS: lldb-unit :: Utility/./UtilityTests/Predicate.WaitForValueNotEqualTo (1690 of 1799) UNRESOLVED: lldb-api :: functionalities/breakpoint/auto_continue/TestBreakpointAutoContinue.py (1691 of 1799) ******************** TEST 'lldb-api :: functionalities/breakpoint/auto_continue/TestBreakpointAutoContinue.py' FAILED ******************** Unable to find 'RESULT: PASSED' in dotest output (exit code -6):

Hide Details

lldb version 10.0.99 (http://labmaster3.local/git/llvm-project.git revision 0e0dea82681a86a09ceed0afd321367a35bfa051) clang revision a75f8d98d7ac9e557b238a229a9a2647c71feed1 llvm revision a75f8d98d7ac9e557b238a229a9a2647c71feed1 ==83242==ERROR: Interceptors are not working. This may be because AddressSanitizer is loaded too late (e.g. via dlopen). Please launch the executable with: DYLD_INSERT_LIBRARIES=/Users/buildslave/jenkins/workspace/lldb-cmake-sanitized/host-compiler/lib/clang/10.0.0/lib/darwin/libclang_rt.asan_osx_dynamic.dylib "interceptors not installed" && 0 ******************** PASS: lldb-unit :: Utility/./UtilityTests/BinaryStreamTest.PutSLEB128FourBytes (1692 of 1799) UNRESOLVED: lldb-api :: lang/objc/unicode-string/TestUnicodeString.py (1693 of 1799) ******************** TEST 'lldb-api :: lang/objc/unicode-string/TestUnicodeString.py' FAILED ******************** Unable to find 'RESULT: PASSED' in dotest output (exit code -6):

Hide Details

lldb version 10.0.99 (http://labmaster3.local/git/llvm-project.git revision 0e0dea82681a86a09ceed0afd321367a35bfa051) clang revision a75f8d98d7ac9e557b238a229a9a2647c71feed1 llvm revision a75f8d98d7ac9e557b238a229a9a2647c71feed1 ==83244==ERROR: Interceptors are not working. This may be because AddressSanitizer is loaded too late (e.g. via dlopen). Please launch the executable with: DYLD_INSERT_LIBRARIES=/Users/buildslave/jenkins/workspace/lldb-cmake-sanitized/host-compiler/lib/clang/10.0.0/lib/darwin/libclang_rt.asan_osx_dynamic.dylib "interceptors not installed" && 0 ******************** PASS: lldb-unit :: Utility/./UtilityTests/OptionsWithRawTest.TerminatedQuote (1694 of 1799) PASS: lldb-unit :: SymbolFile/DWARF/./SymbolFileDWARFTests/SymbolFileDWARFTests.TestAbbrevOutOfOrder (1695 of 1799) PASS: lldb-unit :: Utility/./UtilityTests/FileSpecTest.GetNormalizedPath (1696 of 1799) PASS: lldb-unit :: Utility/./UtilityTests/StringExtractorTest.GetHexBytes (1697 of 1799) UNRESOLVED: lldb-api :: macosx/find-app-in-bundle/TestFindAppInBundle.py (1698 of 1799) ******************** TEST 'lldb-api :: macosx/find-app-in-bundle/TestFindAppInBundle.py' FAILED ******************** Unable to find 'RESULT: PASSED' in dotest output (exit code -6):

Hide Details

lldb version 10.0.99 (http://labmaster3.local/git/llvm-project.git revision 0e0dea82681a86a09ceed0afd321367a35bfa051) clang revision a75f8d98d7ac9e557b238a229a9a2647c71feed1 llvm revision a75f8d98d7ac9e557b238a229a9a2647c71feed1 ==83273==ERROR: Interceptors are not working. This may be because AddressSanitizer is loaded too late (e.g. via dlopen). Please launch the executable with: DYLD_INSERT_LIBRARIES=/Users/buildslave/jenkins/workspace/lldb-cmake-sanitized/host-compiler/lib/clang/10.0.0/lib/darwin/libclang_rt.asan_osx_dynamic.dylib "interceptors not installed" && 0 ******************** PASS: lldb-shell :: ObjectFile/MachO/lc_build_version.yaml (1699 of 1799) PASS: lldb-unit :: Utility/./UtilityTests/UriParserTest.Minimal (1700 of 1799) PASS: lldb-unit :: SymbolFile/NativePDB/./SymbolFileNativePDBTests/PDBFPOProgramToDWARFExpressionTests.SingleAssignmentRegisterRef (1701 of 1799) UNRESOLVED: lldb-api :: functionalities/thread/concurrent_events/TestConcurrentWatchBreakDelay.py (1702 of 1799) ******************** TEST 'lldb-api :: functionalities/thread/concurrent_events/TestConcurrentWatchBreakDelay.py' FAILED ******************** Unable to find 'RESULT: PASSED' in dotest output (exit code -6):

Hide Details

lldb version 10.0.99 (http://labmaster3.local/git/llvm-project.git revision 0e0dea82681a86a09ceed0afd321367a35bfa051) clang revision a75f8d98d7ac9e557b238a229a9a2647c71feed1 llvm revision a75f8d98d7ac9e557b238a229a9a2647c71feed1 ==83290==ERROR: Interceptors are not working. This may be because AddressSanitizer is loaded too late (e.g. via dlopen). Please launch the executable with: DYLD_INSERT_LIBRARIES=/Users/buildslave/jenkins/workspace/lldb-cmake-sanitized/host-compiler/lib/clang/10.0.0/lib/darwin/libclang_rt.asan_osx_dynamic.dylib "interceptors not installed" && 0 ******************** UNRESOLVED: lldb-api :: functionalities/unwind/ehframe/TestEhFrameUnwind.py (1703 of 1799) ******************** TEST 'lldb-api :: functionalities/unwind/ehframe/TestEhFrameUnwind.py' FAILED ******************** Unable to find 'RESULT: PASSED' in dotest output (exit code -6):

Hide Details

lldb version 10.0.99 (http://labmaster3.local/git/llvm-project.git revision 0e0dea82681a86a09ceed0afd321367a35bfa051) clang revision a75f8d98d7ac9e557b238a229a9a2647c71feed1 llvm revision a75f8d98d7ac9e557b238a229a9a2647c71feed1 ==83297==ERROR: Interceptors are not working. This may be because AddressSanitizer is loaded too late (e.g. via dlopen). Please launch the executable with: DYLD_INSERT_LIBRARIES=/Users/buildslave/jenkins/workspace/lldb-cmake-sanitized/host-compiler/lib/clang/10.0.0/lib/darwin/libclang_rt.asan_osx_dynamic.dylib "interceptors not installed" && 0 ******************** PASS: lldb-unit :: UnwindAssembly/x86/./UnwindAssemblyx86Tests/Testx86AssemblyInspectionEngine.TestPopR14 (1704 of 1799) PASS: lldb-shell :: BuildScript/compiler-full-path.test (1705 of 1799) PASS: lldb-unit :: ScriptInterpreter/Python/./ScriptInterpreterPythonTests/PythonDataObjectsTest.TestScript (1706 of 1799) PASS: lldb-unit :: Utility/./UtilityTests/GeneratorTest.GetOrCreate (1707 of 1799) UNRESOLVED: lldb-api :: functionalities/data-formatter/data-formatter-objc/TestDataFormatterObjCNSBundle.py (1708 of 1799) ******************** TEST 'lldb-api :: functionalities/data-formatter/data-formatter-objc/TestDataFormatterObjCNSBundle.py' FAILED ******************** Unable to find 'RESULT: PASSED' in dotest output (exit code -6):

Hide Details

lldb version 10.0.99 (http://labmaster3.local/git/llvm-project.git revision 0e0dea82681a86a09ceed0afd321367a35bfa051) clang revision a75f8d98d7ac9e557b238a229a9a2647c71feed1 llvm revision a75f8d98d7ac9e557b238a229a9a2647c71feed1 ==83312==ERROR: Interceptors are not working. This may be because AddressSanitizer is loaded too late (e.g. via dlopen). Please launch the executable with: DYLD_INSERT_LIBRARIES=/Users/buildslave/jenkins/workspace/lldb-cmake-sanitized/host-compiler/lib/clang/10.0.0/lib/darwin/libclang_rt.asan_osx_dynamic.dylib "interceptors not installed" && 0 ******************** PASS: lldb-shell :: SymbolFile/NativePDB/ast-methods.cpp (1709 of 1799) UNRESOLVED: lldb-api :: lang/objc/objc-ivar-stripped/TestObjCIvarStripped.py (1710 of 1799) ******************** TEST 'lldb-api :: lang/objc/objc-ivar-stripped/TestObjCIvarStripped.py' FAILED ******************** Unable to find 'RESULT: PASSED' in dotest output (exit code -6):

Hide Details

lldb version 10.0.99 (http://labmaster3.local/git/llvm-project.git revision 0e0dea82681a86a09ceed0afd321367a35bfa051) clang revision a75f8d98d7ac9e557b238a229a9a2647c71feed1 llvm revision a75f8d98d7ac9e557b238a229a9a2647c71feed1 ==83313==ERROR: Interceptors are not working. This may be because AddressSanitizer is loaded too late (e.g. via dlopen). Please launch the executable with: DYLD_INSERT_LIBRARIES=/Users/buildslave/jenkins/workspace/lldb-cmake-sanitized/host-compiler/lib/clang/10.0.0/lib/darwin/libclang_rt.asan_osx_dynamic.dylib "interceptors not installed" && 0 ******************** UNRESOLVED: lldb-api :: functionalities/tsan/multiple/TestTsanMultiple.py (1711 of 1799) ******************** TEST 'lldb-api :: functionalities/tsan/multiple/TestTsanMultiple.py' FAILED ******************** Unable to find 'RESULT: PASSED' in dotest output (exit code -6):

Hide Details

lldb version 10.0.99 (http://labmaster3.local/git/llvm-project.git revision 0e0dea82681a86a09ceed0afd321367a35bfa051) clang revision a75f8d98d7ac9e557b238a229a9a2647c71feed1 llvm revision a75f8d98d7ac9e557b238a229a9a2647c71feed1 ==83318==ERROR: Interceptors are not working. This may be because AddressSanitizer is loaded too late (e.g. via dlopen). Please launch the executable with: DYLD_INSERT_LIBRARIES=/Users/buildslave/jenkins/workspace/lldb-cmake-sanitized/host-compiler/lib/clang/10.0.0/lib/darwin/libclang_rt.asan_osx_dynamic.dylib "interceptors not installed" && 0 ******************** UNRESOLVED: lldb-api :: tools/lldb-server/libraries-svr4/TestGdbRemoteLibrariesSvr4Support.py (1712 of 1799) ******************** TEST 'lldb-api :: tools/lldb-server/libraries-svr4/TestGdbRemoteLibrariesSvr4Support.py' FAILED ******************** Unable to find 'RESULT: PASSED' in dotest output (exit code -6):

Hide Details

lldb version 10.0.99 (http://labmaster3.local/git/llvm-project.git revision 0e0dea82681a86a09ceed0afd321367a35bfa051) clang revision a75f8d98d7ac9e557b238a229a9a2647c71feed1 llvm revision a75f8d98d7ac9e557b238a229a9a2647c71feed1 ==83319==ERROR: Interceptors are not working. This may be because AddressSanitizer is loaded too late (e.g. via dlopen). Please launch the executable with: DYLD_INSERT_LIBRARIES=/Users/buildslave/jenkins/workspace/lldb-cmake-sanitized/host-compiler/lib/clang/10.0.0/lib/darwin/libclang_rt.asan_osx_dynamic.dylib "interceptors not installed" && 0 ******************** PASS: lldb-unit :: Expression/./ExpressionTests/CppModuleConfigurationTest.AmbiguousCLib (1713 of 1799) PASS: lldb-unit :: Target/./TargetTests/ModuleCacheTest.GetAndPutStrangeHostname (1714 of 1799) PASS: lldb-unit :: Utility/./UtilityTests/UUIDTest.RelationalOperators (1715 of 1799) UNRESOLVED: lldb-api :: lang/cpp/stl/TestSTL.py (1716 of 1799) ******************** TEST 'lldb-api :: lang/cpp/stl/TestSTL.py' FAILED ******************** Unable to find 'RESULT: PASSED' in dotest output (exit code -6):

Hide Details

lldb version 10.0.99 (http://labmaster3.local/git/llvm-project.git revision 0e0dea82681a86a09ceed0afd321367a35bfa051) clang revision a75f8d98d7ac9e557b238a229a9a2647c71feed1 llvm revision a75f8d98d7ac9e557b238a229a9a2647c71feed1 ==83341==ERROR: Interceptors are not working. This may be because AddressSanitizer is loaded too late (e.g. via dlopen). Please launch the executable with: DYLD_INSERT_LIBRARIES=/Users/buildslave/jenkins/workspace/lldb-cmake-sanitized/host-compiler/lib/clang/10.0.0/lib/darwin/libclang_rt.asan_osx_dynamic.dylib "interceptors not installed" && 0 ******************** PASS: lldb-unit :: UnwindAssembly/x86/./UnwindAssemblyx86Tests/Testx86AssemblyInspectionEngine.TestSimple64bitFrameFunction (1717 of 1799) UNRESOLVED: lldb-api :: commands/expression/import-std-module/sysroot/TestStdModuleSysroot.py (1718 of 1799) ******************** TEST 'lldb-api :: commands/expression/import-std-module/sysroot/TestStdModuleSysroot.py' FAILED ******************** Unable to find 'RESULT: PASSED' in dotest output (exit code -6):

Hide Details

lldb version 10.0.99 (http://labmaster3.local/git/llvm-project.git revision 0e0dea82681a86a09ceed0afd321367a35bfa051) clang revision a75f8d98d7ac9e557b238a229a9a2647c71feed1 llvm revision a75f8d98d7ac9e557b238a229a9a2647c71feed1 ==83374==ERROR: Interceptors are not working. This may be because AddressSanitizer is loaded too late (e.g. via dlopen). Please launch the executable with: DYLD_INSERT_LIBRARIES=/Users/buildslave/jenkins/workspace/lldb-cmake-sanitized/host-compiler/lib/clang/10.0.0/lib/darwin/libclang_rt.asan_osx_dynamic.dylib "interceptors not installed" && 0 ******************** PASS: lldb-unit :: Utility/./UtilityTests/ArgsTest.ReplaceArgumentAtIndexLonger (1719 of 1799) UNRESOLVED: lldb-api :: python_api/formatters/TestFormattersSBAPI.py (1720 of 1799) ******************** TEST 'lldb-api :: python_api/formatters/TestFormattersSBAPI.py' FAILED ******************** Unable to find 'RESULT: PASSED' in dotest output (exit code -6):

Hide Details

lldb version 10.0.99 (http://labmaster3.local/git/llvm-project.git revision 0e0dea82681a86a09ceed0afd321367a35bfa051) clang revision a75f8d98d7ac9e557b238a229a9a2647c71feed1 llvm revision a75f8d98d7ac9e557b238a229a9a2647c71feed1 ==83375==ERROR: Interceptors are not working. This may be because AddressSanitizer is loaded too late (e.g. via dlopen). Please launch the executable with: DYLD_INSERT_LIBRARIES=/Users/buildslave/jenkins/workspace/lldb-cmake-sanitized/host-compiler/lib/clang/10.0.0/lib/darwin/libclang_rt.asan_osx_dynamic.dylib "interceptors not installed" && 0 ******************** PASS: lldb-unit :: Utility/./UtilityTests/StringListTest.LongestCommonPrefixNoPrefix (1721 of 1799) PASS: lldb-shell :: ExecControl/StopHook/stop-hook.test (1722 of 1799) PASS: lldb-unit :: Utility/./UtilityTests/TimeoutTest.Format (1723 of 1799) UNRESOLVED: lldb-api :: commands/frame/diagnose/virtual-method-call/TestDiagnoseDereferenceVirtualMethodCall.py (1724 of 1799) ******************** TEST 'lldb-api :: commands/frame/diagnose/virtual-method-call/TestDiagnoseDereferenceVirtualMethodCall.py' FAILED ******************** Unable to find 'RESULT: PASSED' in dotest output (exit code -6):

Hide Details

lldb version 10.0.99 (http://labmaster3.local/git/llvm-project.git revision 0e0dea82681a86a09ceed0afd321367a35bfa051) clang revision a75f8d98d7ac9e557b238a229a9a2647c71feed1 llvm revision a75f8d98d7ac9e557b238a229a9a2647c71feed1 ==83390==ERROR: Interceptors are not working. This may be because AddressSanitizer is loaded too late (e.g. via dlopen). Please launch the executable with: DYLD_INSERT_LIBRARIES=/Users/buildslave/jenkins/workspace/lldb-cmake-sanitized/host-compiler/lib/clang/10.0.0/lib/darwin/libclang_rt.asan_osx_dynamic.dylib "interceptors not installed" && 0 ******************** PASS: lldb-unit :: Process/minidump/./LLDBMinidumpTests/MinidumpParserTest.GetMemoryRegionInfoFromMemory64List (1725 of 1799) PASS: lldb-unit :: Utility/./UtilityTests/StreamTest.PutStringAsRawHex8 (1726 of 1799) UNRESOLVED: lldb-api :: functionalities/breakpoint/source_regexp/TestSourceRegexBreakpoints.py (1727 of 1799) ******************** TEST 'lldb-api :: functionalities/breakpoint/source_regexp/TestSourceRegexBreakpoints.py' FAILED ******************** Unable to find 'RESULT: PASSED' in dotest output (exit code -6):

Hide Details

lldb version 10.0.99 (http://labmaster3.local/git/llvm-project.git revision 0e0dea82681a86a09ceed0afd321367a35bfa051) clang revision a75f8d98d7ac9e557b238a229a9a2647c71feed1 llvm revision a75f8d98d7ac9e557b238a229a9a2647c71feed1 ==83405==ERROR: Interceptors are not working. This may be because AddressSanitizer is loaded too late (e.g. via dlopen). Please launch the executable with: DYLD_INSERT_LIBRARIES=/Users/buildslave/jenkins/workspace/lldb-cmake-sanitized/host-compiler/lib/clang/10.0.0/lib/darwin/libclang_rt.asan_osx_dynamic.dylib "interceptors not installed" && 0 ******************** UNRESOLVED: lldb-api :: commands/register/register/intel_xtended_registers/mpx_offset_intersection/TestMPXOffsetIntersection.py (1728 of 1799) ******************** TEST 'lldb-api :: commands/register/register/intel_xtended_registers/mpx_offset_intersection/TestMPXOffsetIntersection.py' FAILED ******************** Unable to find 'RESULT: PASSED' in dotest output (exit code -6):

Hide Details

lldb version 10.0.99 (http://labmaster3.local/git/llvm-project.git revision 0e0dea82681a86a09ceed0afd321367a35bfa051) clang revision a75f8d98d7ac9e557b238a229a9a2647c71feed1 llvm revision a75f8d98d7ac9e557b238a229a9a2647c71feed1 ==83414==ERROR: Interceptors are not working. This may be because AddressSanitizer is loaded too late (e.g. via dlopen). Please launch the executable with: DYLD_INSERT_LIBRARIES=/Users/buildslave/jenkins/workspace/lldb-cmake-sanitized/host-compiler/lib/clang/10.0.0/lib/darwin/libclang_rt.asan_osx_dynamic.dylib "interceptors not installed" && 0 ******************** PASS: lldb-shell :: Breakpoint/single-file-split-dwarf.test (1729 of 1799) UNRESOLVED: lldb-api :: lang/c/conflicting-symbol/TestConflictingSymbol.py (1730 of 1799) ******************** TEST 'lldb-api :: lang/c/conflicting-symbol/TestConflictingSymbol.py' FAILED ******************** Unable to find 'RESULT: PASSED' in dotest output (exit code -6):

Hide Details

lldb version 10.0.99 (http://labmaster3.local/git/llvm-project.git revision 0e0dea82681a86a09ceed0afd321367a35bfa051) clang revision a75f8d98d7ac9e557b238a229a9a2647c71feed1 llvm revision a75f8d98d7ac9e557b238a229a9a2647c71feed1 ==83415==ERROR: Interceptors are not working. This may be because AddressSanitizer is loaded too late (e.g. via dlopen). Please launch the executable with: DYLD_INSERT_LIBRARIES=/Users/buildslave/jenkins/workspace/lldb-cmake-sanitized/host-compiler/lib/clang/10.0.0/lib/darwin/libclang_rt.asan_osx_dynamic.dylib "interceptors not installed" && 0 ******************** PASS: lldb-unit :: Utility/./UtilityTests/ScalarTest.ExtractBitfield (1731 of 1799) PASS: lldb-unit :: Utility/./UtilityTests/CompletionRequest.TryCompleteCurrentArgBad (1732 of 1799) UNRESOLVED: lldb-api :: commands/expression/completion-in-lambda-and-unnnamed-class/TestCompletionInLambdaAndUnnamedClass.py (1733 of 1799) ******************** TEST 'lldb-api :: commands/expression/completion-in-lambda-and-unnnamed-class/TestCompletionInLambdaAndUnnamedClass.py' FAILED ******************** Unable to find 'RESULT: PASSED' in dotest output (exit code -6):

Hide Details

lldb version 10.0.99 (http://labmaster3.local/git/llvm-project.git revision 0e0dea82681a86a09ceed0afd321367a35bfa051) clang revision a75f8d98d7ac9e557b238a229a9a2647c71feed1 llvm revision a75f8d98d7ac9e557b238a229a9a2647c71feed1 ==83430==ERROR: Interceptors are not working. This may be because AddressSanitizer is loaded too late (e.g. via dlopen). Please launch the executable with: DYLD_INSERT_LIBRARIES=/Users/buildslave/jenkins/workspace/lldb-cmake-sanitized/host-compiler/lib/clang/10.0.0/lib/darwin/libclang_rt.asan_osx_dynamic.dylib "interceptors not installed" && 0 ******************** PASS: lldb-unit :: Utility/./UtilityTests/AnsiTerminal.Empty (1734 of 1799) PASS: lldb-unit :: Utility/./UtilityTests/StringListTest.GetMaxStringLengthDecreasingSize (1735 of 1799) UNRESOLVED: lldb-api :: lang/objc/objc-checker/TestObjCCheckers.py (1736 of 1799) ******************** TEST 'lldb-api :: lang/objc/objc-checker/TestObjCCheckers.py' FAILED ******************** Unable to find 'RESULT: PASSED' in dotest output (exit code -6):

Hide Details

lldb version 10.0.99 (http://labmaster3.local/git/llvm-project.git revision 0e0dea82681a86a09ceed0afd321367a35bfa051) clang revision a75f8d98d7ac9e557b238a229a9a2647c71feed1 llvm revision a75f8d98d7ac9e557b238a229a9a2647c71feed1 ==83458==ERROR: Interceptors are not working. This may be because AddressSanitizer is loaded too late (e.g. via dlopen). Please launch the executable with: DYLD_INSERT_LIBRARIES=/Users/buildslave/jenkins/workspace/lldb-cmake-sanitized/host-compiler/lib/clang/10.0.0/lib/darwin/libclang_rt.asan_osx_dynamic.dylib "interceptors not installed" && 0 ******************** PASS: lldb-unit :: Process/gdb-remote/./ProcessGdbRemoteTests/GDBRemoteClientBaseTest.SendContinueDelegateInterface (1737 of 1799) UNRESOLVED: lldb-api :: python_api/thread/TestThreadAPI.py (1738 of 1799) ******************** TEST 'lldb-api :: python_api/thread/TestThreadAPI.py' FAILED ******************** Unable to find 'RESULT: PASSED' in dotest output (exit code -6):

Hide Details

lldb version 10.0.99 (http://labmaster3.local/git/llvm-project.git revision 0e0dea82681a86a09ceed0afd321367a35bfa051) clang revision a75f8d98d7ac9e557b238a229a9a2647c71feed1 llvm revision a75f8d98d7ac9e557b238a229a9a2647c71feed1 ==83432==ERROR: Interceptors are not working. This may be because AddressSanitizer is loaded too late (e.g. via dlopen). Please launch the executable with: DYLD_INSERT_LIBRARIES=/Users/buildslave/jenkins/workspace/lldb-cmake-sanitized/host-compiler/lib/clang/10.0.0/lib/darwin/libclang_rt.asan_osx_dynamic.dylib "interceptors not installed" && 0 ******************** PASS: lldb-unit :: Host/./HostTests/MainLoopTest.TerminatesImmediately (1739 of 1799) UNRESOLVED: lldb-api :: lang/cpp/lambdas/TestLambdas.py (1740 of 1799) ******************** TEST 'lldb-api :: lang/cpp/lambdas/TestLambdas.py' FAILED ******************** Unable to find 'RESULT: PASSED' in dotest output (exit code -6):

Hide Details

lldb version 10.0.99 (http://labmaster3.local/git/llvm-project.git revision 0e0dea82681a86a09ceed0afd321367a35bfa051) clang revision a75f8d98d7ac9e557b238a229a9a2647c71feed1 llvm revision a75f8d98d7ac9e557b238a229a9a2647c71feed1 ==83449==ERROR: Interceptors are not working. This may be because AddressSanitizer is loaded too late (e.g. via dlopen). Please launch the executable with: DYLD_INSERT_LIBRARIES=/Users/buildslave/jenkins/workspace/lldb-cmake-sanitized/host-compiler/lib/clang/10.0.0/lib/darwin/libclang_rt.asan_osx_dynamic.dylib "interceptors not installed" && 0 ******************** UNRESOLVED: lldb-api :: functionalities/type_lookup/TestTypeLookup.py (1741 of 1799) ******************** TEST 'lldb-api :: functionalities/type_lookup/TestTypeLookup.py' FAILED ******************** Unable to find 'RESULT: PASSED' in dotest output (exit code -6):

Hide Details

lldb version 10.0.99 (http://labmaster3.local/git/llvm-project.git revision 0e0dea82681a86a09ceed0afd321367a35bfa051) clang revision a75f8d98d7ac9e557b238a229a9a2647c71feed1 llvm revision a75f8d98d7ac9e557b238a229a9a2647c71feed1 ==83471==ERROR: Interceptors are not working. This may be because AddressSanitizer is loaded too late (e.g. via dlopen). Please launch the executable with: DYLD_INSERT_LIBRARIES=/Users/buildslave/jenkins/workspace/lldb-cmake-sanitized/host-compiler/lib/clang/10.0.0/lib/darwin/libclang_rt.asan_osx_dynamic.dylib "interceptors not installed" && 0 ******************** PASS: lldb-unit :: ScriptInterpreter/Python/./ScriptInterpreterPythonTests/PythonDataObjectsTest.TestPythonTupleSize (1742 of 1799) UNRESOLVED: lldb-api :: lang/cpp/dynamic-value/TestDynamicValue.py (1743 of 1799) ******************** TEST 'lldb-api :: lang/cpp/dynamic-value/TestDynamicValue.py' FAILED ******************** Unable to find 'RESULT: PASSED' in dotest output (exit code -6):

Hide Details

lldb version 10.0.99 (http://labmaster3.local/git/llvm-project.git revision 0e0dea82681a86a09ceed0afd321367a35bfa051) clang revision a75f8d98d7ac9e557b238a229a9a2647c71feed1 llvm revision a75f8d98d7ac9e557b238a229a9a2647c71feed1 ==83480==ERROR: Interceptors are not working. This may be because AddressSanitizer is loaded too late (e.g. via dlopen). Please launch the executable with: DYLD_INSERT_LIBRARIES=/Users/buildslave/jenkins/workspace/lldb-cmake-sanitized/host-compiler/lib/clang/10.0.0/lib/darwin/libclang_rt.asan_osx_dynamic.dylib "interceptors not installed" && 0 ******************** PASS: lldb-unit :: Process/minidump/./LLDBMinidumpTests/MinidumpParserTest.GetPidWow64 (1744 of 1799) PASS: lldb-unit :: Language/Highlighting/./HighlighterTests/HighlighterTest.Colons (1745 of 1799) UNRESOLVED: lldb-api :: lang/objc/modules-incomplete/TestIncompleteModules.py (1746 of 1799) ******************** TEST 'lldb-api :: lang/objc/modules-incomplete/TestIncompleteModules.py' FAILED ******************** Unable to find 'RESULT: PASSED' in dotest output (exit code -6):

Hide Details

lldb version 10.0.99 (http://labmaster3.local/git/llvm-project.git revision 0e0dea82681a86a09ceed0afd321367a35bfa051) clang revision a75f8d98d7ac9e557b238a229a9a2647c71feed1 llvm revision a75f8d98d7ac9e557b238a229a9a2647c71feed1 ==83503==ERROR: Interceptors are not working. This may be because AddressSanitizer is loaded too late (e.g. via dlopen). Please launch the executable with: DYLD_INSERT_LIBRARIES=/Users/buildslave/jenkins/workspace/lldb-cmake-sanitized/host-compiler/lib/clang/10.0.0/lib/darwin/libclang_rt.asan_osx_dynamic.dylib "interceptors not installed" && 0 ******************** UNRESOLVED: lldb-api :: lang/cpp/enum_types/TestCPP11EnumTypes.py (1747 of 1799) ******************** TEST 'lldb-api :: lang/cpp/enum_types/TestCPP11EnumTypes.py' FAILED ******************** Unable to find 'RESULT: PASSED' in dotest output (exit code -6):

Hide Details

lldb version 10.0.99 (http://labmaster3.local/git/llvm-project.git revision 0e0dea82681a86a09ceed0afd321367a35bfa051) clang revision a75f8d98d7ac9e557b238a229a9a2647c71feed1 llvm revision a75f8d98d7ac9e557b238a229a9a2647c71feed1 ==83513==ERROR: Interceptors are not working. This may be because AddressSanitizer is loaded too late (e.g. via dlopen). Please launch the executable with: DYLD_INSERT_LIBRARIES=/Users/buildslave/jenkins/workspace/lldb-cmake-sanitized/host-compiler/lib/clang/10.0.0/lib/darwin/libclang_rt.asan_osx_dynamic.dylib "interceptors not installed" && 0 ******************** UNRESOLVED: lldb-api :: python_api/value/TestValueAPI.py (1748 of 1799) ******************** TEST 'lldb-api :: python_api/value/TestValueAPI.py' FAILED ******************** Unable to find 'RESULT: PASSED' in dotest output (exit code -6):

Hide Details

lldb version 10.0.99 (http://labmaster3.local/git/llvm-project.git revision 0e0dea82681a86a09ceed0afd321367a35bfa051) clang revision a75f8d98d7ac9e557b238a229a9a2647c71feed1 llvm revision a75f8d98d7ac9e557b238a229a9a2647c71feed1 ==83521==ERROR: Interceptors are not working. This may be because AddressSanitizer is loaded too late (e.g. via dlopen). Please launch the executable with: DYLD_INSERT_LIBRARIES=/Users/buildslave/jenkins/workspace/lldb-cmake-sanitized/host-compiler/lib/clang/10.0.0/lib/darwin/libclang_rt.asan_osx_dynamic.dylib "interceptors not installed" && 0 ******************** PASS: lldb-unit :: Utility/./UtilityTests/BinaryStreamTest.PutULEB128MaxValue (1749 of 1799) UNRESOLVED: lldb-api :: functionalities/data-formatter/data-formatter-objc/TestDataFormatterObjCNSURL.py (1750 of 1799) ******************** TEST 'lldb-api :: functionalities/data-formatter/data-formatter-objc/TestDataFormatterObjCNSURL.py' FAILED ******************** Unable to find 'RESULT: PASSED' in dotest output (exit code -6):

Hide Details

lldb version 10.0.99 (http://labmaster3.local/git/llvm-project.git revision 0e0dea82681a86a09ceed0afd321367a35bfa051) clang revision a75f8d98d7ac9e557b238a229a9a2647c71feed1 llvm revision a75f8d98d7ac9e557b238a229a9a2647c71feed1 ==83522==ERROR: Interceptors are not working. This may be because AddressSanitizer is loaded too late (e.g. via dlopen). Please launch the executable with: DYLD_INSERT_LIBRARIES=/Users/buildslave/jenkins/workspace/lldb-cmake-sanitized/host-compiler/lib/clang/10.0.0/lib/darwin/libclang_rt.asan_osx_dynamic.dylib "interceptors not installed" && 0 ******************** PASS: lldb-unit :: Utility/./UtilityTests/StreamTest.PutHex16ByteOrderLittle (1751 of 1799) UNRESOLVED: lldb-api :: commands/expression/import-std-module/list-dbg-info-content/TestDbgInfoContentList.py (1752 of 1799) ******************** TEST 'lldb-api :: commands/expression/import-std-module/list-dbg-info-content/TestDbgInfoContentList.py' FAILED ******************** Unable to find 'RESULT: PASSED' in dotest output (exit code -6):

Hide Details

lldb version 10.0.99 (http://labmaster3.local/git/llvm-project.git revision 0e0dea82681a86a09ceed0afd321367a35bfa051) clang revision a75f8d98d7ac9e557b238a229a9a2647c71feed1 llvm revision a75f8d98d7ac9e557b238a229a9a2647c71feed1 ==83527==ERROR: Interceptors are not working. This may be because AddressSanitizer is loaded too late (e.g. via dlopen). Please launch the executable with: DYLD_INSERT_LIBRARIES=/Users/buildslave/jenkins/workspace/lldb-cmake-sanitized/host-compiler/lib/clang/10.0.0/lib/darwin/libclang_rt.asan_osx_dynamic.dylib "interceptors not installed" && 0 ******************** UNRESOLVED: lldb-api :: api/check_public_api_headers/TestPublicAPIHeaders.py (1753 of 1799) ******************** TEST 'lldb-api :: api/check_public_api_headers/TestPublicAPIHeaders.py' FAILED ******************** Unable to find 'RESULT: PASSED' in dotest output (exit code -6):

Hide Details

lldb version 10.0.99 (http://labmaster3.local/git/llvm-project.git revision 0e0dea82681a86a09ceed0afd321367a35bfa051) clang revision a75f8d98d7ac9e557b238a229a9a2647c71feed1 llvm revision a75f8d98d7ac9e557b238a229a9a2647c71feed1 ==83528==ERROR: Interceptors are not working. This may be because AddressSanitizer is loaded too late (e.g. via dlopen). Please launch the executable with: DYLD_INSERT_LIBRARIES=/Users/buildslave/jenkins/workspace/lldb-cmake-sanitized/host-compiler/lib/clang/10.0.0/lib/darwin/libclang_rt.asan_osx_dynamic.dylib "interceptors not installed" && 0 ******************** UNRESOLVED: lldb-api :: commands/expression/import-std-module/queue/TestQueue.py (1754 of 1799) ******************** TEST 'lldb-api :: commands/expression/import-std-module/queue/TestQueue.py' FAILED ******************** Unable to find 'RESULT: PASSED' in dotest output (exit code -6):

Hide Details

lldb version 10.0.99 (http://labmaster3.local/git/llvm-project.git revision 0e0dea82681a86a09ceed0afd321367a35bfa051) clang revision a75f8d98d7ac9e557b238a229a9a2647c71feed1 llvm revision a75f8d98d7ac9e557b238a229a9a2647c71feed1 ==83535==ERROR: Interceptors are not working. This may be because AddressSanitizer is loaded too late (e.g. via dlopen). Please launch the executable with: DYLD_INSERT_LIBRARIES=/Users/buildslave/jenkins/workspace/lldb-cmake-sanitized/host-compiler/lib/clang/10.0.0/lib/darwin/libclang_rt.asan_osx_dynamic.dylib "interceptors not installed" && 0 ******************** UNSUPPORTED: lldb-shell :: Register/aarch64-gp-read.test (1755 of 1799) PASS: lldb-unit :: Utility/./UtilityTests/StringExtractorTest.GetHexU8_Underflow (1756 of 1799) UNRESOLVED: lldb-api :: functionalities/data-formatter/var-in-aggregate-misuse/TestVarInAggregateMisuse.py (1757 of 1799) ******************** TEST 'lldb-api :: functionalities/data-formatter/var-in-aggregate-misuse/TestVarInAggregateMisuse.py' FAILED ******************** Unable to find 'RESULT: PASSED' in dotest output (exit code -6):

Hide Details

lldb version 10.0.99 (http://labmaster3.local/git/llvm-project.git revision 0e0dea82681a86a09ceed0afd321367a35bfa051) clang revision a75f8d98d7ac9e557b238a229a9a2647c71feed1 llvm revision a75f8d98d7ac9e557b238a229a9a2647c71feed1 ==83539==ERROR: Interceptors are not working. This may be because AddressSanitizer is loaded too late (e.g. via dlopen). Please launch the executable with: DYLD_INSERT_LIBRARIES=/Users/buildslave/jenkins/workspace/lldb-cmake-sanitized/host-compiler/lib/clang/10.0.0/lib/darwin/libclang_rt.asan_osx_dynamic.dylib "interceptors not installed" && 0 ******************** PASS: lldb-unit :: Core/./LLDBCoreTests/MangledTest.ResultForBlockInvocation (1758 of 1799) PASS: lldb-shell :: Settings/TestDisassemblyFormat.test (1759 of 1799) UNSUPPORTED: lldb-shell :: SymbolFile/NativePDB/local-variables.cpp (1760 of 1799) PASS: lldb-unit :: Utility/./UtilityTests/UriParserTest.MinimalPortPath (1761 of 1799) PASS: lldb-unit :: Utility/./UtilityTests/ArchSpecTest.TestSetTriple (1762 of 1799) UNRESOLVED: lldb-api :: lang/objc/objc-struct-argument/TestObjCStructArgument.py (1763 of 1799) ******************** TEST 'lldb-api :: lang/objc/objc-struct-argument/TestObjCStructArgument.py' FAILED ******************** Unable to find 'RESULT: PASSED' in dotest output (exit code -6):

Hide Details

lldb version 10.0.99 (http://labmaster3.local/git/llvm-project.git revision 0e0dea82681a86a09ceed0afd321367a35bfa051) clang revision a75f8d98d7ac9e557b238a229a9a2647c71feed1 llvm revision a75f8d98d7ac9e557b238a229a9a2647c71feed1 ==83558==ERROR: Interceptors are not working. This may be because AddressSanitizer is loaded too late (e.g. via dlopen). Please launch the executable with: DYLD_INSERT_LIBRARIES=/Users/buildslave/jenkins/workspace/lldb-cmake-sanitized/host-compiler/lib/clang/10.0.0/lib/darwin/libclang_rt.asan_osx_dynamic.dylib "interceptors not installed" && 0 ******************** UNRESOLVED: lldb-api :: api/multithreaded/TestMultithreaded.py (1764 of 1799) ******************** TEST 'lldb-api :: api/multithreaded/TestMultithreaded.py' FAILED ******************** Unable to find 'RESULT: PASSED' in dotest output (exit code -6):

Hide Details

lldb version 10.0.99 (http://labmaster3.local/git/llvm-project.git revision 0e0dea82681a86a09ceed0afd321367a35bfa051) clang revision a75f8d98d7ac9e557b238a229a9a2647c71feed1 llvm revision a75f8d98d7ac9e557b238a229a9a2647c71feed1 ==83565==ERROR: Interceptors are not working. This may be because AddressSanitizer is loaded too late (e.g. via dlopen). Please launch the executable with: DYLD_INSERT_LIBRARIES=/Users/buildslave/jenkins/workspace/lldb-cmake-sanitized/host-compiler/lib/clang/10.0.0/lib/darwin/libclang_rt.asan_osx_dynamic.dylib "interceptors not installed" && 0 ******************** PASS: lldb-shell :: SymbolFile/DWARF/parallel-indexing-stress.s (1765 of 1799) PASS: lldb-unit :: Process/minidump/./LLDBMinidumpTests/MinidumpParserTest.InvalidMinidump (1766 of 1799) PASS: lldb-unit :: Utility/./UtilityTests/RangeDataVector.FindEntryThatContains (1767 of 1799) PASS: lldb-unit :: Utility/./UtilityTests/UriParserTest.SchemeHostSeparator2 (1768 of 1799) PASS: lldb-unit :: Utility/./UtilityTests/ArgsTest.DoubleQuotedItem (1769 of 1799) PASS: lldb-unit :: Process/minidump/./LLDBMinidumpTests/MinidumpParserTest.GetMemoryRegionInfoFromMemoryList (1770 of 1799) PASS: lldb-unit :: Host/./HostTests/Host.GetEnvironment (1771 of 1799) UNRESOLVED: lldb-api :: functionalities/data-formatter/data-formatter-python-synth/TestDataFormatterPythonSynth.py (1772 of 1799) ******************** TEST 'lldb-api :: functionalities/data-formatter/data-formatter-python-synth/TestDataFormatterPythonSynth.py' FAILED ******************** Unable to find 'RESULT: PASSED' in dotest output (exit code -6):

Hide Details

lldb version 10.0.99 (http://labmaster3.local/git/llvm-project.git revision 0e0dea82681a86a09ceed0afd321367a35bfa051) clang revision a75f8d98d7ac9e557b238a229a9a2647c71feed1 llvm revision a75f8d98d7ac9e557b238a229a9a2647c71feed1 ==83619==ERROR: Interceptors are not working. This may be because AddressSanitizer is loaded too late (e.g. via dlopen). Please launch the executable with: DYLD_INSERT_LIBRARIES=/Users/buildslave/jenkins/workspace/lldb-cmake-sanitized/host-compiler/lib/clang/10.0.0/lib/darwin/libclang_rt.asan_osx_dynamic.dylib "interceptors not installed" && 0 ******************** UNRESOLVED: lldb-api :: commands/frame/diagnose/dereference-function-return/TestDiagnoseDereferenceFunctionReturn.py (1773 of 1799) ******************** TEST 'lldb-api :: commands/frame/diagnose/dereference-function-return/TestDiagnoseDereferenceFunctionReturn.py' FAILED ******************** Unable to find 'RESULT: PASSED' in dotest output (exit code -6):

Hide Details

lldb version 10.0.99 (http://labmaster3.local/git/llvm-project.git revision 0e0dea82681a86a09ceed0afd321367a35bfa051) clang revision a75f8d98d7ac9e557b238a229a9a2647c71feed1 llvm revision a75f8d98d7ac9e557b238a229a9a2647c71feed1 ==83626==ERROR: Interceptors are not working. This may be because AddressSanitizer is loaded too late (e.g. via dlopen). Please launch the executable with: DYLD_INSERT_LIBRARIES=/Users/buildslave/jenkins/workspace/lldb-cmake-sanitized/host-compiler/lib/clang/10.0.0/lib/darwin/libclang_rt.asan_osx_dynamic.dylib "interceptors not installed" && 0 ******************** PASS: lldb-unit :: Host/./HostTests/MainLoopTest.UnmonitoredSignal (1774 of 1799) PASS: lldb-unit :: UnwindAssembly/x86/./UnwindAssemblyx86Tests/Testx86AssemblyInspectionEngine.TestDisassemblyJunkBytes (1775 of 1799) PASS: lldb-unit :: Utility/./UtilityTests/AnsiTerminal.Incomplete (1776 of 1799) PASS: lldb-shell :: ObjectFile/Breakpad/sections.test (1777 of 1799) UNRESOLVED: lldb-api :: functionalities/data-formatter/data-formatter-stl/libstdcpp/string/TestDataFormatterStdString.py (1778 of 1799) ******************** TEST 'lldb-api :: functionalities/data-formatter/data-formatter-stl/libstdcpp/string/TestDataFormatterStdString.py' FAILED ******************** Unable to find 'RESULT: PASSED' in dotest output (exit code -6):

Hide Details

lldb version 10.0.99 (http://labmaster3.local/git/llvm-project.git revision 0e0dea82681a86a09ceed0afd321367a35bfa051) clang revision a75f8d98d7ac9e557b238a229a9a2647c71feed1 llvm revision a75f8d98d7ac9e557b238a229a9a2647c71feed1 ==83645==ERROR: Interceptors are not working. This may be because AddressSanitizer is loaded too late (e.g. via dlopen). Please launch the executable with: DYLD_INSERT_LIBRARIES=/Users/buildslave/jenkins/workspace/lldb-cmake-sanitized/host-compiler/lib/clang/10.0.0/lib/darwin/libclang_rt.asan_osx_dynamic.dylib "interceptors not installed" && 0 ******************** UNRESOLVED: lldb-api :: functionalities/signal/raise/TestRaise.py (1779 of 1799) ******************** TEST 'lldb-api :: functionalities/signal/raise/TestRaise.py' FAILED ******************** Unable to find 'RESULT: PASSED' in dotest output (exit code -6):

Hide Details

lldb version 10.0.99 (http://labmaster3.local/git/llvm-project.git revision 0e0dea82681a86a09ceed0afd321367a35bfa051) clang revision a75f8d98d7ac9e557b238a229a9a2647c71feed1 llvm revision a75f8d98d7ac9e557b238a229a9a2647c71feed1 ==83651==ERROR: Interceptors are not working. This may be because AddressSanitizer is loaded too late (e.g. via dlopen). Please launch the executable with: DYLD_INSERT_LIBRARIES=/Users/buildslave/jenkins/workspace/lldb-cmake-sanitized/host-compiler/lib/clang/10.0.0/lib/darwin/libclang_rt.asan_osx_dynamic.dylib "interceptors not installed" && 0 ******************** PASS: lldb-unit :: Host/./HostTests/FileSystemTest.Resolve (1780 of 1799) PASS: lldb-unit :: UnwindAssembly/x86/./UnwindAssemblyx86Tests/Testx86AssemblyInspectionEngine.TestPushEAX (1781 of 1799) UNRESOLVED: lldb-api :: functionalities/avoids-fd-leak/TestFdLeak.py (1782 of 1799) ******************** TEST 'lldb-api :: functionalities/avoids-fd-leak/TestFdLeak.py' FAILED ******************** Unable to find 'RESULT: PASSED' in dotest output (exit code -6):

Hide Details

lldb version 10.0.99 (http://labmaster3.local/git/llvm-project.git revision 0e0dea82681a86a09ceed0afd321367a35bfa051) clang revision a75f8d98d7ac9e557b238a229a9a2647c71feed1 llvm revision a75f8d98d7ac9e557b238a229a9a2647c71feed1 ==83671==ERROR: Interceptors are not working. This may be because AddressSanitizer is loaded too late (e.g. via dlopen). Please launch the executable with: DYLD_INSERT_LIBRARIES=/Users/buildslave/jenkins/workspace/lldb-cmake-sanitized/host-compiler/lib/clang/10.0.0/lib/darwin/libclang_rt.asan_osx_dynamic.dylib "interceptors not installed" && 0 ******************** UNRESOLVED: lldb-api :: python_api/process/io/TestProcessIO.py (1783 of 1799) ******************** TEST 'lldb-api :: python_api/process/io/TestProcessIO.py' FAILED ******************** Unable to find 'RESULT: PASSED' in dotest output (exit code -6):

Hide Details

lldb version 10.0.99 (http://labmaster3.local/git/llvm-project.git revision 0e0dea82681a86a09ceed0afd321367a35bfa051) clang revision a75f8d98d7ac9e557b238a229a9a2647c71feed1 llvm revision a75f8d98d7ac9e557b238a229a9a2647c71feed1 ==83694==ERROR: Interceptors are not working. This may be because AddressSanitizer is loaded too late (e.g. via dlopen). Please launch the executable with: DYLD_INSERT_LIBRARIES=/Users/buildslave/jenkins/workspace/lldb-cmake-sanitized/host-compiler/lib/clang/10.0.0/lib/darwin/libclang_rt.asan_osx_dynamic.dylib "interceptors not installed" && 0 ******************** PASS: lldb-shell :: ObjectFile/ELF/build-id-case.yaml (1784 of 1799) UNRESOLVED: lldb-api :: lang/cpp/template/TestTemplateArgs.py (1785 of 1799) ******************** TEST 'lldb-api :: lang/cpp/template/TestTemplateArgs.py' FAILED ******************** Unable to find 'RESULT: PASSED' in dotest output (exit code -6):

Hide Details

lldb version 10.0.99 (http://labmaster3.local/git/llvm-project.git revision 0e0dea82681a86a09ceed0afd321367a35bfa051) clang revision a75f8d98d7ac9e557b238a229a9a2647c71feed1 llvm revision a75f8d98d7ac9e557b238a229a9a2647c71feed1 ==83692==ERROR: Interceptors are not working. This may be because AddressSanitizer is loaded too late (e.g. via dlopen). Please launch the executable with: DYLD_INSERT_LIBRARIES=/Users/buildslave/jenkins/workspace/lldb-cmake-sanitized/host-compiler/lib/clang/10.0.0/lib/darwin/libclang_rt.asan_osx_dynamic.dylib "interceptors not installed" && 0 ******************** PASS: lldb-shell :: Watchpoint/SetErrorCases.test (1786 of 1799) PASS: lldb-unit :: Utility/./UtilityTests/StringListTest.JoinSingle (1787 of 1799) PASS: lldb-shell :: Reproducer/Functionalities/TestDataFormatter.test (1788 of 1799) UNRESOLVED: lldb-api :: lang/c/inlines/TestRedefinitionsInInlines.py (1789 of 1799) ******************** TEST 'lldb-api :: lang/c/inlines/TestRedefinitionsInInlines.py' FAILED ******************** Unable to find 'RESULT: PASSED' in dotest output (exit code -6):

Hide Details

lldb version 10.0.99 (http://labmaster3.local/git/llvm-project.git revision 0e0dea82681a86a09ceed0afd321367a35bfa051) clang revision a75f8d98d7ac9e557b238a229a9a2647c71feed1 llvm revision a75f8d98d7ac9e557b238a229a9a2647c71feed1 ==83697==ERROR: Interceptors are not working. This may be because AddressSanitizer is loaded too late (e.g. via dlopen). Please launch the executable with: DYLD_INSERT_LIBRARIES=/Users/buildslave/jenkins/workspace/lldb-cmake-sanitized/host-compiler/lib/clang/10.0.0/lib/darwin/libclang_rt.asan_osx_dynamic.dylib "interceptors not installed" && 0 ******************** UNRESOLVED: lldb-api :: commands/apropos/with-process/TestAproposWithProcess.py (1790 of 1799) ******************** TEST 'lldb-api :: commands/apropos/with-process/TestAproposWithProcess.py' FAILED ******************** Unable to find 'RESULT: PASSED' in dotest output (exit code -6):

Hide Details

lldb version 10.0.99 (http://labmaster3.local/git/llvm-project.git revision 0e0dea82681a86a09ceed0afd321367a35bfa051) clang revision a75f8d98d7ac9e557b238a229a9a2647c71feed1 llvm revision a75f8d98d7ac9e557b238a229a9a2647c71feed1 ==83702==ERROR: Interceptors are not working. This may be because AddressSanitizer is loaded too late (e.g. via dlopen). Please launch the executable with: DYLD_INSERT_LIBRARIES=/Users/buildslave/jenkins/workspace/lldb-cmake-sanitized/host-compiler/lib/clang/10.0.0/lib/darwin/libclang_rt.asan_osx_dynamic.dylib "interceptors not installed" && 0 ******************** UNRESOLVED: lldb-api :: functionalities/target-new-solib-notifications/TestModuleLoadedNotifys.py (1791 of 1799) ******************** TEST 'lldb-api :: functionalities/target-new-solib-notifications/TestModuleLoadedNotifys.py' FAILED ******************** Unable to find 'RESULT: PASSED' in dotest output (exit code -6):

Hide Details

lldb version 10.0.99 (http://labmaster3.local/git/llvm-project.git revision 0e0dea82681a86a09ceed0afd321367a35bfa051) clang revision a75f8d98d7ac9e557b238a229a9a2647c71feed1 llvm revision a75f8d98d7ac9e557b238a229a9a2647c71feed1 ==83715==ERROR: Interceptors are not working. This may be because AddressSanitizer is loaded too late (e.g. via dlopen). Please launch the executable with: DYLD_INSERT_LIBRARIES=/Users/buildslave/jenkins/workspace/lldb-cmake-sanitized/host-compiler/lib/clang/10.0.0/lib/darwin/libclang_rt.asan_osx_dynamic.dylib "interceptors not installed" && 0 ******************** UNRESOLVED: lldb-api :: tools/lldb-server/TestLldbGdbServer.py (1792 of 1799) ******************** TEST 'lldb-api :: tools/lldb-server/TestLldbGdbServer.py' FAILED ******************** Unable to find 'RESULT: PASSED' in dotest output (exit code -6):

Hide Details

lldb version 10.0.99 (http://labmaster3.local/git/llvm-project.git revision 0e0dea82681a86a09ceed0afd321367a35bfa051) clang revision a75f8d98d7ac9e557b238a229a9a2647c71feed1 llvm revision a75f8d98d7ac9e557b238a229a9a2647c71feed1 ==83727==ERROR: Interceptors are not working. This may be because AddressSanitizer is loaded too late (e.g. via dlopen). Please launch the executable with: DYLD_INSERT_LIBRARIES=/Users/buildslave/jenkins/workspace/lldb-cmake-sanitized/host-compiler/lib/clang/10.0.0/lib/darwin/libclang_rt.asan_osx_dynamic.dylib "interceptors not installed" && 0 ******************** UNRESOLVED: lldb-api :: linux/add-symbols/TestTargetSymbolsAddCommand.py (1793 of 1799) ******************** TEST 'lldb-api :: linux/add-symbols/TestTargetSymbolsAddCommand.py' FAILED ******************** Unable to find 'RESULT: PASSED' in dotest output (exit code -6):

Hide Details

lldb version 10.0.99 (http://labmaster3.local/git/llvm-project.git revision 0e0dea82681a86a09ceed0afd321367a35bfa051) clang revision a75f8d98d7ac9e557b238a229a9a2647c71feed1 llvm revision a75f8d98d7ac9e557b238a229a9a2647c71feed1 ==83728==ERROR: Interceptors are not working. This may be because AddressSanitizer is loaded too late (e.g. via dlopen). Please launch the executable with: DYLD_INSERT_LIBRARIES=/Users/buildslave/jenkins/workspace/lldb-cmake-sanitized/host-compiler/lib/clang/10.0.0/lib/darwin/libclang_rt.asan_osx_dynamic.dylib "interceptors not installed" && 0 ******************** UNRESOLVED: lldb-api :: python_api/value/linked_list/TestValueAPILinkedList.py (1794 of 1799) ******************** TEST 'lldb-api :: python_api/value/linked_list/TestValueAPILinkedList.py' FAILED ******************** Unable to find 'RESULT: PASSED' in dotest output (exit code -6):

Hide Details

lldb version 10.0.99 (http://labmaster3.local/git/llvm-project.git revision 0e0dea82681a86a09ceed0afd321367a35bfa051) clang revision a75f8d98d7ac9e557b238a229a9a2647c71feed1 llvm revision a75f8d98d7ac9e557b238a229a9a2647c71feed1 ==83763==ERROR: Interceptors are not working. This may be because AddressSanitizer is loaded too late (e.g. via dlopen). Please launch the executable with: DYLD_INSERT_LIBRARIES=/Users/buildslave/jenkins/workspace/lldb-cmake-sanitized/host-compiler/lib/clang/10.0.0/lib/darwin/libclang_rt.asan_osx_dynamic.dylib "interceptors not installed" && 0 ******************** UNRESOLVED: lldb-api :: functionalities/data-formatter/data-formatter-synthtype/TestDataFormatterSynthType.py (1795 of 1799) ******************** TEST 'lldb-api :: functionalities/data-formatter/data-formatter-synthtype/TestDataFormatterSynthType.py' FAILED ******************** Unable to find 'RESULT: PASSED' in dotest output (exit code -6):

Hide Details

lldb version 10.0.99 (http://labmaster3.local/git/llvm-project.git revision 0e0dea82681a86a09ceed0afd321367a35bfa051) clang revision a75f8d98d7ac9e557b238a229a9a2647c71feed1 llvm revision a75f8d98d7ac9e557b238a229a9a2647c71feed1 ==83773==ERROR: Interceptors are not working. This may be because AddressSanitizer is loaded too late (e.g. via dlopen). Please launch the executable with: DYLD_INSERT_LIBRARIES=/Users/buildslave/jenkins/workspace/lldb-cmake-sanitized/host-compiler/lib/clang/10.0.0/lib/darwin/libclang_rt.asan_osx_dynamic.dylib "interceptors not installed" && 0 ******************** UNRESOLVED: lldb-api :: arm/breakpoint-it/TestBreakpointIt.py (1796 of 1799) ******************** TEST 'lldb-api :: arm/breakpoint-it/TestBreakpointIt.py' FAILED ******************** Unable to find 'RESULT: PASSED' in dotest output (exit code -6):

Hide Details

lldb version 10.0.99 (http://labmaster3.local/git/llvm-project.git revision 0e0dea82681a86a09ceed0afd321367a35bfa051) clang revision a75f8d98d7ac9e557b238a229a9a2647c71feed1 llvm revision a75f8d98d7ac9e557b238a229a9a2647c71feed1 ==83785==ERROR: Interceptors are not working. This may be because AddressSanitizer is loaded too late (e.g. via dlopen). Please launch the executable with: DYLD_INSERT_LIBRARIES=/Users/buildslave/jenkins/workspace/lldb-cmake-sanitized/host-compiler/lib/clang/10.0.0/lib/darwin/libclang_rt.asan_osx_dynamic.dylib "interceptors not installed" && 0 ******************** UNRESOLVED: lldb-api :: commands/expression/call-overridden-method/TestCallOverriddenMethod.py (1797 of 1799) ******************** TEST 'lldb-api :: commands/expression/call-overridden-method/TestCallOverriddenMethod.py' FAILED ******************** Unable to find 'RESULT: PASSED' in dotest output (exit code -6):

Hide Details

lldb version 10.0.99 (http://labmaster3.local/git/llvm-project.git revision 0e0dea82681a86a09ceed0afd321367a35bfa051) clang revision a75f8d98d7ac9e557b238a229a9a2647c71feed1 llvm revision a75f8d98d7ac9e557b238a229a9a2647c71feed1 ==83784==ERROR: Interceptors are not working. This may be because AddressSanitizer is loaded too late (e.g. via dlopen). Please launch the executable with: DYLD_INSERT_LIBRARIES=/Users/buildslave/jenkins/workspace/lldb-cmake-sanitized/host-compiler/lib/clang/10.0.0/lib/darwin/libclang_rt.asan_osx_dynamic.dylib "interceptors not installed" && 0 ******************** PASS: lldb-shell :: Reproducer/TestDriverOptions.test (1798 of 1799) PASS: lldb-shell :: Reproducer/TestReuseDirectory.test (1799 of 1799)

Hide Details

Testing Time: 653.97s ******************** Unresolved Tests (767): lldb-api :: functionalities/memory/cache/TestMemoryCache.py lldb-api :: functionalities/data-formatter/data-formatter-stl/libcxx/list/TestDataFormatterLibcxxList.py lldb-api :: commands/target/stop-hooks/TestStopHooks.py lldb-api :: functionalities/gdb_remote_client/TestRecognizeBreakpoint.py lldb-api :: macosx/DBGSourcePathRemapping/TestDSYMSourcePathRemapping.py lldb-api :: lang/c/unicode/TestUnicodeSymbols.py lldb-api :: functionalities/breakpoint/consecutive_breakpoints/TestConsecutiveBreakpoints.py lldb-api :: terminal/TestSTTYBeforeAndAfter.py lldb-api :: lang/cpp/member-and-local-vars-with-same-name/TestMembersAndLocalsWithSameName.py lldb-api :: python_api/lldbutil/frame/TestFrameUtils.py lldb-api :: functionalities/data-formatter/data-formatter-stl/libcxx/forward_list/TestDataFormatterLibcxxForwardList.py lldb-api :: tools/lldb-server/TestGdbRemoteSingleStep.py lldb-api :: functionalities/signal/handle-segv/TestHandleSegv.py lldb-api :: lang/cpp/trivial_abi/TestTrivialABI.py lldb-api :: functionalities/step_scripted/TestStepScripted.py lldb-api :: functionalities/data-formatter/summary-string-onfail/Test-rdar-9974002.py lldb-api :: python_api/hello_world/TestHelloWorld.py lldb-api :: lang/objc/objc-optimized/TestObjcOptimized.py lldb-api :: lang/c/struct_types/TestStructTypes.py lldb-api :: functionalities/thread/step_out/TestThreadStepOut.py lldb-api :: functionalities/thread/concurrent_events/TestConcurrentSignalDelayWatch.py lldb-api :: lang/cpp/namespace_definitions/TestNamespaceDefinitions.py lldb-api :: functionalities/modern-type-lookup/libcxx/TestLibCxxModernTypeLookup.py lldb-api :: lang/c/enum_types/TestEnumTypes.py lldb-api :: python_api/frame/inlines/TestInlinedFrame.py lldb-api :: commands/expression/import-std-module/vector-dbg-info-content/TestDbgInfoContentVector.py lldb-api :: commands/command/script/TestCommandScript.py lldb-api :: commands/watchpoints/watchpoint_size/TestWatchpointSizes.py lldb-api :: lang/cpp/nsimport/TestCppNsImport.py lldb-api :: functionalities/darwin_log/filter/exact_match/message/TestDarwinLogFilterMatchMessage.py lldb-api :: functionalities/tail_call_frames/ambiguous_tail_call_seq2/TestAmbiguousTailCallSeq2.py lldb-api :: lang/c/offsetof/TestOffsetof.py lldb-api :: lang/objc/objc-ivar-offsets/TestObjCIvarOffsets.py lldb-api :: python_api/sbvalue_persist/TestSBValuePersist.py lldb-api :: tools/lldb-server/TestGdbRemoteAuxvSupport.py lldb-api :: functionalities/data-formatter/frameformat_smallstruct/TestFrameFormatSmallStruct.py lldb-api :: lang/cpp/exceptions/TestCPPExceptionBreakpoints.py lldb-api :: commands/watchpoints/watchpoint_events/TestWatchpointEvents.py lldb-api :: iohandler/completion/TestIOHandlerCompletion.py lldb-api :: commands/command/nested_alias/TestNestedAlias.py lldb-api :: commands/expression/po_verbosity/TestPoVerbosity.py lldb-api :: python_api/value/change_values/TestChangeValueAPI.py lldb-api :: python_api/frame/TestFrames.py lldb-api :: functionalities/breakpoint/cpp_exception/TestCPPExceptionBreakpoint.py lldb-api :: lang/objc/modules/TestObjCModules.py lldb-api :: functionalities/multidebugger_commands/TestMultipleDebuggersCommands.py lldb-api :: functionalities/postmortem/elf-core/thread_crash/TestLinuxCoreThreads.py lldb-api :: python_api/value_var_update/TestValueVarUpdate.py lldb-api :: lang/cpp/modules-import/TestCXXModulesImport.py lldb-api :: commands/apropos/basic/TestApropos.py lldb-api :: functionalities/data-formatter/refpointer-recursion/TestDataFormatterRefPtrRecursion.py lldb-api :: functionalities/data-formatter/varscript_formatting/TestDataFormatterVarScriptFormatting.py lldb-api :: commands/command/invalid-args/TestInvalidArgsCommand.py lldb-api :: commands/watchpoints/watchpoint_on_vectors/TestValueOfVectorVariable.py lldb-api :: functionalities/thread/concurrent_events/TestConcurrentManyWatchpoints.py lldb-api :: functionalities/thread/create_after_attach/TestCreateAfterAttach.py lldb-api :: tools/lldb-server/TestGdbRemote_vCont.py lldb-api :: lang/cpp/class-template-parameter-pack/TestClassTemplateParameterPack.py lldb-api :: commands/expression/class_template_specialization_empty_pack/TestClassTemplateSpecializationParametersHandling.py lldb-api :: commands/expression/xvalue/TestXValuePrinting.py lldb-api :: functionalities/breakpoint/scripted_bkpt/TestScriptedResolver.py lldb-api :: functionalities/unwind/standard/TestStandardUnwind.py lldb-api :: commands/platform/basic/TestPlatformCommand.py lldb-api :: commands/watchpoints/hello_watchlocation/TestWatchLocation.py lldb-api :: functionalities/tail_call_frames/thread_step_out_message/TestArtificialFrameStepOutMessage.py lldb-api :: lang/objc/self/TestObjCSelf.py lldb-api :: tools/lldb-server/TestGdbRemoteExpeditedRegisters.py lldb-api :: functionalities/tail_call_frames/unambiguous_sequence/TestUnambiguousTailCalls.py lldb-api :: commands/watchpoints/step_over_watchpoint/TestStepOverWatchpoint.py lldb-api :: benchmarks/expression/TestExpressionCmd.py lldb-api :: functionalities/data-formatter/data-formatter-stl/libstdcpp/tuple/TestDataFormatterStdTuple.py lldb-api :: lang/c/unions/TestUnionMembers.py lldb-api :: tools/lldb-server/TestGdbRemoteAttach.py lldb-api :: functionalities/data-formatter/data-formatter-stl/libstdcpp/unique_ptr/invalid/TestDataFormatterInvalidStdUniquePtr.py lldb-api :: commands/quit/TestQuit.py lldb-api :: lang/objc/objc-dynamic-value/TestObjCDynamicValue.py lldb-api :: python_api/event/TestEvents.py lldb-api :: functionalities/thread/concurrent_events/TestConcurrentNWatchNBreak.py lldb-api :: lang/objc/objc-dyn-sbtype/TestObjCDynamicSBType.py lldb-api :: commands/expression/formatters/TestFormatters.py lldb-api :: functionalities/data-formatter/data-formatter-stl/libcxx/vbool/TestDataFormatterLibcxxVBool.py lldb-api :: lang/cpp/rvalue-references/TestRvalueReferences.py lldb-api :: python_api/file_handle/TestFileHandle.py lldb-api :: python_api/breakpoint/TestBreakpointAPI.py lldb-api :: types/TestDoubleTypes.py lldb-api :: commands/expression/invalid-args/TestInvalidArgsExpression.py lldb-api :: functionalities/paths/TestPaths.py lldb-api :: types/TestFloatTypes.py lldb-api :: functionalities/data-formatter/data-formatter-stl/libcxx/vector/TestDataFormatterLibcxxVector.py lldb-api :: commands/process/launch-with-shellexpand/TestLaunchWithShellExpand.py lldb-api :: commands/expression/expr-in-syscall/TestExpressionInSyscall.py lldb-api :: lang/objc/orderedset/TestOrderedSet.py lldb-api :: lang/cpp/nested-class-other-compilation-unit/TestNestedClassWithParentInAnotherCU.py lldb-api :: functionalities/wrong_commands/TestWrongCommands.py lldb-api :: functionalities/show_location/TestShowLocationDwarf5.py lldb-api :: lang/cpp/const_this/TestConstThis.py lldb-api :: functionalities/fat_archives/TestFatArchives.py lldb-api :: commands/log/basic/TestLogging.py lldb-api :: functionalities/tail_call_frames/thread_step_out_or_return/TestSteppingOutWithArtificialFrames.py lldb-api :: functionalities/thread/concurrent_events/TestConcurrentTwoWatchpointsOneBreakpoint.py lldb-api :: commands/expression/namespace_local_var_same_name_cpp_and_c/TestNamespaceLocalVarSameNameCppAndC.py lldb-api :: driver/batch_mode/TestBatchMode.py lldb-api :: functionalities/thread/concurrent_events/TestConcurrentCrashWithWatchpoint.py lldb-api :: commands/command/script/import/TestImport.py lldb-api :: commands/statistics/basic/TestStats.py lldb-api :: commands/watchpoints/multiple_threads/TestWatchpointMultipleThreads.py lldb-api :: functionalities/darwin_log/source/info/TestDarwinLogSourceInfo.py lldb-api :: macosx/duplicate-archive-members/TestDuplicateMembers.py lldb-api :: lang/c/tls_globals/TestTlsGlobals.py lldb-api :: benchmarks/stepping/TestSteppingSpeed.py lldb-api :: lang/objc/modules-cache/TestClangModulesCache.py lldb-api :: functionalities/gdb_remote_client/TestRestartBug.py lldb-api :: functionalities/source-map/TestTargetSourceMap.py lldb-api :: functionalities/signal/TestSendSignal.py lldb-api :: functionalities/modern-type-lookup/basic-objc/TestBasicObjcModernTypeLookup.py lldb-api :: functionalities/postmortem/minidump/TestMiniDump.py lldb-api :: functionalities/process_group/TestChangeProcessGroup.py lldb-api :: benchmarks/turnaround/TestCompileRunToBreakpointTurnaround.py lldb-api :: functionalities/data-formatter/data-formatter-stl/libstdcpp/list/TestDataFormatterStdList.py lldb-api :: commands/watchpoints/multi_watchpoint_slots/TestWatchpointMultipleSlots.py lldb-api :: commands/expression/dont_allow_jit/TestAllowJIT.py lldb-api :: commands/expression/persistent_types/TestNestedPersistentTypes.py lldb-api :: lang/cpp/bool/TestCPPBool.py lldb-api :: tools/lldb-vscode/launch/TestVSCode_launch.py lldb-api :: functionalities/breakpoint/move_nearest/TestMoveNearest.py lldb-api :: functionalities/data-formatter/dump_dynamic/TestDumpDynamic.py lldb-api :: lang/cpp/std-function-step-into-callable/TestStdFunctionStepIntoCallable.py lldb-api :: functionalities/ptr_refs/TestPtrRefs.py lldb-api :: commands/version/TestVersion.py lldb-api :: commands/frame/var/TestFrameVar.py lldb-api :: commands/watchpoints/watchpoint_commands/condition/TestWatchpointConditionCmd.py lldb-api :: functionalities/pre_run_dylibs/TestPreRunDylibs.py lldb-api :: functionalities/completion/TestCompletion.py lldb-api :: commands/settings/quoting/TestQuoting.py lldb-api :: commands/expression/ir-interpreter/TestIRInterpreter.py lldb-api :: macosx/find-dsym/deep-bundle/TestDeepBundle.py lldb-api :: lang/objc/objc-baseclass-sbtype/TestObjCBaseClassSBType.py lldb-api :: functionalities/data-formatter/data-formatter-proper-plurals/TestFormattersOneIsSingular.py lldb-api :: functionalities/gdb_remote_client/TestTargetXMLArch.py lldb-api :: macosx/function-starts/TestFunctionStarts.py lldb-api :: lang/objc/objc-class-method/TestObjCClassMethod.py lldb-api :: linux/builtin_trap/TestBuiltinTrap.py lldb-api :: functionalities/data-formatter/data-formatter-skip-summary/TestDataFormatterSkipSummary.py lldb-api :: commands/expression/two-files/TestObjCTypeQueryFromOtherCompileUnit.py lldb-api :: functionalities/data-formatter/language_category_updates/TestDataFormatterLanguageCategoryUpdates.py lldb-api :: api/multiple-debuggers/TestMultipleDebuggers.py lldb-api :: lang/objc/foundation/TestObjectDescriptionAPI.py lldb-api :: lang/cpp/function-template-parameter-pack/TestFunctionTemplateParameterPack.py lldb-api :: tools/lldb-vscode/step/TestVSCode_step.py lldb-api :: functionalities/data-formatter/data-formatter-synth/TestDataFormatterSynth.py lldb-api :: python_api/type/TestTypeList.py lldb-api :: lang/objc/modules-inline-functions/TestModulesInlineFunctions.py lldb-api :: tools/lldb-server/signal-filtering/TestGdbRemote_QPassSignals.py lldb-api :: lang/c/stepping/TestThreadStepping.py lldb-api :: lang/cpp/operator-overload/TestOperatorOverload.py lldb-api :: lang/cpp/symbols/TestSymbols.py lldb-api :: functionalities/postmortem/mach-core/TestMachCore.py lldb-api :: python_api/symbol-context/TestSymbolContext.py lldb-api :: lang/objc/foundation/TestSymbolTable.py lldb-api :: functionalities/postmortem/elf-core/gcore/TestGCore.py lldb-api :: functionalities/recursion/TestValueObjectRecursion.py lldb-api :: python_api/debugger/TestDebuggerAPI.py lldb-api :: lang/objc/rdar-12408181/TestRdar12408181.py lldb-api :: tools/lldb-server/TestGdbRemoteRegisterState.py lldb-api :: functionalities/target_var/TestTargetVar.py lldb-api :: functionalities/darwin_log/filter/exact_match/subsystem/TestDarwinLogFilterMatchSubsystem.py lldb-api :: functionalities/gdb_remote_client/TestStopPCs.py lldb-api :: commands/frame/recognizer/TestFrameRecognizer.py lldb-api :: commands/register/register/register_command/TestRegisters.py lldb-api :: functionalities/data-formatter/data-formatter-stl/libcxx/optional/TestDataFormatterLibcxxOptional.py lldb-api :: lang/objc/rdar-11355592/TestRdar11355592.py lldb-api :: functionalities/thread/create_during_step/TestCreateDuringStep.py lldb-api :: functionalities/postmortem/minidump-new/TestMiniDumpUUID.py lldb-api :: commands/expression/import-std-module/unique_ptr-dbg-info-content/TestUniquePtrDbgInfoContent.py lldb-api :: macosx/safe-to-func-call/TestSafeFuncCalls.py lldb-api :: api/log/TestAPILog.py lldb-api :: commands/expression/unwind_expression/TestUnwindExpression.py lldb-api :: functionalities/thread/concurrent_events/TestConcurrentManyCrash.py lldb-api :: python_api/lldbutil/iter/TestLLDBIterator.py lldb-api :: functionalities/thread/concurrent_events/TestConcurrentSignalDelayBreak.py lldb-api :: functionalities/postmortem/minidump-new/TestMiniDumpNew.py lldb-api :: python_api/process/read-mem-cstring/TestReadMemCString.py lldb-api :: lang/cpp/offsetof/TestOffsetofCpp.py lldb-api :: functionalities/thread/concurrent_events/TestConcurrentBreakpointDelayBreakpointOneSignal.py lldb-api :: commands/expression/import-std-module/shared_ptr-dbg-info-content/TestSharedPtrDbgInfoContent.py lldb-api :: functionalities/thread/concurrent_events/TestConcurrentCrashWithBreak.py lldb-api :: lang/cpp/diamond/TestDiamond.py lldb-api :: functionalities/data-formatter/data-formatter-objc/TestDataFormatterObjCNSError.py lldb-api :: functionalities/load_using_paths/TestLoadUsingPaths.py lldb-api :: functionalities/deleted-executable/TestDeletedExecutable.py lldb-api :: functionalities/inline-stepping/TestInlineStepping.py lldb-api :: functionalities/jitloader_gdb/TestJITLoaderGDB.py lldb-api :: functionalities/thread/concurrent_events/TestConcurrentTwoBreakpointThreads.py lldb-api :: functionalities/abbreviation/TestAbbreviations.py lldb-api :: functionalities/thread/concurrent_events/TestConcurrentCrashWithSignal.py lldb-api :: commands/expression/inline-namespace/TestInlineNamespace.py lldb-api :: lang/mixed/TestMixedLanguages.py lldb-api :: functionalities/thread/concurrent_events/TestConcurrentDelayWatchBreak.py lldb-api :: lang/c/modules/TestCModules.py lldb-api :: commands/expression/timeout/TestCallWithTimeout.py lldb-api :: lang/objc/variadic_methods/TestVariadicMethods.py lldb-api :: functionalities/tail_call_frames/disambiguate_call_site/TestDisambiguateCallSite.py lldb-api :: functionalities/data-formatter/nsdictionarysynth/TestNSDictionarySynthetic.py lldb-api :: commands/command/script/import/rdar-12586188/TestRdar12586188.py lldb-api :: python_api/watchpoint/watchlocation/TestTargetWatchAddress.py lldb-api :: lang/objc/objc-ivar-protocols/TestIvarProtocols.py lldb-api :: functionalities/data-formatter/data-formatter-objc/nsindexpath/TestDataFormatterNSIndexPath.py lldb-api :: lang/c/find_struct_type/TestFindStructTypes.py lldb-api :: lang/objc/single-entry-dictionary/TestObjCSingleEntryDictionary.py lldb-api :: functionalities/non-overlapping-index-variable-i/TestIndexVariable.py lldb-api :: python_api/watchpoint/condition/TestWatchpointConditionAPI.py lldb-api :: functionalities/darwin_log/format/TestDarwinLogMessageFormat.py lldb-api :: commands/expression/persistent_types/TestPersistentTypes.py lldb-api :: functionalities/data-formatter/compactvectors/TestCompactVectors.py lldb-api :: python_api/interpreter/TestCommandInterpreterAPI.py lldb-api :: python_api/interpreter/TestRunCommandInterpreterAPI.py lldb-api :: functionalities/gdb_remote_client/TestNestedRegDefinitions.py lldb-api :: commands/frame/diagnose/dereference-this/TestDiagnoseDereferenceThis.py lldb-api :: macosx/macabi/TestMacABImacOSFramework.py lldb-api :: python_api/lldbutil/process/TestPrintStackTraces.py lldb-api :: functionalities/data-formatter/data-formatter-stl/libcxx/bitset/TestDataFormatterLibcxxBitset.py lldb-api :: commands/frame/language/TestGuessLanguage.py lldb-api :: lang/cpp/function_refs/TestFunctionRefs.py lldb-api :: tools/lldb-vscode/attach/TestVSCode_attach.py lldb-api :: lang/cpp/static_methods/TestCPPStaticMethods.py lldb-api :: functionalities/param_entry_vals/basic_entry_values_x86_64/TestBasicEntryValuesX86_64.py lldb-api :: functionalities/data-formatter/boolreference/TestFormattersBoolRefPtr.py lldb-api :: macosx/find-dsym/bundle-with-dot-in-filename/TestBundleWithDotInFilename.py lldb-api :: lang/objc/foundation/TestObjCMethodsNSArray.py lldb-api :: functionalities/data-formatter/ostypeformatting/TestFormattersOsType.py lldb-api :: commands/expression/call-throws/TestCallThatThrows.py lldb-api :: functionalities/thread/num_threads/TestNumThreads.py lldb-api :: commands/expression/radar_9531204/TestPrintfAfterUp.py lldb-api :: commands/process/attach/TestProcessAttach.py lldb-api :: functionalities/longjmp/TestLongjmp.py lldb-api :: functionalities/tsan/basic/TestTsanBasic.py lldb-api :: benchmarks/startup/TestStartupDelays.py lldb-api :: lang/cpp/wchar_t/TestCxxWCharT.py lldb-api :: commands/register/register/intel_xtended_registers/TestMPXRegisters.py lldb-api :: commands/expression/context-object-objc/TestContextObjectObjc.py lldb-api :: commands/expression/import-std-module/vector-bool/TestBoolVector.py lldb-api :: tools/lldb-server/inferior-crash/TestGdbRemoteAbort.py lldb-api :: functionalities/thread/concurrent_events/TestConcurrentSignalWatchBreak.py lldb-api :: lang/cpp/this/TestCPPThis.py lldb-api :: lang/cpp/thread_local/TestThreadLocal.py lldb-api :: lang/objc/rdar-10967107/TestRdar10967107.py lldb-api :: lang/objcxx/cxx-bridged-po/TestObjCXXBridgedPO.py lldb-api :: commands/target/basic/TestTargetCommand.py lldb-api :: lang/c/anonymous/TestAnonymous.py lldb-api :: functionalities/inferior-crashing/recursive-inferior/TestRecursiveInferiorStep.py lldb-api :: commands/expression/import_builtin_fileid/TestImportBuiltinFileID.py lldb-api :: functionalities/data-formatter/data-formatter-stl/libstdcpp/smart_ptr/TestDataFormatterStdSmartPtr.py lldb-api :: lang/cpp/printf/TestPrintf.py lldb-api :: functionalities/thread/concurrent_events/TestConcurrentTwoWatchpointsOneSignal.py lldb-api :: commands/disassemble/basic/TestDisassembleBreakpoint.py lldb-api :: python_api/function_symbol/TestDisasmAPI.py lldb-api :: functionalities/data-formatter/type_summary_list_script/TestTypeSummaryListScript.py lldb-api :: functionalities/tail_call_frames/ambiguous_tail_call_seq1/TestAmbiguousTailCallSeq1.py lldb-api :: functionalities/data-formatter/data-formatter-enum-format/TestDataFormatterEnumFormat.py lldb-api :: functionalities/thread/concurrent_events/TestConcurrentWatchpointDelayWatchpointOneBreakpoint.py lldb-api :: commands/platform/basic/TestPlatformPython.py lldb-api :: functionalities/data-formatter/data-formatter-smart-array/TestDataFormatterSmartArray.py lldb-api :: tools/lldb-server/commandline/TestStubSetSID.py lldb-api :: sample_test/TestSampleTest.py lldb-api :: python_api/sbstructureddata/TestStructuredDataAPI.py lldb-api :: commands/expression/call-function/TestCallStdStringFunction.py lldb-api :: lang/cpp/breakpoint_in_member_func_w_non_primitive_params/TestBreakpointInMemberFuncWNonPrimitiveParams.py lldb-api :: functionalities/breakpoint/breakpoint_set_restart/TestBreakpointSetRestart.py lldb-api :: functionalities/data-formatter/type_summary_list_arg/TestTypeSummaryListArg.py lldb-api :: functionalities/breakpoint/serialize/TestBreakpointSerialization.py lldb-api :: functionalities/tail_call_frames/disambiguate_paths_to_common_sink/TestDisambiguatePathsToCommonSink.py lldb-api :: functionalities/plugins/python_os_plugin/TestPythonOSPlugin.py lldb-api :: functionalities/process_save_core/TestProcessSaveCore.py lldb-api :: commands/command/history/TestCommandHistory.py lldb-api :: lang/cpp/namespace_conflicts/TestNamespaceConflicts.py lldb-api :: macosx/add-dsym/TestAddDsymMidExecutionCommand.py lldb-api :: python_api/frame/get-variables/TestGetVariables.py lldb-api :: tools/lldb-vscode/variables/TestVSCode_variables.py lldb-api :: lang/cpp/operators/TestCppOperators.py lldb-api :: functionalities/step-avoids-no-debug/TestStepNoDebug.py lldb-api :: functionalities/ubsan/basic/TestUbsanBasic.py lldb-api :: functionalities/memory/find/TestMemoryFind.py lldb-api :: functionalities/tsan/thread_leak/TestTsanThreadLeak.py lldb-api :: functionalities/modern-type-lookup/basic/TestBasicModernTypeLookup.py lldb-api :: functionalities/data-formatter/data-formatter-objc/TestDataFormatterObjCPlain.py lldb-api :: functionalities/multiword-commands/TestMultiWordCommands.py lldb-api :: tools/lldb-vscode/stackTrace/TestVSCode_stackTrace.py lldb-api :: lang/cpp/frame-var-anon-unions/TestFrameVariableAnonymousUnions.py lldb-api :: functionalities/thread/state/TestThreadStates.py lldb-api :: commands/expression/argument_passing_restrictions/TestArgumentPassingRestrictions.py lldb-api :: functionalities/data-formatter/data-formatter-objc/TestDataFormatterObjNSException.py lldb-api :: commands/watchpoints/watchpoint_disable/TestWatchpointDisable.py lldb-api :: lang/objcxx/hide-runtime-values/TestObjCXXHideRuntimeValues.py lldb-api :: lang/c/local_variables/TestLocalVariables.py lldb-api :: commands/platform/process/TestProcessList.py lldb-api :: functionalities/thread/backtrace_all/TestBacktraceAll.py lldb-api :: api/listeners/TestListener.py lldb-api :: lang/cpp/global_operators/TestCppGlobalOperators.py lldb-api :: functionalities/data-formatter/data-formatter-objc/TestDataFormatterObjCExpr.py lldb-api :: functionalities/breakpoint/hardware_breakpoints/hardware_breakpoint_on_multiple_threads/TestHWBreakMultiThread.py lldb-api :: lang/objc/objc-static-method-stripped/TestObjCStaticMethodStripped.py lldb-api :: functionalities/data-formatter/data-formatter-stl/libcxx/tuple/TestDataFormatterLibcxxTuple.py lldb-api :: functionalities/thread/concurrent_events/TestConcurrentTwoWatchpointsOneDelayBreakpoint.py lldb-api :: functionalities/thread/concurrent_events/TestConcurrentTwoWatchpointThreads.py lldb-api :: python_api/disassemble-raw-data/TestDisassembleRawData.py lldb-api :: commands/expression/import-std-module/vector-of-vectors/TestVectorOfVectors.py lldb-api :: commands/expression/ignore-artificial-constructors/TestIgnoreArtificialConstructors.py lldb-api :: functionalities/dead-strip/TestDeadStrip.py lldb-api :: commands/expression/test/TestExprs.py lldb-api :: functionalities/mtc/simple/TestMTCSimple.py lldb-api :: lang/objc/objc-stepping/TestObjCStepping.py lldb-api :: macosx/queues/TestQueues.py lldb-api :: lang/objcxx/class-name-clash/TestNameClash.py lldb-api :: functionalities/thread/concurrent_events/TestConcurrentTwoBreakpointsOneDelaySignal.py lldb-api :: lang/cpp/signed_types/TestSignedTypes.py lldb-api :: lang/cpp/auto/TestCPPAuto.py lldb-api :: python_api/section/TestSectionAPI.py lldb-api :: functionalities/breakpoint/dummy_target_breakpoints/TestBreakpointsWithNoTargets.py lldb-api :: commands/expression/completion/TestExprCompletion.py lldb-api :: commands/frame/diagnose/inheritance/TestDiagnoseInheritance.py lldb-api :: tools/lldb-server/platform-process-connect/TestPlatformProcessConnect.py lldb-api :: commands/expression/static-initializers/TestStaticInitializers.py lldb-api :: commands/register/register/intel_xtended_registers/mpx_bound_violation/TestBoundViolation.py lldb-api :: lang/objc/bitfield_ivars/TestBitfieldIvars.py lldb-api :: python_api/lldbutil/TestSwigVersion.py lldb-api :: macosx/order/TestOrderFile.py lldb-api :: functionalities/load_unload/TestLoadUnload.py lldb-api :: benchmarks/expression/TestRepeatedExprs.py lldb-api :: commands/target/create-deps/TestTargetCreateDeps.py lldb-api :: lang/cpp/incomplete-types/TestCppIncompleteTypes.py lldb-api :: python_api/findvalue_duplist/TestSBFrameFindValue.py lldb-api :: functionalities/data-formatter/data-formatter-objc/TestDataFormatterObjCNSContainer.py lldb-api :: lang/objc/hidden-ivars/TestHiddenIvars.py lldb-api :: commands/watchpoints/watchpoint_commands/command/TestWatchpointCommandLLDB.py lldb-api :: functionalities/thread/jump/TestThreadJump.py lldb-api :: functionalities/data-formatter/data-formatter-named-summaries/TestDataFormatterNamedSummaries.py lldb-api :: sanity/TestModuleCacheSanity.py lldb-api :: lang/c/array_types/TestArrayTypes.py lldb-api :: lang/cpp/class_types/TestClassTypesDisassembly.py lldb-api :: functionalities/inferior-assert/TestInferiorAssert.py lldb-api :: functionalities/thread/concurrent_events/TestConcurrentManySignals.py lldb-api :: functionalities/breakpoint/step_over_breakpoint/TestStepOverBreakpoint.py lldb-api :: lang/cpp/breakpoint-commands/TestCPPBreakpointCommands.py lldb-api :: functionalities/breakpoint/require_hw_breakpoints/TestRequireHWBreakpoints.py lldb-api :: commands/process/attach/attach_denied/TestAttachDenied.py lldb-api :: commands/frame/var-scope/TestFrameVariableScope.py lldb-api :: functionalities/data-formatter/data-formatter-stl/libcxx/variant/TestDataFormatterLibcxxVariant.py lldb-api :: python_api/exprpath_synthetic/TestExprPathSynthetic.py lldb-api :: commands/process/launch/TestProcessLaunch.py lldb-api :: macosx/lc-note/kern-ver-str/TestKernVerStrLCNOTE.py lldb-api :: python_api/signals/TestSignalsAPI.py lldb-api :: functionalities/tail_call_frames/disambiguate_tail_call_seq/TestDisambiguateTailCallSeq.py lldb-api :: functionalities/rerun/TestRerun.py lldb-api :: functionalities/memory-region/TestMemoryRegion.py lldb-api :: python_api/target/TestTargetAPI.py lldb-api :: lang/cpp/stl/TestStdCXXDisassembly.py lldb-api :: lang/cpp/virtual-overload/TestVirtualOverload.py lldb-api :: python_api/watchpoint/TestWatchpointIter.py lldb-api :: lang/objc/ivar-IMP/TestObjCiVarIMP.py lldb-api :: commands/expression/import-std-module/unique_ptr/TestUniquePtr.py lldb-api :: functionalities/var_path/TestVarPath.py lldb-api :: lang/objc/foundation/TestObjCMethods.py lldb-api :: commands/target/create-no-such-arch/TestNoSuchArch.py lldb-api :: tools/lldb-server/TestGdbRemoteProcessInfo.py lldb-api :: lang/objc/objc-runtime-ivars/TestRuntimeIvars.py lldb-api :: lang/objc/foundation/TestObjCMethodsNSError.py lldb-api :: functionalities/breakpoint/breakpoint_by_line_and_column/TestBreakpointByLineAndColumn.py lldb-api :: lang/cpp/unsigned_types/TestUnsignedTypes.py lldb-api :: lang/objc/objc++/TestObjCXX.py lldb-api :: source-manager/TestSourceManager.py lldb-api :: lang/cpp/gmodules/TestWithModuleDebugging.py lldb-api :: commands/expression/completion-crash2/TestCompletionCrash2.py lldb-api :: lang/objc/objc-super/TestObjCSuper.py lldb-api :: lang/objc/modules-auto-import/TestModulesAutoImport.py lldb-api :: commands/expression/calculator_mode/TestCalculatorMode.py lldb-api :: functionalities/data-formatter/data-formatter-stl/libcxx/multimap/TestDataFormatterLibccMultiMap.py lldb-api :: functionalities/data-formatter/data-formatter-stl/libcxx/string/TestDataFormatterLibcxxString.py lldb-api :: commands/expression/weak_symbols/TestWeakSymbols.py lldb-api :: commands/frame/select/TestFrameSelect.py lldb-api :: python_api/class_members/TestSBTypeClassMembers.py lldb-api :: api/command-return-object/TestSBCommandReturnObject.py lldb-api :: android/platform/TestDefaultCacheLineSize.py lldb-api :: macosx/thread-names/TestInterruptThreadNames.py lldb-api :: functionalities/darwin_log/filter/regex/activity-chain/TestDarwinLogFilterRegexActivityChain.py lldb-api :: functionalities/breakpoint/breakpoint_command/TestBreakpointCommand.py lldb-api :: functionalities/type_completion/TestTypeCompletion.py lldb-api :: benchmarks/libcxxmap/TestBenchmarkLibcxxMap.py lldb-api :: functionalities/archives/TestBSDArchives.py lldb-api :: lang/cpp/type_lookup/TestCppTypeLookup.py lldb-api :: functionalities/data-formatter/data-formatter-stl/libstdcpp/map/TestDataFormatterStdMap.py lldb-api :: functionalities/breakpoint/breakpoint_names/TestBreakpointNames.py lldb-api :: python_api/sblaunchinfo/TestSBLaunchInfo.py lldb-api :: functionalities/abbreviation/TestCommonShortSpellings.py lldb-api :: python_api/value/empty_class/TestValueAPIEmptyClass.py lldb-api :: commands/gui/invalid-args/TestInvalidArgsGui.py lldb-api :: lang/cpp/char1632_t/TestChar1632T.py lldb-api :: functionalities/tty/TestTerminal.py lldb-api :: functionalities/asan/TestReportData.py lldb-api :: functionalities/thread/multi_break/TestMultipleBreakpoints.py lldb-api :: functionalities/testid/TestTestId.py lldb-api :: commands/watchpoints/variable_out_of_scope/TestWatchedVarHitWhenInScope.py lldb-api :: functionalities/thread/backtrace_limit/TestBacktraceLimit.py lldb-api :: lang/objc/foundation/TestFoundationDisassembly.py lldb-api :: functionalities/inferior-crashing/TestInferiorCrashingStep.py lldb-api :: commands/expression/import-std-module/empty-module/TestEmptyStdModule.py lldb-api :: functionalities/gdb_remote_client/TestPlatformClient.py lldb-api :: lang/cpp/accelerator-table/TestCPPAccelerator.py lldb-api :: commands/expression/call-restarts/TestCallThatRestarts.py lldb-api :: functionalities/data-formatter/data-formatter-stl/libcxx/function/TestLibCxxFunction.py lldb-api :: tools/lldb-server/TestGdbRemote_qThreadStopInfo.py lldb-api :: functionalities/data-formatter/data-formatter-categories/TestDataFormatterCategories.py lldb-api :: commands/command/source/TestCommandSource.py lldb-api :: functionalities/thread/concurrent_events/TestConcurrentCrashWithWatchpointBreakpointSignal.py lldb-api :: types/TestIntegerTypes.py lldb-api :: commands/expression/cast_int_to_anonymous_enum/TestCastIntToAnonymousEnum.py lldb-api :: commands/expression/anonymous-struct/TestCallUserAnonTypedef.py lldb-api :: commands/expression/import-std-module/vector-basic/TestBasicVector.py lldb-api :: commands/command/delete/TestCommandDelete.py lldb-api :: functionalities/thread/concurrent_events/TestConcurrentTwoBreakpointsOneWatchpoint.py lldb-api :: macosx/load-kext/TestLoadKext.py lldb-api :: commands/expression/import-std-module/deque-dbg-info-content/TestDbgInfoContentDeque.py lldb-api :: functionalities/postmortem/elf-core/TestLinuxCore.py lldb-api :: functionalities/unwind/sigtramp/TestSigtrampUnwind.py lldb-api :: lang/c/forward/TestForwardDeclaration.py lldb-api :: lang/objc/radar-9691614/TestObjCMethodReturningBOOL.py lldb-api :: functionalities/darwin_log/filter/regex/subsystem/TestDarwinLogFilterRegexSubsystem.py lldb-api :: functionalities/postmortem/netbsd-core/TestNetBSDCore.py lldb-api :: lang/c/step-target/TestStepTarget.py lldb-api :: python_api/rdar-12481949/Test-rdar-12481949.py lldb-api :: python_api/sbtype_typeclass/TestSBTypeTypeClass.py lldb-api :: functionalities/data-formatter/data-formatter-objc/TestDataFormatterObjCKVO.py lldb-api :: lang/c/local_types/TestUseClosestType.py lldb-api :: commands/watchpoints/multiple_hits/TestMultipleHits.py lldb-api :: functionalities/data-formatter/data-formatter-disabling/TestDataFormatterDisabling.py lldb-api :: commands/expression/persistent_ptr_update/TestPersistentPtrUpdate.py lldb-api :: lang/objc/objc-new-syntax/TestObjCNewSyntaxArray.py lldb-api :: functionalities/data-formatter/data-formatter-stl/libcxx/multiset/TestDataFormatterLibcxxMultiSet.py lldb-api :: commands/expression/import-std-module/shared_ptr/TestSharedPtr.py lldb-api :: functionalities/breakpoint/address_breakpoints/TestAddressBreakpoints.py lldb-api :: functionalities/thread/crash_during_step/TestCrashDuringStep.py lldb-api :: functionalities/breakpoint/breakpoint_conditions/TestBreakpointConditions.py lldb-api :: python_api/process/TestProcessAPI.py lldb-api :: macosx/version_zero/TestGetVersionZeroVersion.py lldb-api :: functionalities/thread/concurrent_events/TestConcurrentDelaySignalWatch.py lldb-api :: commands/expression/import-std-module/list-basic/TestBasicList.py lldb-api :: commands/settings/TestSettings.py lldb-api :: python_api/symbol-context/two-files/TestSymbolContextTwoFiles.py lldb-api :: functionalities/data-formatter/data-formatter-objc/TestDataFormatterObjCCF.py lldb-api :: python_api/objc_type/TestObjCType.py lldb-api :: lang/objc/real-definition/TestRealDefinition.py lldb-api :: functionalities/stats_api/TestStatisticsAPI.py lldb-api :: commands/command/script_alias/TestCommandScriptAlias.py lldb-api :: commands/frame/diagnose/dereference-argument/TestDiagnoseDereferenceArgument.py lldb-api :: functionalities/thread/exit_during_break/TestExitDuringBreak.py lldb-api :: functionalities/thread/concurrent_events/TestConcurrentSignalBreak.py lldb-api :: functionalities/gdb_remote_client/TestThreadSelectionBug.py lldb-api :: functionalities/data-formatter/synthcapping/TestSyntheticCapping.py lldb-api :: functionalities/data-formatter/ptr_ref_typedef/TestPtrRef2Typedef.py lldb-api :: functionalities/float-display/TestFloatDisplay.py lldb-api :: lang/cpp/chained-calls/TestCppChainedCalls.py lldb-api :: commands/help/TestHelp.py lldb-api :: functionalities/darwin_log/filter/exact_match/activity/TestDarwinLogFilterMatchActivity.py lldb-api :: lang/c/set_values/TestSetValues.py lldb-api :: functionalities/data-formatter/data-formatter-stl/libcxx/unordered/TestDataFormatterUnordered.py lldb-api :: lang/objc/objc-static-method/TestObjCStaticMethod.py lldb-api :: functionalities/gdb_remote_client/TestWriteMemory.py lldb-api :: tools/lldb-server/commandline/TestStubReverseConnect.py lldb-api :: benchmarks/libcxxlist/TestBenchmarkLibcxxList.py lldb-api :: commands/expression/fixits/TestFixIts.py lldb-api :: tools/lldb-server/TestGdbRemoteHostInfo.py lldb-api :: lang/c/register_variables/TestRegisterVariables.py lldb-api :: lang/c/function_types/TestFunctionTypes.py lldb-api :: functionalities/data-formatter/data-formatter-stl/libcxx/atomic/TestLibCxxAtomic.py lldb-api :: functionalities/thread/concurrent_events/TestConcurrentDelayedCrashWithBreakpointWatchpoint.py lldb-api :: functionalities/thread/break_after_join/TestBreakAfterJoin.py lldb-api :: functionalities/darwin_log/filter/regex/activity/TestDarwinLogFilterRegexActivity.py lldb-api :: lang/c/shared_lib/TestSharedLib.py lldb-api :: functionalities/data-formatter/data-formatter-stl/libcxx/queue/TestDataFormatterLibcxxQueue.py lldb-api :: functionalities/darwin_log/filter/exact_match/category/TestDarwinLogFilterMatchCategory.py lldb-api :: lang/cpp/global_variables/TestCPPGlobalVariables.py lldb-api :: functionalities/thread/concurrent_events/TestConcurrentDelaySignalBreak.py lldb-api :: functionalities/data-formatter/data-formatter-stl/libstdcpp/iterator/TestDataFormatterStdIterator.py lldb-api :: functionalities/data-formatter/format-propagation/TestFormatPropagation.py lldb-api :: functionalities/plugins/command_plugin/TestPluginCommands.py lldb-api :: tools/lldb-server/TestGdbRemoteExitCode.py lldb-api :: commands/expression/unicode-in-variable/TestUnicodeInVariable.py lldb-api :: tools/lldb-vscode/breakpoint/TestVSCode_setFunctionBreakpoints.py lldb-api :: functionalities/thread/concurrent_events/TestConcurrentBreakpointsDelayedBreakpointOneWatchpoint.py lldb-api :: functionalities/conditional_break/TestConditionalBreak.py lldb-api :: functionalities/data-formatter/data-formatter-stl/libcxx/iterator/TestDataFormatterLibccIterator.py lldb-api :: macosx/universal/TestUniversal.py lldb-api :: lang/objc/objc-struct-return/TestObjCStructReturn.py lldb-api :: commands/expression/radar_9673664/TestExprHelpExamples.py lldb-api :: commands/expression/rdar44436068/Test128BitsInteger.py lldb-api :: functionalities/data-formatter/data-formatter-stl/libcxx/set/TestDataFormatterLibcxxSet.py lldb-api :: benchmarks/frame_variable/TestFrameVariableResponse.py lldb-api :: lang/c/blocks/TestBlocks.py lldb-api :: lang/objc/objc-builtin-types/TestObjCBuiltinTypes.py lldb-api :: commands/frame/diagnose/array/TestArray.py lldb-api :: python_api/sbvalue_const_addrof/TestSBValueConstAddrOf.py lldb-api :: functionalities/data-formatter/data-formatter-globals/TestDataFormatterGlobals.py lldb-api :: python_api/name_lookup/TestNameLookup.py lldb-api :: lang/objc/print-obj/TestPrintObj.py lldb-api :: functionalities/breakpoint/address_breakpoints/TestBadAddressBreakpoints.py lldb-api :: functionalities/data-formatter/data-formatter-stl/libstdcpp/vector/TestDataFormatterStdVector.py lldb-api :: functionalities/thread/concurrent_events/TestConcurrentSignalNWatchNBreak.py lldb-api :: functionalities/backticks/TestBackticksWithoutATarget.py lldb-api :: functionalities/return-value/TestReturnValue.py lldb-api :: lang/objc/objc-new-syntax/TestObjCNewSyntaxDictionary.py lldb-api :: python_api/function_symbol/TestSymbolAPI.py lldb-api :: lang/objc/exceptions/TestObjCExceptions.py lldb-api :: lang/c/typedef/Testtypedef.py lldb-api :: functionalities/darwin_log/filter/regex/category/TestDarwinLogFilterRegexCategory.py lldb-api :: lang/cpp/class_static/TestStaticVariables.py lldb-api :: functionalities/unwind/noreturn/module-end/TestNoReturnModuleEnd.py lldb-api :: commands/expression/radar_8638051/Test8638051.py lldb-api :: functionalities/data-formatter/data-formatter-stl/libcxx/map/TestDataFormatterLibccMap.py lldb-api :: lang/cpp/scope/TestCppScope.py lldb-api :: functionalities/breakpoint/breakpoint_ignore_count/TestBreakpointIgnoreCount.py lldb-api :: functionalities/memory/read/TestMemoryRead.py lldb-api :: functionalities/data-formatter/vector-types/TestVectorTypesFormatting.py lldb-api :: commands/target/dump-symtab-demangle/TestDumpSymtabDemangle.py lldb-api :: lang/objc/objc-property/TestObjCProperty.py lldb-api :: commands/source/info/TestSourceInfo.py lldb-api :: lang/objcxx/objcxx-ivar-vector/TestIvarVector.py lldb-api :: functionalities/signal/handle-abrt/TestHandleAbort.py lldb-api :: tools/lldb-vscode/breakpoint/TestVSCode_setExceptionBreakpoints.py lldb-api :: functionalities/asan/TestMemoryHistory.py lldb-api :: commands/expression/namespace_local_var_same_name_obj_c/TestNamespaceLocalVarSameNameObjC.py lldb-api :: commands/expression/call-function/TestCallBuiltinFunction.py lldb-api :: functionalities/thread/exit_during_step/TestExitDuringStep.py lldb-api :: commands/expression/rdar42038760/TestScalarURem.py lldb-api :: lang/c/bitfields/TestBitfields.py lldb-api :: functionalities/dynamic_value_child_count/TestDynamicValueChildCount.py lldb-api :: functionalities/thread/concurrent_events/TestConcurrentSignalWatch.py lldb-api :: commands/frame/diagnose/local-variable/TestLocalVariable.py lldb-api :: functionalities/history/TestHistoryRecall.py lldb-api :: lang/c/shared_lib_stripped_symbols/TestSharedLibStrippedSymbols.py lldb-api :: functionalities/breakpoint/breakpoint_command/TestBreakpointCommandsFromPython.py lldb-api :: functionalities/data-formatter/hexcaps/TestDataFormatterHexCaps.py lldb-api :: commands/expression/function_template_specialization_temp_args/TestFunctionTemplateSpecializationTempArgs.py lldb-api :: sample_test/TestSampleInlineTest.py lldb-api :: lang/objc/forward-decl/TestForwardDecl.py lldb-api :: macosx/nslog/TestDarwinNSLogOutput.py lldb-api :: lang/c/global_variables/TestGlobalVariables.py lldb-api :: types/TestDoubleTypesExpr.py lldb-api :: functionalities/data-formatter/stringprinter/TestStringPrinter.py lldb-api :: functionalities/breakpoint/debugbreak/TestDebugBreak.py lldb-api :: lang/cpp/class_types/TestClassTypes.py lldb-api :: tools/lldb-server/TestGdbRemoteModuleInfo.py lldb-api :: commands/expression/save_jit_objects/TestSaveJITObjects.py lldb-api :: lang/objc/blocks/TestObjCIvarsInBlocks.py lldb-api :: functionalities/data-formatter/data-formatter-objc/TestDataFormatterObjCNSDate.py lldb-api :: api/multiple-targets/TestMultipleTargets.py lldb-api :: tools/lldb-server/register-reading/TestGdbRemoteGPacket.py lldb-api :: lang/objc/objc-new-syntax/TestObjCNewSyntaxLiteral.py lldb-api :: linux/sepdebugsymlink/TestTargetSymbolsSepDebugSymlink.py lldb-api :: arm/breakpoint-thumb-codesection/TestBreakpointThumbCodesection.py lldb-api :: functionalities/breakpoint/objc/TestObjCBreakpoints.py lldb-api :: functionalities/data-formatter/data-formatter-objc/TestDataFormatterObjCNSData.py lldb-api :: lang/c/stepping/TestStepAndBreakpoints.py lldb-api :: tools/lldb-server/TestAppleSimulatorOSType.py lldb-api :: functionalities/breakpoint/breakpoint_hit_count/TestBreakpointHitCount.py lldb-api :: commands/process/attach-resume/TestAttachResume.py lldb-api :: lang/objc/foundation/TestRuntimeTypes.py lldb-api :: functionalities/breakpoint/breakpoint_locations/TestBreakpointLocations.py lldb-api :: python_api/default-constructor/TestDefaultConstructorForAPIObjects.py lldb-api :: lang/cpp/virtual/TestVirtual.py lldb-api :: lang/c/strings/TestCStrings.py lldb-api :: functionalities/data-formatter/data-formatter-script/TestDataFormatterScript.py lldb-api :: functionalities/breakpoint/breakpoint_command/TestRegexpBreakCommand.py lldb-api :: functionalities/darwin_log/filter/exact_match/activity-chain/TestDarwinLogFilterMatchActivityChain.py lldb-api :: functionalities/gdb_remote_client/TestNoWatchpointSupportInfo.py lldb-api :: tools/lldb-server/inferior-crash/TestGdbRemoteSegFault.py lldb-api :: tools/lldb-server/TestGdbRemoteThreadsInStopReply.py lldb-api :: commands/expression/persist_objc_pointeetype/TestPersistObjCPointeeType.py lldb-api :: commands/watchpoints/hello_watchpoint/TestMyFirstWatchpoint.py lldb-api :: lang/objc/conflicting-definition/TestConflictingDefinition.py lldb-api :: lang/cpp/template-function/TestTemplateFunctions.py lldb-api :: lang/cpp/inlines/TestInlines.py lldb-api :: lang/objc/ptr_refs/TestPtrRefsObjC.py lldb-api :: commands/watchpoints/watchpoint_set_command/TestWatchLocationWithWatchSet.py lldb-api :: functionalities/exec/TestExec.py lldb-api :: commands/expression/completion-crash1/TestCompletionCrash1.py lldb-api :: functionalities/thread/concurrent_events/TestConcurrentDelayedCrashWithBreakpointSignal.py lldb-api :: lang/cpp/call-function/TestCallCPPFunction.py lldb-api :: commands/expression/scoped_enums/TestScopedEnumType.py lldb-api :: functionalities/data-formatter/typedef_array/TestTypedefArray.py lldb-api :: functionalities/data-formatter/nsarraysynth/TestNSArraySynthetic.py lldb-api :: functionalities/thread/concurrent_events/TestConcurrentWatchpointWithDelayWatchpointThreads.py lldb-api :: commands/expression/import-std-module/conflicts/TestStdModuleWithConflicts.py lldb-api :: functionalities/breakpoint/cpp/TestCPPBreakpointLocations.py lldb-api :: lang/objc/foundation/TestObjCMethodsString.py lldb-api :: functionalities/breakpoint/breakpoint_in_delayslot/TestAvoidBreakpointInDelaySlot.py lldb-api :: arm/emulation/TestEmulations.py lldb-api :: functionalities/tail_call_frames/sbapi_support/TestTailCallFrameSBAPI.py lldb-api :: functionalities/data-formatter/pyobjsynthprovider/TestPyObjSynthProvider.py lldb-api :: lang/cpp/unicode-literals/TestUnicodeLiterals.py lldb-api :: lang/c/const_variables/TestConstVariables.py lldb-api :: lang/cpp/limit-debug-info/TestWithLimitDebugInfo.py lldb-api :: python_api/lldbutil/iter/TestRegistersIterator.py lldb-api :: functionalities/data-formatter/poarray/TestPrintObjectArray.py lldb-api :: commands/expression/diagnostics/TestExprDiagnostics.py lldb-api :: types/TestRecursiveTypes.py lldb-api :: commands/expression/context-object/TestContextObject.py lldb-api :: commands/expression/entry-bp/TestExprEntryBP.py lldb-api :: commands/reproducer/invalid-args/TestInvalidArgsReproducer.py lldb-api :: functionalities/gdb_remote_client/TestArmRegisterDefinition.py lldb-api :: python_api/watchpoint/watchlocation/TestSetWatchlocation.py lldb-api :: functionalities/data-formatter/user-format-vs-summary/TestUserFormatVsSummary.py lldb-api :: lang/cpp/llvm-style/TestLLVMStyle.py lldb-api :: commands/expression/dollar-in-variable/TestDollarInVariable.py lldb-api :: commands/expression/import-std-module/weak_ptr/TestWeakPtr.py lldb-api :: functionalities/thread/concurrent_events/TestConcurrentBreakpointOneDelayBreakpointThreads.py lldb-api :: commands/gui/basic/TestGuiBasic.py lldb-api :: lang/cpp/overloaded-functions/TestOverloadedFunctions.py lldb-api :: lang/objc/global_ptrs/TestGlobalObjects.py lldb-api :: commands/expression/persistent_variables/TestPersistentVariables.py lldb-api :: commands/expression/issue_11588/Test11588.py lldb-api :: lang/cpp/gmodules-templates/TestGModules.py lldb-api :: functionalities/data-formatter/data-formatter-synthval/TestDataFormatterSynthVal.py lldb-api :: python_api/watchpoint/TestSetWatchpoint.py lldb-api :: python_api/sbdata/TestSBData.py lldb-api :: functionalities/thread/concurrent_events/TestConcurrentTwoBreakpointsOneSignal.py lldb-api :: functionalities/inferior-crashing/recursive-inferior/TestRecursiveInferior.py lldb-api :: functionalities/darwin_log/source/debug/TestDarwinLogSourceDebug.py lldb-api :: functionalities/thread/thread_specific_break/TestThreadSpecificBreakpoint.py lldb-api :: macosx/indirect_symbol/TestIndirectSymbols.py lldb-api :: functionalities/data-formatter/synthupdate/TestSyntheticFilterRecompute.py lldb-api :: lang/c/vla/TestVLA.py lldb-api :: commands/expression/import-std-module/weak_ptr-dbg-info-content/TestDbgInfoContentWeakPtr.py lldb-api :: linux/thread/create_during_instruction_step/TestCreateDuringInstructionStep.py lldb-api :: commands/expression/ir-interpreter-phi-nodes/TestIRInterpreterPHINodes.py lldb-api :: functionalities/thread/concurrent_events/TestConcurrentManyBreakpoints.py lldb-api :: benchmarks/continue/TestBenchmarkContinue.py lldb-api :: functionalities/data-formatter/setvaluefromcstring/TestSetValueFromCString.py lldb-api :: commands/expression/import-std-module/forward_list-basic/TestBasicForwardList.py lldb-api :: functionalities/thread/thread_exit/TestThreadExit.py lldb-api :: functionalities/breakpoint/breakpoint_ids/TestBreakpointIDs.py lldb-api :: types/TestIntegerTypesExpr.py lldb-api :: commands/expression/top-level/TestTopLevelExprs.py lldb-api :: commands/add-dsym/uuid/TestAddDsymCommand.py lldb-api :: functionalities/inferior-crashing/TestInferiorCrashing.py lldb-api :: functionalities/breakpoint/breakpoint_language/TestBreakpointLanguage.py lldb-api :: commands/expression/call-function/TestCallUserDefinedFunction.py lldb-api :: functionalities/tsan/thread_numbers/TestTsanThreadNumbers.py lldb-api :: commands/expression/no-deadlock/TestExprDoesntBlock.py lldb-api :: functionalities/unwind/noreturn/TestNoreturnUnwind.py lldb-api :: commands/expression/import-std-module/basic/TestImportStdModule.py lldb-api :: functionalities/darwin_log/basic/TestDarwinLogBasic.py lldb-api :: functionalities/darwin_log/filter/regex/message/TestDarwinLogFilterRegexMessage.py lldb-api :: functionalities/data-formatter/data-formatter-stl/libcxx/list/loop/TestDataFormatterLibcxxListLoop.py lldb-api :: commands/expression/import-std-module/stack/TestStack.py lldb-api :: functionalities/object-file/TestImageListMultiArchitecture.py lldb-api :: types/TestFloatTypesExpr.py lldb-api :: python_api/module_section/TestModuleAndSection.py lldb-api :: functionalities/data-formatter/data-formatter-ptr-to-array/TestPtrToArrayFormatting.py lldb-api :: functionalities/postmortem/wow64_minidump/TestWow64MiniDump.py lldb-api :: functionalities/data-formatter/nssetsynth/TestNSSetSynthetic.py lldb-api :: functionalities/tail_call_frames/inlining_and_tail_calls/TestInliningAndTailCalls.py lldb-api :: functionalities/value_md5_crash/TestValueMD5Crash.py lldb-api :: lang/cpp/namespace/TestNamespaceLookup.py lldb-api :: commands/watchpoints/watchpoint_commands/command/TestWatchpointCommandPython.py lldb-api :: functionalities/set-data/TestSetData.py lldb-api :: functionalities/ubsan/user-expression/TestUbsanUserExpression.py lldb-api :: functionalities/data-formatter/data-formatter-advanced/TestDataFormatterAdv.py lldb-api :: functionalities/inferior-changed/TestInferiorChanged.py lldb-api :: commands/expression/call-function/TestCallStopAndContinue.py lldb-api :: lang/cpp/unique-types/TestUniqueTypes.py lldb-api :: lang/cpp/extern_c/TestExternCSymbols.py lldb-api :: tools/lldb-vscode/breakpoint/TestVSCode_setBreakpoints.py lldb-api :: functionalities/modern-type-lookup/objc-modules/TestObjModulesModernTypeLookup.py lldb-api :: commands/expression/import-std-module/forward_list-dbg-info-content/TestDbgInfoContentForwardList.py lldb-api :: lang/cpp/static_members/TestCPPStaticMembers.py lldb-api :: functionalities/data-formatter/data-formatter-cpp/TestDataFormatterCpp.py lldb-api :: commands/frame/diagnose/bad-reference/TestBadReference.py lldb-api :: commands/expression/import-std-module/deque-basic/TestBasicDeque.py lldb-api :: lang/cpp/char8_t/TestCxxChar8_t.py lldb-api :: commands/expression/import-std-module/no-std-module/TestMissingStdModule.py lldb-api :: functionalities/breakpoint/comp_dir_symlink/TestCompDirSymLink.py lldb-api :: functionalities/breakpoint/inlined_breakpoints/TestInlinedBreakpoints.py lldb-api :: commands/log/invalid-args/TestInvalidArgsLog.py lldb-api :: commands/frame/diagnose/complicated-expression/TestComplicatedExpression.py lldb-api :: functionalities/gdb_remote_client/TestGDBRemoteClient.py lldb-api :: python_api/disassemble-raw-data/TestDisassemble_VST1_64.py lldb-api :: commands/expression/pr35310/TestExprsBug35310.py lldb-api :: functionalities/gdb_remote_client/TestNoGPacketSupported.py lldb-api :: commands/expression/test/TestExprs2.py lldb-api :: functionalities/tsan/cpp_global_location/TestTsanCPPGlobalLocation.py lldb-api :: commands/expression/vector_of_enums/TestVectorOfEnums.py lldb-api :: functionalities/data-formatter/parray/TestPrintArray.py lldb-api :: lang/cpp/dynamic-value/TestCppValueCast.py lldb-api :: functionalities/breakpoint/global_constructor/TestBreakpointInGlobalConstructor.py lldb-api :: functionalities/data-formatter/data-formatter-stl/libstdcpp/vbool/TestDataFormatterStdVBool.py lldb-api :: functionalities/thread/concurrent_events/TestConcurrentWatchBreak.py lldb-api :: functionalities/thread/thread_specific_break_plus_condition/TestThreadSpecificBpPlusCondition.py lldb-api :: lang/objc/foundation/TestObjCMethods2.py lldb-api :: python_api/watchpoint/TestWatchpointIgnoreCount.py lldb-api :: functionalities/data-formatter/data-formatter-stl/libcxx/initializerlist/TestInitializerList.py lldb-api :: tools/lldb-server/thread-name/TestGdbRemoteThreadName.py lldb-api :: commands/expression/options/TestExprOptions.py lldb-api :: commands/disassemble/basic/TestFrameDisassemble.py lldb-api :: functionalities/breakpoint/breakpoint_options/TestBreakpointOptions.py lldb-api :: lang/cpp/namespace/TestNamespace.py lldb-api :: lang/objc/foundation/TestConstStrings.py lldb-api :: functionalities/gdb_remote_client/TestGDBRemoteLoad.py lldb-api :: functionalities/tsan/global_location/TestTsanGlobalLocation.py lldb-api :: commands/expression/macros/TestMacros.py lldb-api :: linux/mix-dwo-and-regular-objects/TestMixedDwarfBinary.py lldb-api :: commands/expression/char/TestExprsChar.py lldb-api :: lang/cpp/dynamic-value-same-basename/TestDynamicValueSameBase.py lldb-api :: functionalities/thread/step_until/TestStepUntil.py lldb-api :: commands/expression/completion-crash-incomplete-record/TestCompletionCrashIncompleteRecord.py lldb-api :: commands/watchpoints/watchpoint_commands/TestWatchpointCommands.py lldb-api :: functionalities/data-formatter/data-formatter-stl/libstdcpp/unique_ptr/TestDataFormatterStdUniquePtr.py lldb-api :: commands/expression/multiline-completion/TestMultilineCompletion.py lldb-api :: tools/lldb-server/TestGdbRemoteKill.py lldb-api :: lang/objc/objc-foundation-dictionary-empty/TestNSDictionary0.py lldb-api :: functionalities/data-formatter/data-formatter-objc/nsstring/TestDataFormatterNSString.py lldb-api :: functionalities/breakpoint/auto_continue/TestBreakpointAutoContinue.py lldb-api :: lang/objc/unicode-string/TestUnicodeString.py lldb-api :: macosx/find-app-in-bundle/TestFindAppInBundle.py lldb-api :: functionalities/thread/concurrent_events/TestConcurrentWatchBreakDelay.py lldb-api :: functionalities/unwind/ehframe/TestEhFrameUnwind.py lldb-api :: functionalities/data-formatter/data-formatter-objc/TestDataFormatterObjCNSBundle.py lldb-api :: lang/objc/objc-ivar-stripped/TestObjCIvarStripped.py lldb-api :: functionalities/tsan/multiple/TestTsanMultiple.py lldb-api :: tools/lldb-server/libraries-svr4/TestGdbRemoteLibrariesSvr4Support.py lldb-api :: lang/cpp/stl/TestSTL.py lldb-api :: commands/expression/import-std-module/sysroot/TestStdModuleSysroot.py lldb-api :: python_api/formatters/TestFormattersSBAPI.py lldb-api :: commands/frame/diagnose/virtual-method-call/TestDiagnoseDereferenceVirtualMethodCall.py lldb-api :: functionalities/breakpoint/source_regexp/TestSourceRegexBreakpoints.py lldb-api :: commands/register/register/intel_xtended_registers/mpx_offset_intersection/TestMPXOffsetIntersection.py lldb-api :: lang/c/conflicting-symbol/TestConflictingSymbol.py lldb-api :: commands/expression/completion-in-lambda-and-unnnamed-class/TestCompletionInLambdaAndUnnamedClass.py lldb-api :: python_api/thread/TestThreadAPI.py lldb-api :: lang/cpp/lambdas/TestLambdas.py lldb-api :: lang/objc/objc-checker/TestObjCCheckers.py lldb-api :: functionalities/type_lookup/TestTypeLookup.py lldb-api :: lang/cpp/dynamic-value/TestDynamicValue.py lldb-api :: lang/objc/modules-incomplete/TestIncompleteModules.py lldb-api :: lang/cpp/enum_types/TestCPP11EnumTypes.py lldb-api :: python_api/value/TestValueAPI.py lldb-api :: functionalities/data-formatter/data-formatter-objc/TestDataFormatterObjCNSURL.py lldb-api :: commands/expression/import-std-module/list-dbg-info-content/TestDbgInfoContentList.py lldb-api :: api/check_public_api_headers/TestPublicAPIHeaders.py lldb-api :: commands/expression/import-std-module/queue/TestQueue.py lldb-api :: functionalities/data-formatter/var-in-aggregate-misuse/TestVarInAggregateMisuse.py lldb-api :: lang/objc/objc-struct-argument/TestObjCStructArgument.py lldb-api :: api/multithreaded/TestMultithreaded.py lldb-api :: functionalities/data-formatter/data-formatter-python-synth/TestDataFormatterPythonSynth.py lldb-api :: commands/frame/diagnose/dereference-function-return/TestDiagnoseDereferenceFunctionReturn.py lldb-api :: functionalities/data-formatter/data-formatter-stl/libstdcpp/string/TestDataFormatterStdString.py lldb-api :: functionalities/signal/raise/TestRaise.py lldb-api :: functionalities/avoids-fd-leak/TestFdLeak.py lldb-api :: lang/cpp/template/TestTemplateArgs.py lldb-api :: python_api/process/io/TestProcessIO.py lldb-api :: lang/c/inlines/TestRedefinitionsInInlines.py lldb-api :: commands/apropos/with-process/TestAproposWithProcess.py lldb-api :: functionalities/target-new-solib-notifications/TestModuleLoadedNotifys.py lldb-api :: tools/lldb-server/TestLldbGdbServer.py lldb-api :: linux/add-symbols/TestTargetSymbolsAddCommand.py lldb-api :: python_api/value/linked_list/TestValueAPILinkedList.py lldb-api :: functionalities/data-formatter/data-formatter-synthtype/TestDataFormatterSynthType.py lldb-api :: commands/expression/call-overridden-method/TestCallOverriddenMethod.py lldb-api :: arm/breakpoint-it/TestBreakpointIt.py

Hide Details

Hide Details

Slowest Tests: -------------------------------------------------------------------------- 24.57s: lldb-shell :: SymbolFile/DWARF/find-variable-dwo.cpp 24.58s: lldb-shell :: SymbolFile/DWARF/compilercontext.ll 25.08s: lldb-shell :: Reproducer/TestFileRepro.test 25.42s: lldb-shell :: Process/TestEnvironment.test 26.04s: lldb-shell :: Reproducer/Functionalities/TestExpressionEvaluation.test 28.11s: lldb-shell :: Reproducer/Modules/TestModuleCXX.test 29.92s: lldb-shell :: SymbolFile/DWARF/debug-types-missing-signature.test 30.69s: lldb-shell :: SymbolFile/DWARF/find-function-regex.cpp 32.11s: lldb-shell :: ObjectFile/Breakpad/breakpad-identification.test 36.84s: lldb-shell :: ExecControl/StopHook/stop-hook.test 38.17s: lldb-shell :: Reproducer/TestDump.test 45.01s: lldb-shell :: SymbolFile/DWARF/debug-types-basic.test 51.06s: lldb-shell :: SymbolFile/DWARF/find-basic-type.cpp 53.33s: lldb-shell :: SymbolFile/DWARF/find-basic-namespace.cpp 54.57s: lldb-shell :: Minidump/fb-dump.test 59.61s: lldb-shell :: SymbolFile/DWARF/find-variable-file.cpp 67.05s: lldb-shell :: SymbolFile/DWARF/find-basic-variable.cpp 71.08s: lldb-shell :: Expr/TestIRMemoryMap.test 90.06s: lldb-shell :: SymbolFile/DWARF/find-basic-function.cpp 95.94s: lldb-shell :: Minidump/dump-all.test

Hide Details

Tests Times: -------------------------------------------------------------------------- [ Range ] :: [ Percentage ] :: [ Count ] -------------------------------------------------------------------------- [ 0.0s, 5.0s) :: [****************** ] :: [ 847/1799] [ 5.0s,10.0s) :: [******************* ] :: [ 863/1799] [10.0s,15.0s) :: [ ] :: [ 42/1799] [15.0s,20.0s) :: [ ] :: [ 14/1799] [20.0s,25.0s) :: [ ] :: [ 11/1799] [25.0s,30.0s) :: [ ] :: [ 8/1799] [30.0s,35.0s) :: [ ] :: [ 3/1799] [35.0s,40.0s) :: [ ] :: [ 2/1799] [40.0s,45.0s) :: [ ] :: [ 0/1799] [45.0s,50.0s) :: [ ] :: [ 1/1799] [50.0s,55.0s) :: [ ] :: [ 1/1799] [55.0s,60.0s) :: [ ] :: [ 2/1799] [60.0s,65.0s) :: [ ] :: [ 1/1799] [65.0s,70.0s) :: [ ] :: [ 1/1799] [70.0s,75.0s) :: [ ] :: [ 1/1799] [75.0s,80.0s) :: [ ] :: [ 0/1799] [80.0s,85.0s) :: [ ] :: [ 0/1799] [85.0s,90.0s) :: [ ] :: [ 0/1799] [90.0s,95.0s) :: [ ] :: [ 1/1799] [95.0s,100.0s) :: [ ] :: [ 1/1799] Expected Passes : 975 Expected Failures : 6 Unsupported Tests : 51 Unresolved Tests : 767 FAILED: tools/lldb/test/CMakeFiles/check-lldb-lit cd /Users/buildslave/jenkins/workspace/lldb-cmake-sanitized/lldb-build/tools/lldb/test && /usr/local/bin/python /Users/buildslave/jenkins/workspace/lldb-cmake-sanitized/lldb-build/./bin/llvm-lit -v --time-tests --shuffle --xunit-xml-output=/Users/buildslave/jenkins/workspace/lldb-cmake-sanitized/test/results.xml -v --timeout 1200 /Users/buildslave/jenkins/workspace/lldb-cmake-sanitized/lldb-build/tools/lldb/test ninja: build stopped: subcommand failed. Command failed: Command '['/usr/bin/env', 'TERM=vt100', '/usr/local/bin/ninja', '-v', 'check-lldb']' returned non-zero exit status 1. Command: ['/usr/bin/env', 'TERM=vt100', '/usr/local/bin/ninja', '-v', 'check-lldb'] [Pipeline] } [Pipeline] // timeout [Pipeline] } [Pipeline] // stage [Pipeline] stage [Pipeline] { (Declarative: Post Actions) [Pipeline] scanForIssues No credentials specified [Clang (LLVM based)] Sleeping for 5 seconds due to JENKINS-32191... [Clang (LLVM based)] Parsing console log (workspace: '/Users/buildslave/jenkins/workspace/lldb-cmake-sanitized') [Pipeline] junit Recording test results [Pipeline] } [Pipeline] // stage [Pipeline] } [Pipeline] // withEnv [Pipeline] } [Pipeline] // node [Pipeline] End of Pipeline [BFA] Scanning build for known causes... [BFA] Found failure cause(s): [BFA] Ninja target failed from category Compile [BFA] Regression test failed from category Test [BFA] Done. 0s ERROR: script returned exit code 1 Finished: FAILURE