FailedConsole Output

Skipping 27 KB.. Full Log
 -isysroot /Applications/Xcode.app/Contents/Developer/Platforms/MacOSX.platform/Developer/SDKs/MacOSX10.15.sdk    -fno-exceptions -fno-rtti -UNDEBUG -std=c++14 -MD -MT tools/lld/COFF/CMakeFiles/lldCOFF.dir/MarkLive.cpp.o -MF tools/lld/COFF/CMakeFiles/lldCOFF.dir/MarkLive.cpp.o.d -o tools/lld/COFF/CMakeFiles/lldCOFF.dir/MarkLive.cpp.o -c /Users/buildslave/jenkins/workspace/lldb-cmake/llvm-project/lld/COFF/MarkLive.cpp
[2/1351] /Users/buildslave/jenkins/workspace/lldb-cmake/host-compiler/bin/clang++  -DGTEST_HAS_RTTI=0 -D_DEBUG -D__STDC_CONSTANT_MACROS -D__STDC_FORMAT_MACROS -D__STDC_LIMIT_MACROS -Itools/lld/COFF -I/Users/buildslave/jenkins/workspace/lldb-cmake/llvm-project/lld/COFF -I/Users/buildslave/jenkins/workspace/lldb-cmake/llvm-project/lld/include -Itools/lld/include -I/Applications/Xcode.app/Contents/Developer/Platforms/MacOSX.platform/Developer/SDKs/MacOSX10.15.sdk/usr/include/libxml2 -Iinclude -I/Users/buildslave/jenkins/workspace/lldb-cmake/llvm-project/llvm/include -Wdocumentation -fPIC -fvisibility-inlines-hidden -Werror=date-time -Werror=unguarded-availability-new -fmodules -fmodules-cache-path=/Users/buildslave/jenkins/workspace/lldb-cmake/lldb-build/module.cache -fcxx-modules -Xclang -fmodules-local-submodule-visibility -Wall -Wextra -Wno-unused-parameter -Wwrite-strings -Wcast-qual -Wmissing-field-initializers -pedantic -Wno-long-long -Wimplicit-fallthrough -Wcovered-switch-default -Wno-noexcept-type -Wnon-virtual-dtor -Wdelete-non-virtual-dtor -Wstring-conversion -fdiagnostics-color -O3  -isysroot /Applications/Xcode.app/Contents/Developer/Platforms/MacOSX.platform/Developer/SDKs/MacOSX10.15.sdk    -fno-exceptions -fno-rtti -UNDEBUG -std=c++14 -MD -MT tools/lld/COFF/CMakeFiles/lldCOFF.dir/MinGW.cpp.o -MF tools/lld/COFF/CMakeFiles/lldCOFF.dir/MinGW.cpp.o.d -o tools/lld/COFF/CMakeFiles/lldCOFF.dir/MinGW.cpp.o -c /Users/buildslave/jenkins/workspace/lldb-cmake/llvm-project/lld/COFF/MinGW.cpp
[3/1351] /Users/buildslave/jenkins/workspace/lldb-cmake/host-compiler/bin/clang++  -DGTEST_HAS_RTTI=0 -D_DEBUG -D__STDC_CONSTANT_MACROS -D__STDC_FORMAT_MACROS -D__STDC_LIMIT_MACROS -Itools/lld/COFF -I/Users/buildslave/jenkins/workspace/lldb-cmake/llvm-project/lld/COFF -I/Users/buildslave/jenkins/workspace/lldb-cmake/llvm-project/lld/include -Itools/lld/include -I/Applications/Xcode.app/Contents/Developer/Platforms/MacOSX.platform/Developer/SDKs/MacOSX10.15.sdk/usr/include/libxml2 -Iinclude -I/Users/buildslave/jenkins/workspace/lldb-cmake/llvm-project/llvm/include -Wdocumentation -fPIC -fvisibility-inlines-hidden -Werror=date-time -Werror=unguarded-availability-new -fmodules -fmodules-cache-path=/Users/buildslave/jenkins/workspace/lldb-cmake/lldb-build/module.cache -fcxx-modules -Xclang -fmodules-local-submodule-visibility -Wall -Wextra -Wno-unused-parameter -Wwrite-strings -Wcast-qual -Wmissing-field-initializers -pedantic -Wno-long-long -Wimplicit-fallthrough -Wcovered-switch-default -Wno-noexcept-type -Wnon-virtual-dtor -Wdelete-non-virtual-dtor -Wstring-conversion -fdiagnostics-color -O3  -isysroot /Applications/Xcode.app/Contents/Developer/Platforms/MacOSX.platform/Developer/SDKs/MacOSX10.15.sdk    -fno-exceptions -fno-rtti -UNDEBUG -std=c++14 -MD -MT tools/lld/COFF/CMakeFiles/lldCOFF.dir/Symbols.cpp.o -MF tools/lld/COFF/CMakeFiles/lldCOFF.dir/Symbols.cpp.o.d -o tools/lld/COFF/CMakeFiles/lldCOFF.dir/Symbols.cpp.o -c /Users/buildslave/jenkins/workspace/lldb-cmake/llvm-project/lld/COFF/Symbols.cpp
While building module 'LLVM_Utils' imported from /Users/buildslave/jenkins/workspace/lldb-cmake/llvm-project/lld/COFF/Config.h:12:
In file included from <module-includes>:8:
/Users/buildslave/jenkins/workspace/lldb-cmake/llvm-project/llvm/include/llvm/ADT/Bitfields.h:215:8: warning: '\param' command used in a comment that is not attached to a function declaration [-Wdocumentation]
  /// \param T, the type of the field once in unpacked form,
       ^~~~~
/Users/buildslave/jenkins/workspace/lldb-cmake/llvm-project/llvm/include/llvm/ADT/Bitfields.h:216:8: warning: '\param' command used in a comment that is not attached to a function declaration [-Wdocumentation]
  /// \param Offset, the position of the first bit,
       ^~~~~
/Users/buildslave/jenkins/workspace/lldb-cmake/llvm-project/llvm/include/llvm/ADT/Bitfields.h:217:8: warning: '\param' command used in a comment that is not attached to a function declaration [-Wdocumentation]
  /// \param Size, the size of the field,
       ^~~~~
/Users/buildslave/jenkins/workspace/lldb-cmake/llvm-project/llvm/include/llvm/ADT/Bitfields.h:218:8: warning: '\param' command used in a comment that is not attached to a function declaration [-Wdocumentation]
  /// \param MaxValue, For enums the maximum enum allowed.
       ^~~~~
4 warnings generated.
[4/1351] /Users/buildslave/jenkins/workspace/lldb-cmake/host-compiler/bin/clang++  -DGTEST_HAS_RTTI=0 -D_DEBUG -D__STDC_CONSTANT_MACROS -D__STDC_FORMAT_MACROS -D__STDC_LIMIT_MACROS -Itools/lld/COFF -I/Users/buildslave/jenkins/workspace/lldb-cmake/llvm-project/lld/COFF -I/Users/buildslave/jenkins/workspace/lldb-cmake/llvm-project/lld/include -Itools/lld/include -I/Applications/Xcode.app/Contents/Developer/Platforms/MacOSX.platform/Developer/SDKs/MacOSX10.15.sdk/usr/include/libxml2 -Iinclude -I/Users/buildslave/jenkins/workspace/lldb-cmake/llvm-project/llvm/include -Wdocumentation -fPIC -fvisibility-inlines-hidden -Werror=date-time -Werror=unguarded-availability-new -fmodules -fmodules-cache-path=/Users/buildslave/jenkins/workspace/lldb-cmake/lldb-build/module.cache -fcxx-modules -Xclang -fmodules-local-submodule-visibility -Wall -Wextra -Wno-unused-parameter -Wwrite-strings -Wcast-qual -Wmissing-field-initializers -pedantic -Wno-long-long -Wimplicit-fallthrough -Wcovered-switch-default -Wno-noexcept-type -Wnon-virtual-dtor -Wdelete-non-virtual-dtor -Wstring-conversion -fdiagnostics-color -O3  -isysroot /Applications/Xcode.app/Contents/Developer/Platforms/MacOSX.platform/Developer/SDKs/MacOSX10.15.sdk    -fno-exceptions -fno-rtti -UNDEBUG -std=c++14 -MD -MT tools/lld/COFF/CMakeFiles/lldCOFF.dir/LLDMapFile.cpp.o -MF tools/lld/COFF/CMakeFiles/lldCOFF.dir/LLDMapFile.cpp.o.d -o tools/lld/COFF/CMakeFiles/lldCOFF.dir/LLDMapFile.cpp.o -c /Users/buildslave/jenkins/workspace/lldb-cmake/llvm-project/lld/COFF/LLDMapFile.cpp
[5/1351] /Users/buildslave/jenkins/workspace/lldb-cmake/host-compiler/bin/clang++  -DGTEST_HAS_RTTI=0 -D_DEBUG -D__STDC_CONSTANT_MACROS -D__STDC_FORMAT_MACROS -D__STDC_LIMIT_MACROS -Itools/lld/COFF -I/Users/buildslave/jenkins/workspace/lldb-cmake/llvm-project/lld/COFF -I/Users/buildslave/jenkins/workspace/lldb-cmake/llvm-project/lld/include -Itools/lld/include -I/Applications/Xcode.app/Contents/Developer/Platforms/MacOSX.platform/Developer/SDKs/MacOSX10.15.sdk/usr/include/libxml2 -Iinclude -I/Users/buildslave/jenkins/workspace/lldb-cmake/llvm-project/llvm/include -Wdocumentation -fPIC -fvisibility-inlines-hidden -Werror=date-time -Werror=unguarded-availability-new -fmodules -fmodules-cache-path=/Users/buildslave/jenkins/workspace/lldb-cmake/lldb-build/module.cache -fcxx-modules -Xclang -fmodules-local-submodule-visibility -Wall -Wextra -Wno-unused-parameter -Wwrite-strings -Wcast-qual -Wmissing-field-initializers -pedantic -Wno-long-long -Wimplicit-fallthrough -Wcovered-switch-default -Wno-noexcept-type -Wnon-virtual-dtor -Wdelete-non-virtual-dtor -Wstring-conversion -fdiagnostics-color -O3  -isysroot /Applications/Xcode.app/Contents/Developer/Platforms/MacOSX.platform/Developer/SDKs/MacOSX10.15.sdk    -fno-exceptions -fno-rtti -UNDEBUG -std=c++14 -MD -MT tools/lld/COFF/CMakeFiles/lldCOFF.dir/MapFile.cpp.o -MF tools/lld/COFF/CMakeFiles/lldCOFF.dir/MapFile.cpp.o.d -o tools/lld/COFF/CMakeFiles/lldCOFF.dir/MapFile.cpp.o -c /Users/buildslave/jenkins/workspace/lldb-cmake/llvm-project/lld/COFF/MapFile.cpp
[6/1351] /Users/buildslave/jenkins/workspace/lldb-cmake/host-compiler/bin/clang++  -DGTEST_HAS_RTTI=0 -D_DEBUG -D__STDC_CONSTANT_MACROS -D__STDC_FORMAT_MACROS -D__STDC_LIMIT_MACROS -Itools/lld/COFF -I/Users/buildslave/jenkins/workspace/lldb-cmake/llvm-project/lld/COFF -I/Users/buildslave/jenkins/workspace/lldb-cmake/llvm-project/lld/include -Itools/lld/include -I/Applications/Xcode.app/Contents/Developer/Platforms/MacOSX.platform/Developer/SDKs/MacOSX10.15.sdk/usr/include/libxml2 -Iinclude -I/Users/buildslave/jenkins/workspace/lldb-cmake/llvm-project/llvm/include -Wdocumentation -fPIC -fvisibility-inlines-hidden -Werror=date-time -Werror=unguarded-availability-new -fmodules -fmodules-cache-path=/Users/buildslave/jenkins/workspace/lldb-cmake/lldb-build/module.cache -fcxx-modules -Xclang -fmodules-local-submodule-visibility -Wall -Wextra -Wno-unused-parameter -Wwrite-strings -Wcast-qual -Wmissing-field-initializers -pedantic -Wno-long-long -Wimplicit-fallthrough -Wcovered-switch-default -Wno-noexcept-type -Wnon-virtual-dtor -Wdelete-non-virtual-dtor -Wstring-conversion -fdiagnostics-color -O3  -isysroot /Applications/Xcode.app/Contents/Developer/Platforms/MacOSX.platform/Developer/SDKs/MacOSX10.15.sdk    -fno-exceptions -fno-rtti -UNDEBUG -std=c++14 -MD -MT tools/lld/COFF/CMakeFiles/lldCOFF.dir/DLL.cpp.o -MF tools/lld/COFF/CMakeFiles/lldCOFF.dir/DLL.cpp.o.d -o tools/lld/COFF/CMakeFiles/lldCOFF.dir/DLL.cpp.o -c /Users/buildslave/jenkins/workspace/lldb-cmake/llvm-project/lld/COFF/DLL.cpp
[7/1351] /Users/buildslave/jenkins/workspace/lldb-cmake/host-compiler/bin/clang++  -DGTEST_HAS_RTTI=0 -D_DEBUG -D__STDC_CONSTANT_MACROS -D__STDC_FORMAT_MACROS -D__STDC_LIMIT_MACROS -Itools/lld/ELF -I/Users/buildslave/jenkins/workspace/lldb-cmake/llvm-project/lld/ELF -I/Users/buildslave/jenkins/workspace/lldb-cmake/llvm-project/lld/include -Itools/lld/include -I/Applications/Xcode.app/Contents/Developer/Platforms/MacOSX.platform/Developer/SDKs/MacOSX10.15.sdk/usr/include/libxml2 -Iinclude -I/Users/buildslave/jenkins/workspace/lldb-cmake/llvm-project/llvm/include -Wdocumentation -fPIC -fvisibility-inlines-hidden -Werror=date-time -Werror=unguarded-availability-new -fmodules -fmodules-cache-path=/Users/buildslave/jenkins/workspace/lldb-cmake/lldb-build/module.cache -fcxx-modules -Xclang -fmodules-local-submodule-visibility -Wall -Wextra -Wno-unused-parameter -Wwrite-strings -Wcast-qual -Wmissing-field-initializers -pedantic -Wno-long-long -Wimplicit-fallthrough -Wcovered-switch-default -Wno-noexcept-type -Wnon-virtual-dtor -Wdelete-non-virtual-dtor -Wstring-conversion -fdiagnostics-color -O3  -isysroot /Applications/Xcode.app/Contents/Developer/Platforms/MacOSX.platform/Developer/SDKs/MacOSX10.15.sdk    -fno-exceptions -fno-rtti -UNDEBUG -std=c++14 -MD -MT tools/lld/ELF/CMakeFiles/lldELF.dir/Arch/AArch64.cpp.o -MF tools/lld/ELF/CMakeFiles/lldELF.dir/Arch/AArch64.cpp.o.d -o tools/lld/ELF/CMakeFiles/lldELF.dir/Arch/AArch64.cpp.o -c /Users/buildslave/jenkins/workspace/lldb-cmake/llvm-project/lld/ELF/Arch/AArch64.cpp
[8/1351] /Users/buildslave/jenkins/workspace/lldb-cmake/host-compiler/bin/clang++  -DGTEST_HAS_RTTI=0 -D_DEBUG -D__STDC_CONSTANT_MACROS -D__STDC_FORMAT_MACROS -D__STDC_LIMIT_MACROS -Itools/lld/ELF -I/Users/buildslave/jenkins/workspace/lldb-cmake/llvm-project/lld/ELF -I/Users/buildslave/jenkins/workspace/lldb-cmake/llvm-project/lld/include -Itools/lld/include -I/Applications/Xcode.app/Contents/Developer/Platforms/MacOSX.platform/Developer/SDKs/MacOSX10.15.sdk/usr/include/libxml2 -Iinclude -I/Users/buildslave/jenkins/workspace/lldb-cmake/llvm-project/llvm/include -Wdocumentation -fPIC -fvisibility-inlines-hidden -Werror=date-time -Werror=unguarded-availability-new -fmodules -fmodules-cache-path=/Users/buildslave/jenkins/workspace/lldb-cmake/lldb-build/module.cache -fcxx-modules -Xclang -fmodules-local-submodule-visibility -Wall -Wextra -Wno-unused-parameter -Wwrite-strings -Wcast-qual -Wmissing-field-initializers -pedantic -Wno-long-long -Wimplicit-fallthrough -Wcovered-switch-default -Wno-noexcept-type -Wnon-virtual-dtor -Wdelete-non-virtual-dtor -Wstring-conversion -fdiagnostics-color -O3  -isysroot /Applications/Xcode.app/Contents/Developer/Platforms/MacOSX.platform/Developer/SDKs/MacOSX10.15.sdk    -fno-exceptions -fno-rtti -UNDEBUG -std=c++14 -MD -MT tools/lld/ELF/CMakeFiles/lldELF.dir/Arch/AMDGPU.cpp.o -MF tools/lld/ELF/CMakeFiles/lldELF.dir/Arch/AMDGPU.cpp.o.d -o tools/lld/ELF/CMakeFiles/lldELF.dir/Arch/AMDGPU.cpp.o -c /Users/buildslave/jenkins/workspace/lldb-cmake/llvm-project/lld/ELF/Arch/AMDGPU.cpp
[9/1351] /Users/buildslave/jenkins/workspace/lldb-cmake/host-compiler/bin/clang++  -DGTEST_HAS_RTTI=0 -D_DEBUG -D__STDC_CONSTANT_MACROS -D__STDC_FORMAT_MACROS -D__STDC_LIMIT_MACROS -Itools/lld/ELF -I/Users/buildslave/jenkins/workspace/lldb-cmake/llvm-project/lld/ELF -I/Users/buildslave/jenkins/workspace/lldb-cmake/llvm-project/lld/include -Itools/lld/include -I/Applications/Xcode.app/Contents/Developer/Platforms/MacOSX.platform/Developer/SDKs/MacOSX10.15.sdk/usr/include/libxml2 -Iinclude -I/Users/buildslave/jenkins/workspace/lldb-cmake/llvm-project/llvm/include -Wdocumentation -fPIC -fvisibility-inlines-hidden -Werror=date-time -Werror=unguarded-availability-new -fmodules -fmodules-cache-path=/Users/buildslave/jenkins/workspace/lldb-cmake/lldb-build/module.cache -fcxx-modules -Xclang -fmodules-local-submodule-visibility -Wall -Wextra -Wno-unused-parameter -Wwrite-strings -Wcast-qual -Wmissing-field-initializers -pedantic -Wno-long-long -Wimplicit-fallthrough -Wcovered-switch-default -Wno-noexcept-type -Wnon-virtual-dtor -Wdelete-non-virtual-dtor -Wstring-conversion -fdiagnostics-color -O3  -isysroot /Applications/Xcode.app/Contents/Developer/Platforms/MacOSX.platform/Developer/SDKs/MacOSX10.15.sdk    -fno-exceptions -fno-rtti -UNDEBUG -std=c++14 -MD -MT tools/lld/ELF/CMakeFiles/lldELF.dir/Arch/Hexagon.cpp.o -MF tools/lld/ELF/CMakeFiles/lldELF.dir/Arch/Hexagon.cpp.o.d -o tools/lld/ELF/CMakeFiles/lldELF.dir/Arch/Hexagon.cpp.o -c /Users/buildslave/jenkins/workspace/lldb-cmake/llvm-project/lld/ELF/Arch/Hexagon.cpp
[10/1351] /Users/buildslave/jenkins/workspace/lldb-cmake/host-compiler/bin/clang++  -DGTEST_HAS_RTTI=0 -D_DEBUG -D__STDC_CONSTANT_MACROS -D__STDC_FORMAT_MACROS -D__STDC_LIMIT_MACROS -Itools/lld/ELF -I/Users/buildslave/jenkins/workspace/lldb-cmake/llvm-project/lld/ELF -I/Users/buildslave/jenkins/workspace/lldb-cmake/llvm-project/lld/include -Itools/lld/include -I/Applications/Xcode.app/Contents/Developer/Platforms/MacOSX.platform/Developer/SDKs/MacOSX10.15.sdk/usr/include/libxml2 -Iinclude -I/Users/buildslave/jenkins/workspace/lldb-cmake/llvm-project/llvm/include -Wdocumentation -fPIC -fvisibility-inlines-hidden -Werror=date-time -Werror=unguarded-availability-new -fmodules -fmodules-cache-path=/Users/buildslave/jenkins/workspace/lldb-cmake/lldb-build/module.cache -fcxx-modules -Xclang -fmodules-local-submodule-visibility -Wall -Wextra -Wno-unused-parameter -Wwrite-strings -Wcast-qual -Wmissing-field-initializers -pedantic -Wno-long-long -Wimplicit-fallthrough -Wcovered-switch-default -Wno-noexcept-type -Wnon-virtual-dtor -Wdelete-non-virtual-dtor -Wstring-conversion -fdiagnostics-color -O3  -isysroot /Applications/Xcode.app/Contents/Developer/Platforms/MacOSX.platform/Developer/SDKs/MacOSX10.15.sdk    -fno-exceptions -fno-rtti -UNDEBUG -std=c++14 -MD -MT tools/lld/ELF/CMakeFiles/lldELF.dir/Arch/AVR.cpp.o -MF tools/lld/ELF/CMakeFiles/lldELF.dir/Arch/AVR.cpp.o.d -o tools/lld/ELF/CMakeFiles/lldELF.dir/Arch/AVR.cpp.o -c /Users/buildslave/jenkins/workspace/lldb-cmake/llvm-project/lld/ELF/Arch/AVR.cpp
[11/1351] /Users/buildslave/jenkins/workspace/lldb-cmake/host-compiler/bin/clang++  -DGTEST_HAS_RTTI=0 -D_DEBUG -D__STDC_CONSTANT_MACROS -D__STDC_FORMAT_MACROS -D__STDC_LIMIT_MACROS -Itools/lld/ELF -I/Users/buildslave/jenkins/workspace/lldb-cmake/llvm-project/lld/ELF -I/Users/buildslave/jenkins/workspace/lldb-cmake/llvm-project/lld/include -Itools/lld/include -I/Applications/Xcode.app/Contents/Developer/Platforms/MacOSX.platform/Developer/SDKs/MacOSX10.15.sdk/usr/include/libxml2 -Iinclude -I/Users/buildslave/jenkins/workspace/lldb-cmake/llvm-project/llvm/include -Wdocumentation -fPIC -fvisibility-inlines-hidden -Werror=date-time -Werror=unguarded-availability-new -fmodules -fmodules-cache-path=/Users/buildslave/jenkins/workspace/lldb-cmake/lldb-build/module.cache -fcxx-modules -Xclang -fmodules-local-submodule-visibility -Wall -Wextra -Wno-unused-parameter -Wwrite-strings -Wcast-qual -Wmissing-field-initializers -pedantic -Wno-long-long -Wimplicit-fallthrough -Wcovered-switch-default -Wno-noexcept-type -Wnon-virtual-dtor -Wdelete-non-virtual-dtor -Wstring-conversion -fdiagnostics-color -O3  -isysroot /Applications/Xcode.app/Contents/Developer/Platforms/MacOSX.platform/Developer/SDKs/MacOSX10.15.sdk    -fno-exceptions -fno-rtti -UNDEBUG -std=c++14 -MD -MT tools/lld/ELF/CMakeFiles/lldELF.dir/AArch64ErrataFix.cpp.o -MF tools/lld/ELF/CMakeFiles/lldELF.dir/AArch64ErrataFix.cpp.o.d -o tools/lld/ELF/CMakeFiles/lldELF.dir/AArch64ErrataFix.cpp.o -c /Users/buildslave/jenkins/workspace/lldb-cmake/llvm-project/lld/ELF/AArch64ErrataFix.cpp
[12/1351] /Users/buildslave/jenkins/workspace/lldb-cmake/host-compiler/bin/clang++  -DGTEST_HAS_RTTI=0 -D_DEBUG -D__STDC_CONSTANT_MACROS -D__STDC_FORMAT_MACROS -D__STDC_LIMIT_MACROS -Itools/lld/COFF -I/Users/buildslave/jenkins/workspace/lldb-cmake/llvm-project/lld/COFF -I/Users/buildslave/jenkins/workspace/lldb-cmake/llvm-project/lld/include -Itools/lld/include -I/Applications/Xcode.app/Contents/Developer/Platforms/MacOSX.platform/Developer/SDKs/MacOSX10.15.sdk/usr/include/libxml2 -Iinclude -I/Users/buildslave/jenkins/workspace/lldb-cmake/llvm-project/llvm/include -Wdocumentation -fPIC -fvisibility-inlines-hidden -Werror=date-time -Werror=unguarded-availability-new -fmodules -fmodules-cache-path=/Users/buildslave/jenkins/workspace/lldb-cmake/lldb-build/module.cache -fcxx-modules -Xclang -fmodules-local-submodule-visibility -Wall -Wextra -Wno-unused-parameter -Wwrite-strings -Wcast-qual -Wmissing-field-initializers -pedantic -Wno-long-long -Wimplicit-fallthrough -Wcovered-switch-default -Wno-noexcept-type -Wnon-virtual-dtor -Wdelete-non-virtual-dtor -Wstring-conversion -fdiagnostics-color -O3  -isysroot /Applications/Xcode.app/Contents/Developer/Platforms/MacOSX.platform/Developer/SDKs/MacOSX10.15.sdk    -fno-exceptions -fno-rtti -UNDEBUG -std=c++14 -MD -MT tools/lld/COFF/CMakeFiles/lldCOFF.dir/DebugTypes.cpp.o -MF tools/lld/COFF/CMakeFiles/lldCOFF.dir/DebugTypes.cpp.o.d -o tools/lld/COFF/CMakeFiles/lldCOFF.dir/DebugTypes.cpp.o -c /Users/buildslave/jenkins/workspace/lldb-cmake/llvm-project/lld/COFF/DebugTypes.cpp
[13/1351] /Users/buildslave/jenkins/workspace/lldb-cmake/host-compiler/bin/clang++  -DGTEST_HAS_RTTI=0 -D_DEBUG -D__STDC_CONSTANT_MACROS -D__STDC_FORMAT_MACROS -D__STDC_LIMIT_MACROS -Itools/lld/ELF -I/Users/buildslave/jenkins/workspace/lldb-cmake/llvm-project/lld/ELF -I/Users/buildslave/jenkins/workspace/lldb-cmake/llvm-project/lld/include -Itools/lld/include -I/Applications/Xcode.app/Contents/Developer/Platforms/MacOSX.platform/Developer/SDKs/MacOSX10.15.sdk/usr/include/libxml2 -Iinclude -I/Users/buildslave/jenkins/workspace/lldb-cmake/llvm-project/llvm/include -Wdocumentation -fPIC -fvisibility-inlines-hidden -Werror=date-time -Werror=unguarded-availability-new -fmodules -fmodules-cache-path=/Users/buildslave/jenkins/workspace/lldb-cmake/lldb-build/module.cache -fcxx-modules -Xclang -fmodules-local-submodule-visibility -Wall -Wextra -Wno-unused-parameter -Wwrite-strings -Wcast-qual -Wmissing-field-initializers -pedantic -Wno-long-long -Wimplicit-fallthrough -Wcovered-switch-default -Wno-noexcept-type -Wnon-virtual-dtor -Wdelete-non-virtual-dtor -Wstring-conversion -fdiagnostics-color -O3  -isysroot /Applications/Xcode.app/Contents/Developer/Platforms/MacOSX.platform/Developer/SDKs/MacOSX10.15.sdk    -fno-exceptions -fno-rtti -UNDEBUG -std=c++14 -MD -MT tools/lld/ELF/CMakeFiles/lldELF.dir/Arch/ARM.cpp.o -MF tools/lld/ELF/CMakeFiles/lldELF.dir/Arch/ARM.cpp.o.d -o tools/lld/ELF/CMakeFiles/lldELF.dir/Arch/ARM.cpp.o -c /Users/buildslave/jenkins/workspace/lldb-cmake/llvm-project/lld/ELF/Arch/ARM.cpp
[14/1351] /Users/buildslave/jenkins/workspace/lldb-cmake/host-compiler/bin/clang++  -DGTEST_HAS_RTTI=0 -D_DEBUG -D__STDC_CONSTANT_MACROS -D__STDC_FORMAT_MACROS -D__STDC_LIMIT_MACROS -Itools/lld/ELF -I/Users/buildslave/jenkins/workspace/lldb-cmake/llvm-project/lld/ELF -I/Users/buildslave/jenkins/workspace/lldb-cmake/llvm-project/lld/include -Itools/lld/include -I/Applications/Xcode.app/Contents/Developer/Platforms/MacOSX.platform/Developer/SDKs/MacOSX10.15.sdk/usr/include/libxml2 -Iinclude -I/Users/buildslave/jenkins/workspace/lldb-cmake/llvm-project/llvm/include -Wdocumentation -fPIC -fvisibility-inlines-hidden -Werror=date-time -Werror=unguarded-availability-new -fmodules -fmodules-cache-path=/Users/buildslave/jenkins/workspace/lldb-cmake/lldb-build/module.cache -fcxx-modules -Xclang -fmodules-local-submodule-visibility -Wall -Wextra -Wno-unused-parameter -Wwrite-strings -Wcast-qual -Wmissing-field-initializers -pedantic -Wno-long-long -Wimplicit-fallthrough -Wcovered-switch-default -Wno-noexcept-type -Wnon-virtual-dtor -Wdelete-non-virtual-dtor -Wstring-conversion -fdiagnostics-color -O3  -isysroot /Applications/Xcode.app/Contents/Developer/Platforms/MacOSX.platform/Developer/SDKs/MacOSX10.15.sdk    -fno-exceptions -fno-rtti -UNDEBUG -std=c++14 -MD -MT tools/lld/ELF/CMakeFiles/lldELF.dir/Arch/MSP430.cpp.o -MF tools/lld/ELF/CMakeFiles/lldELF.dir/Arch/MSP430.cpp.o.d -o tools/lld/ELF/CMakeFiles/lldELF.dir/Arch/MSP430.cpp.o -c /Users/buildslave/jenkins/workspace/lldb-cmake/llvm-project/lld/ELF/Arch/MSP430.cpp
[15/1351] /Users/buildslave/jenkins/workspace/lldb-cmake/host-compiler/bin/clang++  -DGTEST_HAS_RTTI=0 -D_DEBUG -D__STDC_CONSTANT_MACROS -D__STDC_FORMAT_MACROS -D__STDC_LIMIT_MACROS -Itools/lld/ELF -I/Users/buildslave/jenkins/workspace/lldb-cmake/llvm-project/lld/ELF -I/Users/buildslave/jenkins/workspace/lldb-cmake/llvm-project/lld/include -Itools/lld/include -I/Applications/Xcode.app/Contents/Developer/Platforms/MacOSX.platform/Developer/SDKs/MacOSX10.15.sdk/usr/include/libxml2 -Iinclude -I/Users/buildslave/jenkins/workspace/lldb-cmake/llvm-project/llvm/include -Wdocumentation -fPIC -fvisibility-inlines-hidden -Werror=date-time -Werror=unguarded-availability-new -fmodules -fmodules-cache-path=/Users/buildslave/jenkins/workspace/lldb-cmake/lldb-build/module.cache -fcxx-modules -Xclang -fmodules-local-submodule-visibility -Wall -Wextra -Wno-unused-parameter -Wwrite-strings -Wcast-qual -Wmissing-field-initializers -pedantic -Wno-long-long -Wimplicit-fallthrough -Wcovered-switch-default -Wno-noexcept-type -Wnon-virtual-dtor -Wdelete-non-virtual-dtor -Wstring-conversion -fdiagnostics-color -O3  -isysroot /Applications/Xcode.app/Contents/Developer/Platforms/MacOSX.platform/Developer/SDKs/MacOSX10.15.sdk    -fno-exceptions -fno-rtti -UNDEBUG -std=c++14 -MD -MT tools/lld/ELF/CMakeFiles/lldELF.dir/Arch/MipsArchTree.cpp.o -MF tools/lld/ELF/CMakeFiles/lldELF.dir/Arch/MipsArchTree.cpp.o.d -o tools/lld/ELF/CMakeFiles/lldELF.dir/Arch/MipsArchTree.cpp.o -c /Users/buildslave/jenkins/workspace/lldb-cmake/llvm-project/lld/ELF/Arch/MipsArchTree.cpp
[16/1351] /Users/buildslave/jenkins/workspace/lldb-cmake/host-compiler/bin/clang++  -DGTEST_HAS_RTTI=0 -D_DEBUG -D__STDC_CONSTANT_MACROS -D__STDC_FORMAT_MACROS -D__STDC_LIMIT_MACROS -Itools/lld/ELF -I/Users/buildslave/jenkins/workspace/lldb-cmake/llvm-project/lld/ELF -I/Users/buildslave/jenkins/workspace/lldb-cmake/llvm-project/lld/include -Itools/lld/include -I/Applications/Xcode.app/Contents/Developer/Platforms/MacOSX.platform/Developer/SDKs/MacOSX10.15.sdk/usr/include/libxml2 -Iinclude -I/Users/buildslave/jenkins/workspace/lldb-cmake/llvm-project/llvm/include -Wdocumentation -fPIC -fvisibility-inlines-hidden -Werror=date-time -Werror=unguarded-availability-new -fmodules -fmodules-cache-path=/Users/buildslave/jenkins/workspace/lldb-cmake/lldb-build/module.cache -fcxx-modules -Xclang -fmodules-local-submodule-visibility -Wall -Wextra -Wno-unused-parameter -Wwrite-strings -Wcast-qual -Wmissing-field-initializers -pedantic -Wno-long-long -Wimplicit-fallthrough -Wcovered-switch-default -Wno-noexcept-type -Wnon-virtual-dtor -Wdelete-non-virtual-dtor -Wstring-conversion -fdiagnostics-color -O3  -isysroot /Applications/Xcode.app/Contents/Developer/Platforms/MacOSX.platform/Developer/SDKs/MacOSX10.15.sdk    -fno-exceptions -fno-rtti -UNDEBUG -std=c++14 -MD -MT tools/lld/ELF/CMakeFiles/lldELF.dir/Arch/PPC.cpp.o -MF tools/lld/ELF/CMakeFiles/lldELF.dir/Arch/PPC.cpp.o.d -o tools/lld/ELF/CMakeFiles/lldELF.dir/Arch/PPC.cpp.o -c /Users/buildslave/jenkins/workspace/lldb-cmake/llvm-project/lld/ELF/Arch/PPC.cpp
[17/1351] /Users/buildslave/jenkins/workspace/lldb-cmake/host-compiler/bin/clang++  -DGTEST_HAS_RTTI=0 -D_DEBUG -D__STDC_CONSTANT_MACROS -D__STDC_FORMAT_MACROS -D__STDC_LIMIT_MACROS -Itools/lld/ELF -I/Users/buildslave/jenkins/workspace/lldb-cmake/llvm-project/lld/ELF -I/Users/buildslave/jenkins/workspace/lldb-cmake/llvm-project/lld/include -Itools/lld/include -I/Applications/Xcode.app/Contents/Developer/Platforms/MacOSX.platform/Developer/SDKs/MacOSX10.15.sdk/usr/include/libxml2 -Iinclude -I/Users/buildslave/jenkins/workspace/lldb-cmake/llvm-project/llvm/include -Wdocumentation -fPIC -fvisibility-inlines-hidden -Werror=date-time -Werror=unguarded-availability-new -fmodules -fmodules-cache-path=/Users/buildslave/jenkins/workspace/lldb-cmake/lldb-build/module.cache -fcxx-modules -Xclang -fmodules-local-submodule-visibility -Wall -Wextra -Wno-unused-parameter -Wwrite-strings -Wcast-qual -Wmissing-field-initializers -pedantic -Wno-long-long -Wimplicit-fallthrough -Wcovered-switch-default -Wno-noexcept-type -Wnon-virtual-dtor -Wdelete-non-virtual-dtor -Wstring-conversion -fdiagnostics-color -O3  -isysroot /Applications/Xcode.app/Contents/Developer/Platforms/MacOSX.platform/Developer/SDKs/MacOSX10.15.sdk    -fno-exceptions -fno-rtti -UNDEBUG -std=c++14 -MD -MT tools/lld/ELF/CMakeFiles/lldELF.dir/Arch/Mips.cpp.o -MF tools/lld/ELF/CMakeFiles/lldELF.dir/Arch/Mips.cpp.o.d -o tools/lld/ELF/CMakeFiles/lldELF.dir/Arch/Mips.cpp.o -c /Users/buildslave/jenkins/workspace/lldb-cmake/llvm-project/lld/ELF/Arch/Mips.cpp
[18/1351] /Users/buildslave/jenkins/workspace/lldb-cmake/host-compiler/bin/clang++  -DGTEST_HAS_RTTI=0 -D_DEBUG -D__STDC_CONSTANT_MACROS -D__STDC_FORMAT_MACROS -D__STDC_LIMIT_MACROS -Itools/lld/ELF -I/Users/buildslave/jenkins/workspace/lldb-cmake/llvm-project/lld/ELF -I/Users/buildslave/jenkins/workspace/lldb-cmake/llvm-project/lld/include -Itools/lld/include -I/Applications/Xcode.app/Contents/Developer/Platforms/MacOSX.platform/Developer/SDKs/MacOSX10.15.sdk/usr/include/libxml2 -Iinclude -I/Users/buildslave/jenkins/workspace/lldb-cmake/llvm-project/llvm/include -Wdocumentation -fPIC -fvisibility-inlines-hidden -Werror=date-time -Werror=unguarded-availability-new -fmodules -fmodules-cache-path=/Users/buildslave/jenkins/workspace/lldb-cmake/lldb-build/module.cache -fcxx-modules -Xclang -fmodules-local-submodule-visibility -Wall -Wextra -Wno-unused-parameter -Wwrite-strings -Wcast-qual -Wmissing-field-initializers -pedantic -Wno-long-long -Wimplicit-fallthrough -Wcovered-switch-default -Wno-noexcept-type -Wnon-virtual-dtor -Wdelete-non-virtual-dtor -Wstring-conversion -fdiagnostics-color -O3  -isysroot /Applications/Xcode.app/Contents/Developer/Platforms/MacOSX.platform/Developer/SDKs/MacOSX10.15.sdk    -fno-exceptions -fno-rtti -UNDEBUG -std=c++14 -MD -MT tools/lld/ELF/CMakeFiles/lldELF.dir/Arch/SPARCV9.cpp.o -MF tools/lld/ELF/CMakeFiles/lldELF.dir/Arch/SPARCV9.cpp.o.d -o tools/lld/ELF/CMakeFiles/lldELF.dir/Arch/SPARCV9.cpp.o -c /Users/buildslave/jenkins/workspace/lldb-cmake/llvm-project/lld/ELF/Arch/SPARCV9.cpp
[19/1351] /Users/buildslave/jenkins/workspace/lldb-cmake/host-compiler/bin/clang++  -DGTEST_HAS_RTTI=0 -D_DEBUG -D__STDC_CONSTANT_MACROS -D__STDC_FORMAT_MACROS -D__STDC_LIMIT_MACROS -Itools/lld/ELF -I/Users/buildslave/jenkins/workspace/lldb-cmake/llvm-project/lld/ELF -I/Users/buildslave/jenkins/workspace/lldb-cmake/llvm-project/lld/include -Itools/lld/include -I/Applications/Xcode.app/Contents/Developer/Platforms/MacOSX.platform/Developer/SDKs/MacOSX10.15.sdk/usr/include/libxml2 -Iinclude -I/Users/buildslave/jenkins/workspace/lldb-cmake/llvm-project/llvm/include -Wdocumentation -fPIC -fvisibility-inlines-hidden -Werror=date-time -Werror=unguarded-availability-new -fmodules -fmodules-cache-path=/Users/buildslave/jenkins/workspace/lldb-cmake/lldb-build/module.cache -fcxx-modules -Xclang -fmodules-local-submodule-visibility -Wall -Wextra -Wno-unused-parameter -Wwrite-strings -Wcast-qual -Wmissing-field-initializers -pedantic -Wno-long-long -Wimplicit-fallthrough -Wcovered-switch-default -Wno-noexcept-type -Wnon-virtual-dtor -Wdelete-non-virtual-dtor -Wstring-conversion -fdiagnostics-color -O3  -isysroot /Applications/Xcode.app/Contents/Developer/Platforms/MacOSX.platform/Developer/SDKs/MacOSX10.15.sdk    -fno-exceptions -fno-rtti -UNDEBUG -std=c++14 -MD -MT tools/lld/ELF/CMakeFiles/lldELF.dir/Arch/RISCV.cpp.o -MF tools/lld/ELF/CMakeFiles/lldELF.dir/Arch/RISCV.cpp.o.d -o tools/lld/ELF/CMakeFiles/lldELF.dir/Arch/RISCV.cpp.o -c /Users/buildslave/jenkins/workspace/lldb-cmake/llvm-project/lld/ELF/Arch/RISCV.cpp
[20/1351] /Users/buildslave/jenkins/workspace/lldb-cmake/host-compiler/bin/clang++  -DGTEST_HAS_RTTI=0 -D_DEBUG -D__STDC_CONSTANT_MACROS -D__STDC_FORMAT_MACROS -D__STDC_LIMIT_MACROS -Itools/lld/ELF -I/Users/buildslave/jenkins/workspace/lldb-cmake/llvm-project/lld/ELF -I/Users/buildslave/jenkins/workspace/lldb-cmake/llvm-project/lld/include -Itools/lld/include -I/Applications/Xcode.app/Contents/Developer/Platforms/MacOSX.platform/Developer/SDKs/MacOSX10.15.sdk/usr/include/libxml2 -Iinclude -I/Users/buildslave/jenkins/workspace/lldb-cmake/llvm-project/llvm/include -Wdocumentation -fPIC -fvisibility-inlines-hidden -Werror=date-time -Werror=unguarded-availability-new -fmodules -fmodules-cache-path=/Users/buildslave/jenkins/workspace/lldb-cmake/lldb-build/module.cache -fcxx-modules -Xclang -fmodules-local-submodule-visibility -Wall -Wextra -Wno-unused-parameter -Wwrite-strings -Wcast-qual -Wmissing-field-initializers -pedantic -Wno-long-long -Wimplicit-fallthrough -Wcovered-switch-default -Wno-noexcept-type -Wnon-virtual-dtor -Wdelete-non-virtual-dtor -Wstring-conversion -fdiagnostics-color -O3  -isysroot /Applications/Xcode.app/Contents/Developer/Platforms/MacOSX.platform/Developer/SDKs/MacOSX10.15.sdk    -fno-exceptions -fno-rtti -UNDEBUG -std=c++14 -MD -MT tools/lld/ELF/CMakeFiles/lldELF.dir/Arch/PPC64.cpp.o -MF tools/lld/ELF/CMakeFiles/lldELF.dir/Arch/PPC64.cpp.o.d -o tools/lld/ELF/CMakeFiles/lldELF.dir/Arch/PPC64.cpp.o -c /Users/buildslave/jenkins/workspace/lldb-cmake/llvm-project/lld/ELF/Arch/PPC64.cpp
[21/1351] /Users/buildslave/jenkins/workspace/lldb-cmake/host-compiler/bin/clang++  -DGTEST_HAS_RTTI=0 -D_DEBUG -D__STDC_CONSTANT_MACROS -D__STDC_FORMAT_MACROS -D__STDC_LIMIT_MACROS -Itools/lld/ELF -I/Users/buildslave/jenkins/workspace/lldb-cmake/llvm-project/lld/ELF -I/Users/buildslave/jenkins/workspace/lldb-cmake/llvm-project/lld/include -Itools/lld/include -I/Applications/Xcode.app/Contents/Developer/Platforms/MacOSX.platform/Developer/SDKs/MacOSX10.15.sdk/usr/include/libxml2 -Iinclude -I/Users/buildslave/jenkins/workspace/lldb-cmake/llvm-project/llvm/include -Wdocumentation -fPIC -fvisibility-inlines-hidden -Werror=date-time -Werror=unguarded-availability-new -fmodules -fmodules-cache-path=/Users/buildslave/jenkins/workspace/lldb-cmake/lldb-build/module.cache -fcxx-modules -Xclang -fmodules-local-submodule-visibility -Wall -Wextra -Wno-unused-parameter -Wwrite-strings -Wcast-qual -Wmissing-field-initializers -pedantic -Wno-long-long -Wimplicit-fallthrough -Wcovered-switch-default -Wno-noexcept-type -Wnon-virtual-dtor -Wdelete-non-virtual-dtor -Wstring-conversion -fdiagnostics-color -O3  -isysroot /Applications/Xcode.app/Contents/Developer/Platforms/MacOSX.platform/Developer/SDKs/MacOSX10.15.sdk    -fno-exceptions -fno-rtti -UNDEBUG -std=c++14 -MD -MT tools/lld/ELF/CMakeFiles/lldELF.dir/Arch/X86.cpp.o -MF tools/lld/ELF/CMakeFiles/lldELF.dir/Arch/X86.cpp.o.d -o tools/lld/ELF/CMakeFiles/lldELF.dir/Arch/X86.cpp.o -c /Users/buildslave/jenkins/workspace/lldb-cmake/llvm-project/lld/ELF/Arch/X86.cpp
[22/1351] /Users/buildslave/jenkins/workspace/lldb-cmake/host-compiler/bin/clang++  -DGTEST_HAS_RTTI=0 -D_DEBUG -D__STDC_CONSTANT_MACROS -D__STDC_FORMAT_MACROS -D__STDC_LIMIT_MACROS -Itools/lld/COFF -I/Users/buildslave/jenkins/workspace/lldb-cmake/llvm-project/lld/COFF -I/Users/buildslave/jenkins/workspace/lldb-cmake/llvm-project/lld/include -Itools/lld/include -I/Applications/Xcode.app/Contents/Developer/Platforms/MacOSX.platform/Developer/SDKs/MacOSX10.15.sdk/usr/include/libxml2 -Iinclude -I/Users/buildslave/jenkins/workspace/lldb-cmake/llvm-project/llvm/include -Wdocumentation -fPIC -fvisibility-inlines-hidden -Werror=date-time -Werror=unguarded-availability-new -fmodules -fmodules-cache-path=/Users/buildslave/jenkins/workspace/lldb-cmake/lldb-build/module.cache -fcxx-modules -Xclang -fmodules-local-submodule-visibility -Wall -Wextra -Wno-unused-parameter -Wwrite-strings -Wcast-qual -Wmissing-field-initializers -pedantic -Wno-long-long -Wimplicit-fallthrough -Wcovered-switch-default -Wno-noexcept-type -Wnon-virtual-dtor -Wdelete-non-virtual-dtor -Wstring-conversion -fdiagnostics-color -O3  -isysroot /Applications/Xcode.app/Contents/Developer/Platforms/MacOSX.platform/Developer/SDKs/MacOSX10.15.sdk    -fno-exceptions -fno-rtti -UNDEBUG -std=c++14 -MD -MT tools/lld/COFF/CMakeFiles/lldCOFF.dir/PDB.cpp.o -MF tools/lld/COFF/CMakeFiles/lldCOFF.dir/PDB.cpp.o.d -o tools/lld/COFF/CMakeFiles/lldCOFF.dir/PDB.cpp.o -c /Users/buildslave/jenkins/workspace/lldb-cmake/llvm-project/lld/COFF/PDB.cpp
[23/1351] /Users/buildslave/jenkins/workspace/lldb-cmake/host-compiler/bin/clang++  -DGTEST_HAS_RTTI=0 -D_DEBUG -D__STDC_CONSTANT_MACROS -D__STDC_FORMAT_MACROS -D__STDC_LIMIT_MACROS -Itools/lld/ELF -I/Users/buildslave/jenkins/workspace/lldb-cmake/llvm-project/lld/ELF -I/Users/buildslave/jenkins/workspace/lldb-cmake/llvm-project/lld/include -Itools/lld/include -I/Applications/Xcode.app/Contents/Developer/Platforms/MacOSX.platform/Developer/SDKs/MacOSX10.15.sdk/usr/include/libxml2 -Iinclude -I/Users/buildslave/jenkins/workspace/lldb-cmake/llvm-project/llvm/include -Wdocumentation -fPIC -fvisibility-inlines-hidden -Werror=date-time -Werror=unguarded-availability-new -fmodules -fmodules-cache-path=/Users/buildslave/jenkins/workspace/lldb-cmake/lldb-build/module.cache -fcxx-modules -Xclang -fmodules-local-submodule-visibility -Wall -Wextra -Wno-unused-parameter -Wwrite-strings -Wcast-qual -Wmissing-field-initializers -pedantic -Wno-long-long -Wimplicit-fallthrough -Wcovered-switch-default -Wno-noexcept-type -Wnon-virtual-dtor -Wdelete-non-virtual-dtor -Wstring-conversion -fdiagnostics-color -O3  -isysroot /Applications/Xcode.app/Contents/Developer/Platforms/MacOSX.platform/Developer/SDKs/MacOSX10.15.sdk    -fno-exceptions -fno-rtti -UNDEBUG -std=c++14 -MD -MT tools/lld/ELF/CMakeFiles/lldELF.dir/Arch/X86_64.cpp.o -MF tools/lld/ELF/CMakeFiles/lldELF.dir/Arch/X86_64.cpp.o.d -o tools/lld/ELF/CMakeFiles/lldELF.dir/Arch/X86_64.cpp.o -c /Users/buildslave/jenkins/workspace/lldb-cmake/llvm-project/lld/ELF/Arch/X86_64.cpp
[24/1351] /Users/buildslave/jenkins/workspace/lldb-cmake/host-compiler/bin/clang++  -DGTEST_HAS_RTTI=0 -D_DEBUG -D__STDC_CONSTANT_MACROS -D__STDC_FORMAT_MACROS -D__STDC_LIMIT_MACROS -Itools/lld/COFF -I/Users/buildslave/jenkins/workspace/lldb-cmake/llvm-project/lld/COFF -I/Users/buildslave/jenkins/workspace/lldb-cmake/llvm-project/lld/include -Itools/lld/include -I/Applications/Xcode.app/Contents/Developer/Platforms/MacOSX.platform/Developer/SDKs/MacOSX10.15.sdk/usr/include/libxml2 -Iinclude -I/Users/buildslave/jenkins/workspace/lldb-cmake/llvm-project/llvm/include -Wdocumentation -fPIC -fvisibility-inlines-hidden -Werror=date-time -Werror=unguarded-availability-new -fmodules -fmodules-cache-path=/Users/buildslave/jenkins/workspace/lldb-cmake/lldb-build/module.cache -fcxx-modules -Xclang -fmodules-local-submodule-visibility -Wall -Wextra -Wno-unused-parameter -Wwrite-strings -Wcast-qual -Wmissing-field-initializers -pedantic -Wno-long-long -Wimplicit-fallthrough -Wcovered-switch-default -Wno-noexcept-type -Wnon-virtual-dtor -Wdelete-non-virtual-dtor -Wstring-conversion -fdiagnostics-color -O3  -isysroot /Applications/Xcode.app/Contents/Developer/Platforms/MacOSX.platform/Developer/SDKs/MacOSX10.15.sdk    -fno-exceptions -fno-rtti -UNDEBUG -std=c++14 -MD -MT tools/lld/COFF/CMakeFiles/lldCOFF.dir/Writer.cpp.o -MF tools/lld/COFF/CMakeFiles/lldCOFF.dir/Writer.cpp.o.d -o tools/lld/COFF/CMakeFiles/lldCOFF.dir/Writer.cpp.o -c /Users/buildslave/jenkins/workspace/lldb-cmake/llvm-project/lld/COFF/Writer.cpp
[25/1351] /Users/buildslave/jenkins/workspace/lldb-cmake/host-compiler/bin/clang++  -DGTEST_HAS_RTTI=0 -D_DEBUG -D__STDC_CONSTANT_MACROS -D__STDC_FORMAT_MACROS -D__STDC_LIMIT_MACROS -Itools/lld/ELF -I/Users/buildslave/jenkins/workspace/lldb-cmake/llvm-project/lld/ELF -I/Users/buildslave/jenkins/workspace/lldb-cmake/llvm-project/lld/include -Itools/lld/include -I/Applications/Xcode.app/Contents/Developer/Platforms/MacOSX.platform/Developer/SDKs/MacOSX10.15.sdk/usr/include/libxml2 -Iinclude -I/Users/buildslave/jenkins/workspace/lldb-cmake/llvm-project/llvm/include -Wdocumentation -fPIC -fvisibility-inlines-hidden -Werror=date-time -Werror=unguarded-availability-new -fmodules -fmodules-cache-path=/Users/buildslave/jenkins/workspace/lldb-cmake/lldb-build/module.cache -fcxx-modules -Xclang -fmodules-local-submodule-visibility -Wall -Wextra -Wno-unused-parameter -Wwrite-strings -Wcast-qual -Wmissing-field-initializers -pedantic -Wno-long-long -Wimplicit-fallthrough -Wcovered-switch-default -Wno-noexcept-type -Wnon-virtual-dtor -Wdelete-non-virtual-dtor -Wstring-conversion -fdiagnostics-color -O3  -isysroot /Applications/Xcode.app/Contents/Developer/Platforms/MacOSX.platform/Developer/SDKs/MacOSX10.15.sdk    -fno-exceptions -fno-rtti -UNDEBUG -std=c++14 -MD -MT tools/lld/ELF/CMakeFiles/lldELF.dir/EhFrame.cpp.o -MF tools/lld/ELF/CMakeFiles/lldELF.dir/EhFrame.cpp.o.d -o tools/lld/ELF/CMakeFiles/lldELF.dir/EhFrame.cpp.o -c /Users/buildslave/jenkins/workspace/lldb-cmake/llvm-project/lld/ELF/EhFrame.cpp
[26/1351] /Users/buildslave/jenkins/workspace/lldb-cmake/host-compiler/bin/clang++  -DGTEST_HAS_RTTI=0 -D_DEBUG -D__STDC_CONSTANT_MACROS -D__STDC_FORMAT_MACROS -D__STDC_LIMIT_MACROS -Itools/lld/ELF -I/Users/buildslave/jenkins/workspace/lldb-cmake/llvm-project/lld/ELF -I/Users/buildslave/jenkins/workspace/lldb-cmake/llvm-project/lld/include -Itools/lld/include -I/Applications/Xcode.app/Contents/Developer/Platforms/MacOSX.platform/Developer/SDKs/MacOSX10.15.sdk/usr/include/libxml2 -Iinclude -I/Users/buildslave/jenkins/workspace/lldb-cmake/llvm-project/llvm/include -Wdocumentation -fPIC -fvisibility-inlines-hidden -Werror=date-time -Werror=unguarded-availability-new -fmodules -fmodules-cache-path=/Users/buildslave/jenkins/workspace/lldb-cmake/lldb-build/module.cache -fcxx-modules -Xclang -fmodules-local-submodule-visibility -Wall -Wextra -Wno-unused-parameter -Wwrite-strings -Wcast-qual -Wmissing-field-initializers -pedantic -Wno-long-long -Wimplicit-fallthrough -Wcovered-switch-default -Wno-noexcept-type -Wnon-virtual-dtor -Wdelete-non-virtual-dtor -Wstring-conversion -fdiagnostics-color -O3  -isysroot /Applications/Xcode.app/Contents/Developer/Platforms/MacOSX.platform/Developer/SDKs/MacOSX10.15.sdk    -fno-exceptions -fno-rtti -UNDEBUG -std=c++14 -MD -MT tools/lld/ELF/CMakeFiles/lldELF.dir/DWARF.cpp.o -MF tools/lld/ELF/CMakeFiles/lldELF.dir/DWARF.cpp.o.d -o tools/lld/ELF/CMakeFiles/lldELF.dir/DWARF.cpp.o -c /Users/buildslave/jenkins/workspace/lldb-cmake/llvm-project/lld/ELF/DWARF.cpp
[27/1351] /Users/buildslave/jenkins/workspace/lldb-cmake/host-compiler/bin/clang++  -DGTEST_HAS_RTTI=0 -D_DEBUG -D__STDC_CONSTANT_MACROS -D__STDC_FORMAT_MACROS -D__STDC_LIMIT_MACROS -Itools/lld/ELF -I/Users/buildslave/jenkins/workspace/lldb-cmake/llvm-project/lld/ELF -I/Users/buildslave/jenkins/workspace/lldb-cmake/llvm-project/lld/include -Itools/lld/include -I/Applications/Xcode.app/Contents/Developer/Platforms/MacOSX.platform/Developer/SDKs/MacOSX10.15.sdk/usr/include/libxml2 -Iinclude -I/Users/buildslave/jenkins/workspace/lldb-cmake/llvm-project/llvm/include -Wdocumentation -fPIC -fvisibility-inlines-hidden -Werror=date-time -Werror=unguarded-availability-new -fmodules -fmodules-cache-path=/Users/buildslave/jenkins/workspace/lldb-cmake/lldb-build/module.cache -fcxx-modules -Xclang -fmodules-local-submodule-visibility -Wall -Wextra -Wno-unused-parameter -Wwrite-strings -Wcast-qual -Wmissing-field-initializers -pedantic -Wno-long-long -Wimplicit-fallthrough -Wcovered-switch-default -Wno-noexcept-type -Wnon-virtual-dtor -Wdelete-non-virtual-dtor -Wstring-conversion -fdiagnostics-color -O3  -isysroot /Applications/Xcode.app/Contents/Developer/Platforms/MacOSX.platform/Developer/SDKs/MacOSX10.15.sdk    -fno-exceptions -fno-rtti -UNDEBUG -std=c++14 -MD -MT tools/lld/ELF/CMakeFiles/lldELF.dir/DriverUtils.cpp.o -MF tools/lld/ELF/CMakeFiles/lldELF.dir/DriverUtils.cpp.o.d -o tools/lld/ELF/CMakeFiles/lldELF.dir/DriverUtils.cpp.o -c /Users/buildslave/jenkins/workspace/lldb-cmake/llvm-project/lld/ELF/DriverUtils.cpp
[28/1351] /Users/buildslave/jenkins/workspace/lldb-cmake/host-compiler/bin/clang++  -DGTEST_HAS_RTTI=0 -D_DEBUG -D__STDC_CONSTANT_MACROS -D__STDC_FORMAT_MACROS -D__STDC_LIMIT_MACROS -Itools/lld/ELF -I/Users/buildslave/jenkins/workspace/lldb-cmake/llvm-project/lld/ELF -I/Users/buildslave/jenkins/workspace/lldb-cmake/llvm-project/lld/include -Itools/lld/include -I/Applications/Xcode.app/Contents/Developer/Platforms/MacOSX.platform/Developer/SDKs/MacOSX10.15.sdk/usr/include/libxml2 -Iinclude -I/Users/buildslave/jenkins/workspace/lldb-cmake/llvm-project/llvm/include -Wdocumentation -fPIC -fvisibility-inlines-hidden -Werror=date-time -Werror=unguarded-availability-new -fmodules -fmodules-cache-path=/Users/buildslave/jenkins/workspace/lldb-cmake/lldb-build/module.cache -fcxx-modules -Xclang -fmodules-local-submodule-visibility -Wall -Wextra -Wno-unused-parameter -Wwrite-strings -Wcast-qual -Wmissing-field-initializers -pedantic -Wno-long-long -Wimplicit-fallthrough -Wcovered-switch-default -Wno-noexcept-type -Wnon-virtual-dtor -Wdelete-non-virtual-dtor -Wstring-conversion -fdiagnostics-color -O3  -isysroot /Applications/Xcode.app/Contents/Developer/Platforms/MacOSX.platform/Developer/SDKs/MacOSX10.15.sdk    -fno-exceptions -fno-rtti -UNDEBUG -std=c++14 -MD -MT tools/lld/ELF/CMakeFiles/lldELF.dir/CallGraphSort.cpp.o -MF tools/lld/ELF/CMakeFiles/lldELF.dir/CallGraphSort.cpp.o.d -o tools/lld/ELF/CMakeFiles/lldELF.dir/CallGraphSort.cpp.o -c /Users/buildslave/jenkins/workspace/lldb-cmake/llvm-project/lld/ELF/CallGraphSort.cpp
[29/1351] /Users/buildslave/jenkins/workspace/lldb-cmake/host-compiler/bin/clang++  -DGTEST_HAS_RTTI=0 -D_DEBUG -D__STDC_CONSTANT_MACROS -D__STDC_FORMAT_MACROS -D__STDC_LIMIT_MACROS -Itools/lld/ELF -I/Users/buildslave/jenkins/workspace/lldb-cmake/llvm-project/lld/ELF -I/Users/buildslave/jenkins/workspace/lldb-cmake/llvm-project/lld/include -Itools/lld/include -I/Applications/Xcode.app/Contents/Developer/Platforms/MacOSX.platform/Developer/SDKs/MacOSX10.15.sdk/usr/include/libxml2 -Iinclude -I/Users/buildslave/jenkins/workspace/lldb-cmake/llvm-project/llvm/include -Wdocumentation -fPIC -fvisibility-inlines-hidden -Werror=date-time -Werror=unguarded-availability-new -fmodules -fmodules-cache-path=/Users/buildslave/jenkins/workspace/lldb-cmake/lldb-build/module.cache -fcxx-modules -Xclang -fmodules-local-submodule-visibility -Wall -Wextra -Wno-unused-parameter -Wwrite-strings -Wcast-qual -Wmissing-field-initializers -pedantic -Wno-long-long -Wimplicit-fallthrough -Wcovered-switch-default -Wno-noexcept-type -Wnon-virtual-dtor -Wdelete-non-virtual-dtor -Wstring-conversion -fdiagnostics-color -O3  -isysroot /Applications/Xcode.app/Contents/Developer/Platforms/MacOSX.platform/Developer/SDKs/MacOSX10.15.sdk    -fno-exceptions -fno-rtti -UNDEBUG -std=c++14 -MD -MT tools/lld/ELF/CMakeFiles/lldELF.dir/ARMErrataFix.cpp.o -MF tools/lld/ELF/CMakeFiles/lldELF.dir/ARMErrataFix.cpp.o.d -o tools/lld/ELF/CMakeFiles/lldELF.dir/ARMErrataFix.cpp.o -c /Users/buildslave/jenkins/workspace/lldb-cmake/llvm-project/lld/ELF/ARMErrataFix.cpp
[30/1351] /Users/buildslave/jenkins/workspace/lldb-cmake/host-compiler/bin/clang++  -DGTEST_HAS_RTTI=0 -D_DEBUG -D__STDC_CONSTANT_MACROS -D__STDC_FORMAT_MACROS -D__STDC_LIMIT_MACROS -Itools/lld/ELF -I/Users/buildslave/jenkins/workspace/lldb-cmake/llvm-project/lld/ELF -I/Users/buildslave/jenkins/workspace/lldb-cmake/llvm-project/lld/include -Itools/lld/include -I/Applications/Xcode.app/Contents/Developer/Platforms/MacOSX.platform/Developer/SDKs/MacOSX10.15.sdk/usr/include/libxml2 -Iinclude -I/Users/buildslave/jenkins/workspace/lldb-cmake/llvm-project/llvm/include -Wdocumentation -fPIC -fvisibility-inlines-hidden -Werror=date-time -Werror=unguarded-availability-new -fmodules -fmodules-cache-path=/Users/buildslave/jenkins/workspace/lldb-cmake/lldb-build/module.cache -fcxx-modules -Xclang -fmodules-local-submodule-visibility -Wall -Wextra -Wno-unused-parameter -Wwrite-strings -Wcast-qual -Wmissing-field-initializers -pedantic -Wno-long-long -Wimplicit-fallthrough -Wcovered-switch-default -Wno-noexcept-type -Wnon-virtual-dtor -Wdelete-non-virtual-dtor -Wstring-conversion -fdiagnostics-color -O3  -isysroot /Applications/Xcode.app/Contents/Developer/Platforms/MacOSX.platform/Developer/SDKs/MacOSX10.15.sdk    -fno-exceptions -fno-rtti -UNDEBUG -std=c++14 -MD -MT tools/lld/ELF/CMakeFiles/lldELF.dir/MapFile.cpp.o -MF tools/lld/ELF/CMakeFiles/lldELF.dir/MapFile.cpp.o.d -o tools/lld/ELF/CMakeFiles/lldELF.dir/MapFile.cpp.o -c /Users/buildslave/jenkins/workspace/lldb-cmake/llvm-project/lld/ELF/MapFile.cpp
[31/1351] /Users/buildslave/jenkins/workspace/lldb-cmake/host-compiler/bin/clang++  -DGTEST_HAS_RTTI=0 -D_DEBUG -D__STDC_CONSTANT_MACROS -D__STDC_FORMAT_MACROS -D__STDC_LIMIT_MACROS -Itools/lld/ELF -I/Users/buildslave/jenkins/workspace/lldb-cmake/llvm-project/lld/ELF -I/Users/buildslave/jenkins/workspace/lldb-cmake/llvm-project/lld/include -Itools/lld/include -I/Applications/Xcode.app/Contents/Developer/Platforms/MacOSX.platform/Developer/SDKs/MacOSX10.15.sdk/usr/include/libxml2 -Iinclude -I/Users/buildslave/jenkins/workspace/lldb-cmake/llvm-project/llvm/include -Wdocumentation -fPIC -fvisibility-inlines-hidden -Werror=date-time -Werror=unguarded-availability-new -fmodules -fmodules-cache-path=/Users/buildslave/jenkins/workspace/lldb-cmake/lldb-build/module.cache -fcxx-modules -Xclang -fmodules-local-submodule-visibility -Wall -Wextra -Wno-unused-parameter -Wwrite-strings -Wcast-qual -Wmissing-field-initializers -pedantic -Wno-long-long -Wimplicit-fallthrough -Wcovered-switch-default -Wno-noexcept-type -Wnon-virtual-dtor -Wdelete-non-virtual-dtor -Wstring-conversion -fdiagnostics-color -O3  -isysroot /Applications/Xcode.app/Contents/Developer/Platforms/MacOSX.platform/Developer/SDKs/MacOSX10.15.sdk    -fno-exceptions -fno-rtti -UNDEBUG -std=c++14 -MD -MT tools/lld/ELF/CMakeFiles/lldELF.dir/LinkerScript.cpp.o -MF tools/lld/ELF/CMakeFiles/lldELF.dir/LinkerScript.cpp.o.d -o tools/lld/ELF/CMakeFiles/lldELF.dir/LinkerScript.cpp.o -c /Users/buildslave/jenkins/workspace/lldb-cmake/llvm-project/lld/ELF/LinkerScript.cpp
[32/1351] /Users/buildslave/jenkins/workspace/lldb-cmake/host-compiler/bin/clang++  -DGTEST_HAS_RTTI=0 -D_DEBUG -D__STDC_CONSTANT_MACROS -D__STDC_FORMAT_MACROS -D__STDC_LIMIT_MACROS -Itools/lld/ELF -I/Users/buildslave/jenkins/workspace/lldb-cmake/llvm-project/lld/ELF -I/Users/buildslave/jenkins/workspace/lldb-cmake/llvm-project/lld/include -Itools/lld/include -I/Applications/Xcode.app/Contents/Developer/Platforms/MacOSX.platform/Developer/SDKs/MacOSX10.15.sdk/usr/include/libxml2 -Iinclude -I/Users/buildslave/jenkins/workspace/lldb-cmake/llvm-project/llvm/include -Wdocumentation -fPIC -fvisibility-inlines-hidden -Werror=date-time -Werror=unguarded-availability-new -fmodules -fmodules-cache-path=/Users/buildslave/jenkins/workspace/lldb-cmake/lldb-build/module.cache -fcxx-modules -Xclang -fmodules-local-submodule-visibility -Wall -Wextra -Wno-unused-parameter -Wwrite-strings -Wcast-qual -Wmissing-field-initializers -pedantic -Wno-long-long -Wimplicit-fallthrough -Wcovered-switch-default -Wno-noexcept-type -Wnon-virtual-dtor -Wdelete-non-virtual-dtor -Wstring-conversion -fdiagnostics-color -O3  -isysroot /Applications/Xcode.app/Contents/Developer/Platforms/MacOSX.platform/Developer/SDKs/MacOSX10.15.sdk    -fno-exceptions -fno-rtti -UNDEBUG -std=c++14 -MD -MT tools/lld/ELF/CMakeFiles/lldELF.dir/MarkLive.cpp.o -MF tools/lld/ELF/CMakeFiles/lldELF.dir/MarkLive.cpp.o.d -o tools/lld/ELF/CMakeFiles/lldELF.dir/MarkLive.cpp.o -c /Users/buildslave/jenkins/workspace/lldb-cmake/llvm-project/lld/ELF/MarkLive.cpp
[33/1351] /Users/buildslave/jenkins/workspace/lldb-cmake/host-compiler/bin/clang++  -DGTEST_HAS_RTTI=0 -D_DEBUG -D__STDC_CONSTANT_MACROS -D__STDC_FORMAT_MACROS -D__STDC_LIMIT_MACROS -Itools/lld/ELF -I/Users/buildslave/jenkins/workspace/lldb-cmake/llvm-project/lld/ELF -I/Users/buildslave/jenkins/workspace/lldb-cmake/llvm-project/lld/include -Itools/lld/include -I/Applications/Xcode.app/Contents/Developer/Platforms/MacOSX.platform/Developer/SDKs/MacOSX10.15.sdk/usr/include/libxml2 -Iinclude -I/Users/buildslave/jenkins/workspace/lldb-cmake/llvm-project/llvm/include -Wdocumentation -fPIC -fvisibility-inlines-hidden -Werror=date-time -Werror=unguarded-availability-new -fmodules -fmodules-cache-path=/Users/buildslave/jenkins/workspace/lldb-cmake/lldb-build/module.cache -fcxx-modules -Xclang -fmodules-local-submodule-visibility -Wall -Wextra -Wno-unused-parameter -Wwrite-strings -Wcast-qual -Wmissing-field-initializers -pedantic -Wno-long-long -Wimplicit-fallthrough -Wcovered-switch-default -Wno-noexcept-type -Wnon-virtual-dtor -Wdelete-non-virtual-dtor -Wstring-conversion -fdiagnostics-color -O3  -isysroot /Applications/Xcode.app/Contents/Developer/Platforms/MacOSX.platform/Developer/SDKs/MacOSX10.15.sdk    -fno-exceptions -fno-rtti -UNDEBUG -std=c++14 -MD -MT tools/lld/ELF/CMakeFiles/lldELF.dir/InputSection.cpp.o -MF tools/lld/ELF/CMakeFiles/lldELF.dir/InputSection.cpp.o.d -o tools/lld/ELF/CMakeFiles/lldELF.dir/InputSection.cpp.o -c /Users/buildslave/jenkins/workspace/lldb-cmake/llvm-project/lld/ELF/InputSection.cpp
[34/1351] /Users/buildslave/jenkins/workspace/lldb-cmake/host-compiler/bin/clang++  -DGTEST_HAS_RTTI=0 -D_DEBUG -D__STDC_CONSTANT_MACROS -D__STDC_FORMAT_MACROS -D__STDC_LIMIT_MACROS -Itools/lld/ELF -I/Users/buildslave/jenkins/workspace/lldb-cmake/llvm-project/lld/ELF -I/Users/buildslave/jenkins/workspace/lldb-cmake/llvm-project/lld/include -Itools/lld/include -I/Applications/Xcode.app/Contents/Developer/Platforms/MacOSX.platform/Developer/SDKs/MacOSX10.15.sdk/usr/include/libxml2 -Iinclude -I/Users/buildslave/jenkins/workspace/lldb-cmake/llvm-project/llvm/include -Wdocumentation -fPIC -fvisibility-inlines-hidden -Werror=date-time -Werror=unguarded-availability-new -fmodules -fmodules-cache-path=/Users/buildslave/jenkins/workspace/lldb-cmake/lldb-build/module.cache -fcxx-modules -Xclang -fmodules-local-submodule-visibility -Wall -Wextra -Wno-unused-parameter -Wwrite-strings -Wcast-qual -Wmissing-field-initializers -pedantic -Wno-long-long -Wimplicit-fallthrough -Wcovered-switch-default -Wno-noexcept-type -Wnon-virtual-dtor -Wdelete-non-virtual-dtor -Wstring-conversion -fdiagnostics-color -O3  -isysroot /Applications/Xcode.app/Contents/Developer/Platforms/MacOSX.platform/Developer/SDKs/MacOSX10.15.sdk    -fno-exceptions -fno-rtti -UNDEBUG -std=c++14 -MD -MT tools/lld/ELF/CMakeFiles/lldELF.dir/ICF.cpp.o -MF tools/lld/ELF/CMakeFiles/lldELF.dir/ICF.cpp.o.d -o tools/lld/ELF/CMakeFiles/lldELF.dir/ICF.cpp.o -c /Users/buildslave/jenkins/workspace/lldb-cmake/llvm-project/lld/ELF/ICF.cpp
[35/1351] /Users/buildslave/jenkins/workspace/lldb-cmake/host-compiler/bin/clang++  -DGTEST_HAS_RTTI=0 -D_DEBUG -D__STDC_CONSTANT_MACROS -D__STDC_FORMAT_MACROS -D__STDC_LIMIT_MACROS -Itools/lld/ELF -I/Users/buildslave/jenkins/workspace/lldb-cmake/llvm-project/lld/ELF -I/Users/buildslave/jenkins/workspace/lldb-cmake/llvm-project/lld/include -Itools/lld/include -I/Applications/Xcode.app/Contents/Developer/Platforms/MacOSX.platform/Developer/SDKs/MacOSX10.15.sdk/usr/include/libxml2 -Iinclude -I/Users/buildslave/jenkins/workspace/lldb-cmake/llvm-project/llvm/include -Wdocumentation -fPIC -fvisibility-inlines-hidden -Werror=date-time -Werror=unguarded-availability-new -fmodules -fmodules-cache-path=/Users/buildslave/jenkins/workspace/lldb-cmake/lldb-build/module.cache -fcxx-modules -Xclang -fmodules-local-submodule-visibility -Wall -Wextra -Wno-unused-parameter -Wwrite-strings -Wcast-qual -Wmissing-field-initializers -pedantic -Wno-long-long -Wimplicit-fallthrough -Wcovered-switch-default -Wno-noexcept-type -Wnon-virtual-dtor -Wdelete-non-virtual-dtor -Wstring-conversion -fdiagnostics-color -O3  -isysroot /Applications/Xcode.app/Contents/Developer/Platforms/MacOSX.platform/Developer/SDKs/MacOSX10.15.sdk    -fno-exceptions -fno-rtti -UNDEBUG -std=c++14 -MD -MT tools/lld/ELF/CMakeFiles/lldELF.dir/ScriptLexer.cpp.o -MF tools/lld/ELF/CMakeFiles/lldELF.dir/ScriptLexer.cpp.o.d -o tools/lld/ELF/CMakeFiles/lldELF.dir/ScriptLexer.cpp.o -c /Users/buildslave/jenkins/workspace/lldb-cmake/llvm-project/lld/ELF/ScriptLexer.cpp
[36/1351] /Users/buildslave/jenkins/workspace/lldb-cmake/host-compiler/bin/clang++  -DGTEST_HAS_RTTI=0 -D_DEBUG -D__STDC_CONSTANT_MACROS -D__STDC_FORMAT_MACROS -D__STDC_LIMIT_MACROS -Itools/lld/ELF -I/Users/buildslave/jenkins/workspace/lldb-cmake/llvm-project/lld/ELF -I/Users/buildslave/jenkins/workspace/lldb-cmake/llvm-project/lld/include -Itools/lld/include -I/Applications/Xcode.app/Contents/Developer/Platforms/MacOSX.platform/Developer/SDKs/MacOSX10.15.sdk/usr/include/libxml2 -Iinclude -I/Users/buildslave/jenkins/workspace/lldb-cmake/llvm-project/llvm/include -Wdocumentation -fPIC -fvisibility-inlines-hidden -Werror=date-time -Werror=unguarded-availability-new -fmodules -fmodules-cache-path=/Users/buildslave/jenkins/workspace/lldb-cmake/lldb-build/module.cache -fcxx-modules -Xclang -fmodules-local-submodule-visibility -Wall -Wextra -Wno-unused-parameter -Wwrite-strings -Wcast-qual -Wmissing-field-initializers -pedantic -Wno-long-long -Wimplicit-fallthrough -Wcovered-switch-default -Wno-noexcept-type -Wnon-virtual-dtor -Wdelete-non-virtual-dtor -Wstring-conversion -fdiagnostics-color -O3  -isysroot /Applications/Xcode.app/Contents/Developer/Platforms/MacOSX.platform/Developer/SDKs/MacOSX10.15.sdk    -fno-exceptions -fno-rtti -UNDEBUG -std=c++14 -MD -MT tools/lld/ELF/CMakeFiles/lldELF.dir/SymbolTable.cpp.o -MF tools/lld/ELF/CMakeFiles/lldELF.dir/SymbolTable.cpp.o.d -o tools/lld/ELF/CMakeFiles/lldELF.dir/SymbolTable.cpp.o -c /Users/buildslave/jenkins/workspace/lldb-cmake/llvm-project/lld/ELF/SymbolTable.cpp
[37/1351] /Users/buildslave/jenkins/workspace/lldb-cmake/host-compiler/bin/clang++  -DGTEST_HAS_RTTI=0 -D_DEBUG -D__STDC_CONSTANT_MACROS -D__STDC_FORMAT_MACROS -D__STDC_LIMIT_MACROS -Itools/lld/COFF -I/Users/buildslave/jenkins/workspace/lldb-cmake/llvm-project/lld/COFF -I/Users/buildslave/jenkins/workspace/lldb-cmake/llvm-project/lld/include -Itools/lld/include -I/Applications/Xcode.app/Contents/Developer/Platforms/MacOSX.platform/Developer/SDKs/MacOSX10.15.sdk/usr/include/libxml2 -Iinclude -I/Users/buildslave/jenkins/workspace/lldb-cmake/llvm-project/llvm/include -Wdocumentation -fPIC -fvisibility-inlines-hidden -Werror=date-time -Werror=unguarded-availability-new -fmodules -fmodules-cache-path=/Users/buildslave/jenkins/workspace/lldb-cmake/lldb-build/module.cache -fcxx-modules -Xclang -fmodules-local-submodule-visibility -Wall -Wextra -Wno-unused-parameter -Wwrite-strings -Wcast-qual -Wmissing-field-initializers -pedantic -Wno-long-long -Wimplicit-fallthrough -Wcovered-switch-default -Wno-noexcept-type -Wnon-virtual-dtor -Wdelete-non-virtual-dtor -Wstring-conversion -fdiagnostics-color -O3  -isysroot /Applications/Xcode.app/Contents/Developer/Platforms/MacOSX.platform/Developer/SDKs/MacOSX10.15.sdk    -fno-exceptions -fno-rtti -UNDEBUG -std=c++14 -MD -MT tools/lld/COFF/CMakeFiles/lldCOFF.dir/LTO.cpp.o -MF tools/lld/COFF/CMakeFiles/lldCOFF.dir/LTO.cpp.o.d -o tools/lld/COFF/CMakeFiles/lldCOFF.dir/LTO.cpp.o -c /Users/buildslave/jenkins/workspace/lldb-cmake/llvm-project/lld/COFF/LTO.cpp
[38/1351] /Users/buildslave/jenkins/workspace/lldb-cmake/host-compiler/bin/clang++  -DGTEST_HAS_RTTI=0 -D_DEBUG -D__STDC_CONSTANT_MACROS -D__STDC_FORMAT_MACROS -D__STDC_LIMIT_MACROS -Itools/lld/COFF -I/Users/buildslave/jenkins/workspace/lldb-cmake/llvm-project/lld/COFF -I/Users/buildslave/jenkins/workspace/lldb-cmake/llvm-project/lld/include -Itools/lld/include -I/Applications/Xcode.app/Contents/Developer/Platforms/MacOSX.platform/Developer/SDKs/MacOSX10.15.sdk/usr/include/libxml2 -Iinclude -I/Users/buildslave/jenkins/workspace/lldb-cmake/llvm-project/llvm/include -Wdocumentation -fPIC -fvisibility-inlines-hidden -Werror=date-time -Werror=unguarded-availability-new -fmodules -fmodules-cache-path=/Users/buildslave/jenkins/workspace/lldb-cmake/lldb-build/module.cache -fcxx-modules -Xclang -fmodules-local-submodule-visibility -Wall -Wextra -Wno-unused-parameter -Wwrite-strings -Wcast-qual -Wmissing-field-initializers -pedantic -Wno-long-long -Wimplicit-fallthrough -Wcovered-switch-default -Wno-noexcept-type -Wnon-virtual-dtor -Wdelete-non-virtual-dtor -Wstring-conversion -fdiagnostics-color -O3  -isysroot /Applications/Xcode.app/Contents/Developer/Platforms/MacOSX.platform/Developer/SDKs/MacOSX10.15.sdk    -fno-exceptions -fno-rtti -UNDEBUG -std=c++14 -MD -MT tools/lld/COFF/CMakeFiles/lldCOFF.dir/SymbolTable.cpp.o -MF tools/lld/COFF/CMakeFiles/lldCOFF.dir/SymbolTable.cpp.o.d -o tools/lld/COFF/CMakeFiles/lldCOFF.dir/SymbolTable.cpp.o -c /Users/buildslave/jenkins/workspace/lldb-cmake/llvm-project/lld/COFF/SymbolTable.cpp
[39/1351] /Users/buildslave/jenkins/workspace/lldb-cmake/host-compiler/bin/clang++  -DGTEST_HAS_RTTI=0 -D_DEBUG -D__STDC_CONSTANT_MACROS -D__STDC_FORMAT_MACROS -D__STDC_LIMIT_MACROS -Itools/lld/ELF -I/Users/buildslave/jenkins/workspace/lldb-cmake/llvm-project/lld/ELF -I/Users/buildslave/jenkins/workspace/lldb-cmake/llvm-project/lld/include -Itools/lld/include -I/Applications/Xcode.app/Contents/Developer/Platforms/MacOSX.platform/Developer/SDKs/MacOSX10.15.sdk/usr/include/libxml2 -Iinclude -I/Users/buildslave/jenkins/workspace/lldb-cmake/llvm-project/llvm/include -Wdocumentation -fPIC -fvisibility-inlines-hidden -Werror=date-time -Werror=unguarded-availability-new -fmodules -fmodules-cache-path=/Users/buildslave/jenkins/workspace/lldb-cmake/lldb-build/module.cache -fcxx-modules -Xclang -fmodules-local-submodule-visibility -Wall -Wextra -Wno-unused-parameter -Wwrite-strings -Wcast-qual -Wmissing-field-initializers -pedantic -Wno-long-long -Wimplicit-fallthrough -Wcovered-switch-default -Wno-noexcept-type -Wnon-virtual-dtor -Wdelete-non-virtual-dtor -Wstring-conversion -fdiagnostics-color -O3  -isysroot /Applications/Xcode.app/Contents/Developer/Platforms/MacOSX.platform/Developer/SDKs/MacOSX10.15.sdk    -fno-exceptions -fno-rtti -UNDEBUG -std=c++14 -MD -MT tools/lld/ELF/CMakeFiles/lldELF.dir/LTO.cpp.o -MF tools/lld/ELF/CMakeFiles/lldELF.dir/LTO.cpp.o.d -o tools/lld/ELF/CMakeFiles/lldELF.dir/LTO.cpp.o -c /Users/buildslave/jenkins/workspace/lldb-cmake/llvm-project/lld/ELF/LTO.cpp
[40/1351] /Users/buildslave/jenkins/workspace/lldb-cmake/host-compiler/bin/clang++  -DGTEST_HAS_RTTI=0 -D_DEBUG -D__STDC_CONSTANT_MACROS -D__STDC_FORMAT_MACROS -D__STDC_LIMIT_MACROS -Itools/lld/ELF -I/Users/buildslave/jenkins/workspace/lldb-cmake/llvm-project/lld/ELF -I/Users/buildslave/jenkins/workspace/lldb-cmake/llvm-project/lld/include -Itools/lld/include -I/Applications/Xcode.app/Contents/Developer/Platforms/MacOSX.platform/Developer/SDKs/MacOSX10.15.sdk/usr/include/libxml2 -Iinclude -I/Users/buildslave/jenkins/workspace/lldb-cmake/llvm-project/llvm/include -Wdocumentation -fPIC -fvisibility-inlines-hidden -Werror=date-time -Werror=unguarded-availability-new -fmodules -fmodules-cache-path=/Users/buildslave/jenkins/workspace/lldb-cmake/lldb-build/module.cache -fcxx-modules -Xclang -fmodules-local-submodule-visibility -Wall -Wextra -Wno-unused-parameter -Wwrite-strings -Wcast-qual -Wmissing-field-initializers -pedantic -Wno-long-long -Wimplicit-fallthrough -Wcovered-switch-default -Wno-noexcept-type -Wnon-virtual-dtor -Wdelete-non-virtual-dtor -Wstring-conversion -fdiagnostics-color -O3  -isysroot /Applications/Xcode.app/Contents/Developer/Platforms/MacOSX.platform/Developer/SDKs/MacOSX10.15.sdk    -fno-exceptions -fno-rtti -UNDEBUG -std=c++14 -MD -MT tools/lld/ELF/CMakeFiles/lldELF.dir/Target.cpp.o -MF tools/lld/ELF/CMakeFiles/lldELF.dir/Target.cpp.o.d -o tools/lld/ELF/CMakeFiles/lldELF.dir/Target.cpp.o -c /Users/buildslave/jenkins/workspace/lldb-cmake/llvm-project/lld/ELF/Target.cpp
[41/1351] /Users/buildslave/jenkins/workspace/lldb-cmake/host-compiler/bin/clang++  -DGTEST_HAS_RTTI=0 -D_DEBUG -D__STDC_CONSTANT_MACROS -D__STDC_FORMAT_MACROS -D__STDC_LIMIT_MACROS -Itools/lld/ELF -I/Users/buildslave/jenkins/workspace/lldb-cmake/llvm-project/lld/ELF -I/Users/buildslave/jenkins/workspace/lldb-cmake/llvm-project/lld/include -Itools/lld/include -I/Applications/Xcode.app/Contents/Developer/Platforms/MacOSX.platform/Developer/SDKs/MacOSX10.15.sdk/usr/include/libxml2 -Iinclude -I/Users/buildslave/jenkins/workspace/lldb-cmake/llvm-project/llvm/include -Wdocumentation -fPIC -fvisibility-inlines-hidden -Werror=date-time -Werror=unguarded-availability-new -fmodules -fmodules-cache-path=/Users/buildslave/jenkins/workspace/lldb-cmake/lldb-build/module.cache -fcxx-modules -Xclang -fmodules-local-submodule-visibility -Wall -Wextra -Wno-unused-parameter -Wwrite-strings -Wcast-qual -Wmissing-field-initializers -pedantic -Wno-long-long -Wimplicit-fallthrough -Wcovered-switch-default -Wno-noexcept-type -Wnon-virtual-dtor -Wdelete-non-virtual-dtor -Wstring-conversion -fdiagnostics-color -O3  -isysroot /Applications/Xcode.app/Contents/Developer/Platforms/MacOSX.platform/Developer/SDKs/MacOSX10.15.sdk    -fno-exceptions -fno-rtti -UNDEBUG -std=c++14 -MD -MT tools/lld/ELF/CMakeFiles/lldELF.dir/Symbols.cpp.o -MF tools/lld/ELF/CMakeFiles/lldELF.dir/Symbols.cpp.o.d -o tools/lld/ELF/CMakeFiles/lldELF.dir/Symbols.cpp.o -c /Users/buildslave/jenkins/workspace/lldb-cmake/llvm-project/lld/ELF/Symbols.cpp
[42/1351] /Users/buildslave/jenkins/workspace/lldb-cmake/host-compiler/bin/clang++  -DGTEST_HAS_RTTI=0 -D_DEBUG -D__STDC_CONSTANT_MACROS -D__STDC_FORMAT_MACROS -D__STDC_LIMIT_MACROS -Itools/lld/ELF -I/Users/buildslave/jenkins/workspace/lldb-cmake/llvm-project/lld/ELF -I/Users/buildslave/jenkins/workspace/lldb-cmake/llvm-project/lld/include -Itools/lld/include -I/Applications/Xcode.app/Contents/Developer/Platforms/MacOSX.platform/Developer/SDKs/MacOSX10.15.sdk/usr/include/libxml2 -Iinclude -I/Users/buildslave/jenkins/workspace/lldb-cmake/llvm-project/llvm/include -Wdocumentation -fPIC -fvisibility-inlines-hidden -Werror=date-time -Werror=unguarded-availability-new -fmodules -fmodules-cache-path=/Users/buildslave/jenkins/workspace/lldb-cmake/lldb-build/module.cache -fcxx-modules -Xclang -fmodules-local-submodule-visibility -Wall -Wextra -Wno-unused-parameter -Wwrite-strings -Wcast-qual -Wmissing-field-initializers -pedantic -Wno-long-long -Wimplicit-fallthrough -Wcovered-switch-default -Wno-noexcept-type -Wnon-virtual-dtor -Wdelete-non-virtual-dtor -Wstring-conversion -fdiagnostics-color -O3  -isysroot /Applications/Xcode.app/Contents/Developer/Platforms/MacOSX.platform/Developer/SDKs/MacOSX10.15.sdk    -fno-exceptions -fno-rtti -UNDEBUG -std=c++14 -MD -MT tools/lld/ELF/CMakeFiles/lldELF.dir/OutputSections.cpp.o -MF tools/lld/ELF/CMakeFiles/lldELF.dir/OutputSections.cpp.o.d -o tools/lld/ELF/CMakeFiles/lldELF.dir/OutputSections.cpp.o -c /Users/buildslave/jenkins/workspace/lldb-cmake/llvm-project/lld/ELF/OutputSections.cpp
[43/1351] cd /Users/buildslave/jenkins/workspace/lldb-cmake/lldb-build && /Users/buildslave/jenkins/workspace/lldb-cmake/lldb-build/bin/llvm-tblgen -gen-opt-parser-defs -I /Users/buildslave/jenkins/workspace/lldb-cmake/llvm-project/lld/MachO -I /Users/buildslave/jenkins/workspace/lldb-cmake/llvm-project/lld/include -I /Users/buildslave/jenkins/workspace/lldb-cmake/lldb-build/tools/lld/include -I /Applications/Xcode.app/Contents/Developer/Platforms/MacOSX.platform/Developer/SDKs/MacOSX10.15.sdk/usr/include/libxml2 -I /Users/buildslave/jenkins/workspace/lldb-cmake/lldb-build/include -I /Users/buildslave/jenkins/workspace/lldb-cmake/llvm-project/llvm/include /Users/buildslave/jenkins/workspace/lldb-cmake/llvm-project/lld/MachO/Options.td --write-if-changed -o tools/lld/MachO/Options.inc -d tools/lld/MachO/Options.inc.d
[44/1351] cd /Users/buildslave/jenkins/workspace/lldb-cmake/lldb-build && /Users/buildslave/jenkins/workspace/lldb-cmake/lldb-build/bin/llvm-tblgen -gen-opt-parser-defs -I /Users/buildslave/jenkins/workspace/lldb-cmake/llvm-project/lld/MinGW -I /Users/buildslave/jenkins/workspace/lldb-cmake/llvm-project/lld/include -I /Users/buildslave/jenkins/workspace/lldb-cmake/lldb-build/tools/lld/include -I /Applications/Xcode.app/Contents/Developer/Platforms/MacOSX.platform/Developer/SDKs/MacOSX10.15.sdk/usr/include/libxml2 -I /Users/buildslave/jenkins/workspace/lldb-cmake/lldb-build/include -I /Users/buildslave/jenkins/workspace/lldb-cmake/llvm-project/llvm/include /Users/buildslave/jenkins/workspace/lldb-cmake/llvm-project/lld/MinGW/Options.td --write-if-changed -o tools/lld/MinGW/Options.inc -d tools/lld/MinGW/Options.inc.d
[45/1351] /Users/buildslave/jenkins/workspace/lldb-cmake/host-compiler/bin/clang++  -DGTEST_HAS_RTTI=0 -D_DEBUG -D__STDC_CONSTANT_MACROS -D__STDC_FORMAT_MACROS -D__STDC_LIMIT_MACROS -Itools/lld/MachO -I/Users/buildslave/jenkins/workspace/lldb-cmake/llvm-project/lld/MachO -I/Users/buildslave/jenkins/workspace/lldb-cmake/llvm-project/lld/include -Itools/lld/include -I/Applications/Xcode.app/Contents/Developer/Platforms/MacOSX.platform/Developer/SDKs/MacOSX10.15.sdk/usr/include/libxml2 -Iinclude -I/Users/buildslave/jenkins/workspace/lldb-cmake/llvm-project/llvm/include -Wdocumentation -fPIC -fvisibility-inlines-hidden -Werror=date-time -Werror=unguarded-availability-new -fmodules -fmodules-cache-path=/Users/buildslave/jenkins/workspace/lldb-cmake/lldb-build/module.cache -fcxx-modules -Xclang -fmodules-local-submodule-visibility -Wall -Wextra -Wno-unused-parameter -Wwrite-strings -Wcast-qual -Wmissing-field-initializers -pedantic -Wno-long-long -Wimplicit-fallthrough -Wcovered-switch-default -Wno-noexcept-type -Wnon-virtual-dtor -Wdelete-non-virtual-dtor -Wstring-conversion -fdiagnostics-color -O3  -isysroot /Applications/Xcode.app/Contents/Developer/Platforms/MacOSX.platform/Developer/SDKs/MacOSX10.15.sdk    -fno-exceptions -fno-rtti -UNDEBUG -std=c++14 -MD -MT tools/lld/MachO/CMakeFiles/lldMachO2.dir/Arch/X86_64.cpp.o -MF tools/lld/MachO/CMakeFiles/lldMachO2.dir/Arch/X86_64.cpp.o.d -o tools/lld/MachO/CMakeFiles/lldMachO2.dir/Arch/X86_64.cpp.o -c /Users/buildslave/jenkins/workspace/lldb-cmake/llvm-project/lld/MachO/Arch/X86_64.cpp
[46/1351] /Users/buildslave/jenkins/workspace/lldb-cmake/host-compiler/bin/clang++  -DGTEST_HAS_RTTI=0 -D_DEBUG -D__STDC_CONSTANT_MACROS -D__STDC_FORMAT_MACROS -D__STDC_LIMIT_MACROS -Itools/lld/MachO -I/Users/buildslave/jenkins/workspace/lldb-cmake/llvm-project/lld/MachO -I/Users/buildslave/jenkins/workspace/lldb-cmake/llvm-project/lld/include -Itools/lld/include -I/Applications/Xcode.app/Contents/Developer/Platforms/MacOSX.platform/Developer/SDKs/MacOSX10.15.sdk/usr/include/libxml2 -Iinclude -I/Users/buildslave/jenkins/workspace/lldb-cmake/llvm-project/llvm/include -Wdocumentation -fPIC -fvisibility-inlines-hidden -Werror=date-time -Werror=unguarded-availability-new -fmodules -fmodules-cache-path=/Users/buildslave/jenkins/workspace/lldb-cmake/lldb-build/module.cache -fcxx-modules -Xclang -fmodules-local-submodule-visibility -Wall -Wextra -Wno-unused-parameter -Wwrite-strings -Wcast-qual -Wmissing-field-initializers -pedantic -Wno-long-long -Wimplicit-fallthrough -Wcovered-switch-default -Wno-noexcept-type -Wnon-virtual-dtor -Wdelete-non-virtual-dtor -Wstring-conversion -fdiagnostics-color -O3  -isysroot /Applications/Xcode.app/Contents/Developer/Platforms/MacOSX.platform/Developer/SDKs/MacOSX10.15.sdk    -fno-exceptions -fno-rtti -UNDEBUG -std=c++14 -MD -MT tools/lld/MachO/CMakeFiles/lldMachO2.dir/ExportTrie.cpp.o -MF tools/lld/MachO/CMakeFiles/lldMachO2.dir/ExportTrie.cpp.o.d -o tools/lld/MachO/CMakeFiles/lldMachO2.dir/ExportTrie.cpp.o -c /Users/buildslave/jenkins/workspace/lldb-cmake/llvm-project/lld/MachO/ExportTrie.cpp
[47/1351] /Users/buildslave/jenkins/workspace/lldb-cmake/host-compiler/bin/clang++  -DGTEST_HAS_RTTI=0 -D_DEBUG -D__STDC_CONSTANT_MACROS -D__STDC_FORMAT_MACROS -D__STDC_LIMIT_MACROS -Itools/lld/ELF -I/Users/buildslave/jenkins/workspace/lldb-cmake/llvm-project/lld/ELF -I/Users/buildslave/jenkins/workspace/lldb-cmake/llvm-project/lld/include -Itools/lld/include -I/Applications/Xcode.app/Contents/Developer/Platforms/MacOSX.platform/Developer/SDKs/MacOSX10.15.sdk/usr/include/libxml2 -Iinclude -I/Users/buildslave/jenkins/workspace/lldb-cmake/llvm-project/llvm/include -Wdocumentation -fPIC -fvisibility-inlines-hidden -Werror=date-time -Werror=unguarded-availability-new -fmodules -fmodules-cache-path=/Users/buildslave/jenkins/workspace/lldb-cmake/lldb-build/module.cache -fcxx-modules -Xclang -fmodules-local-submodule-visibility -Wall -Wextra -Wno-unused-parameter -Wwrite-strings -Wcast-qual -Wmissing-field-initializers -pedantic -Wno-long-long -Wimplicit-fallthrough -Wcovered-switch-default -Wno-noexcept-type -Wnon-virtual-dtor -Wdelete-non-virtual-dtor -Wstring-conversion -fdiagnostics-color -O3  -isysroot /Applications/Xcode.app/Contents/Developer/Platforms/MacOSX.platform/Developer/SDKs/MacOSX10.15.sdk    -fno-exceptions -fno-rtti -UNDEBUG -std=c++14 -MD -MT tools/lld/ELF/CMakeFiles/lldELF.dir/Thunks.cpp.o -MF tools/lld/ELF/CMakeFiles/lldELF.dir/Thunks.cpp.o.d -o tools/lld/ELF/CMakeFiles/lldELF.dir/Thunks.cpp.o -c /Users/buildslave/jenkins/workspace/lldb-cmake/llvm-project/lld/ELF/Thunks.cpp
[48/1351] /Users/buildslave/jenkins/workspace/lldb-cmake/host-compiler/bin/clang++  -DGTEST_HAS_RTTI=0 -D_DEBUG -D__STDC_CONSTANT_MACROS -D__STDC_FORMAT_MACROS -D__STDC_LIMIT_MACROS -Itools/lld/MachO -I/Users/buildslave/jenkins/workspace/lldb-cmake/llvm-project/lld/MachO -I/Users/buildslave/jenkins/workspace/lldb-cmake/llvm-project/lld/include -Itools/lld/include -I/Applications/Xcode.app/Contents/Developer/Platforms/MacOSX.platform/Developer/SDKs/MacOSX10.15.sdk/usr/include/libxml2 -Iinclude -I/Users/buildslave/jenkins/workspace/lldb-cmake/llvm-project/llvm/include -Wdocumentation -fPIC -fvisibility-inlines-hidden -Werror=date-time -Werror=unguarded-availability-new -fmodules -fmodules-cache-path=/Users/buildslave/jenkins/workspace/lldb-cmake/lldb-build/module.cache -fcxx-modules -Xclang -fmodules-local-submodule-visibility -Wall -Wextra -Wno-unused-parameter -Wwrite-strings -Wcast-qual -Wmissing-field-initializers -pedantic -Wno-long-long -Wimplicit-fallthrough -Wcovered-switch-default -Wno-noexcept-type -Wnon-virtual-dtor -Wdelete-non-virtual-dtor -Wstring-conversion -fdiagnostics-color -O3  -isysroot /Applications/Xcode.app/Contents/Developer/Platforms/MacOSX.platform/Developer/SDKs/MacOSX10.15.sdk    -fno-exceptions -fno-rtti -UNDEBUG -std=c++14 -MD -MT tools/lld/MachO/CMakeFiles/lldMachO2.dir/InputSection.cpp.o -MF tools/lld/MachO/CMakeFiles/lldMachO2.dir/InputSection.cpp.o.d -o tools/lld/MachO/CMakeFiles/lldMachO2.dir/InputSection.cpp.o -c /Users/buildslave/jenkins/workspace/lldb-cmake/llvm-project/lld/MachO/InputSection.cpp
[49/1351] /Users/buildslave/jenkins/workspace/lldb-cmake/host-compiler/bin/clang++  -DGTEST_HAS_RTTI=0 -D_DEBUG -D__STDC_CONSTANT_MACROS -D__STDC_FORMAT_MACROS -D__STDC_LIMIT_MACROS -Itools/lld/MachO -I/Users/buildslave/jenkins/workspace/lldb-cmake/llvm-project/lld/MachO -I/Users/buildslave/jenkins/workspace/lldb-cmake/llvm-project/lld/include -Itools/lld/include -I/Applications/Xcode.app/Contents/Developer/Platforms/MacOSX.platform/Developer/SDKs/MacOSX10.15.sdk/usr/include/libxml2 -Iinclude -I/Users/buildslave/jenkins/workspace/lldb-cmake/llvm-project/llvm/include -Wdocumentation -fPIC -fvisibility-inlines-hidden -Werror=date-time -Werror=unguarded-availability-new -fmodules -fmodules-cache-path=/Users/buildslave/jenkins/workspace/lldb-cmake/lldb-build/module.cache -fcxx-modules -Xclang -fmodules-local-submodule-visibility -Wall -Wextra -Wno-unused-parameter -Wwrite-strings -Wcast-qual -Wmissing-field-initializers -pedantic -Wno-long-long -Wimplicit-fallthrough -Wcovered-switch-default -Wno-noexcept-type -Wnon-virtual-dtor -Wdelete-non-virtual-dtor -Wstring-conversion -fdiagnostics-color -O3  -isysroot /Applications/Xcode.app/Contents/Developer/Platforms/MacOSX.platform/Developer/SDKs/MacOSX10.15.sdk    -fno-exceptions -fno-rtti -UNDEBUG -std=c++14 -MD -MT tools/lld/MachO/CMakeFiles/lldMachO2.dir/MergedOutputSection.cpp.o -MF tools/lld/MachO/CMakeFiles/lldMachO2.dir/MergedOutputSection.cpp.o.d -o tools/lld/MachO/CMakeFiles/lldMachO2.dir/MergedOutputSection.cpp.o -c /Users/buildslave/jenkins/workspace/lldb-cmake/llvm-project/lld/MachO/MergedOutputSection.cpp
[50/1351] /Users/buildslave/jenkins/workspace/lldb-cmake/host-compiler/bin/clang++  -DGTEST_HAS_RTTI=0 -D_DEBUG -D__STDC_CONSTANT_MACROS -D__STDC_FORMAT_MACROS -D__STDC_LIMIT_MACROS -Itools/lld/MachO -I/Users/buildslave/jenkins/workspace/lldb-cmake/llvm-project/lld/MachO -I/Users/buildslave/jenkins/workspace/lldb-cmake/llvm-project/lld/include -Itools/lld/include -I/Applications/Xcode.app/Contents/Developer/Platforms/MacOSX.platform/Developer/SDKs/MacOSX10.15.sdk/usr/include/libxml2 -Iinclude -I/Users/buildslave/jenkins/workspace/lldb-cmake/llvm-project/llvm/include -Wdocumentation -fPIC -fvisibility-inlines-hidden -Werror=date-time -Werror=unguarded-availability-new -fmodules -fmodules-cache-path=/Users/buildslave/jenkins/workspace/lldb-cmake/lldb-build/module.cache -fcxx-modules -Xclang -fmodules-local-submodule-visibility -Wall -Wextra -Wno-unused-parameter -Wwrite-strings -Wcast-qual -Wmissing-field-initializers -pedantic -Wno-long-long -Wimplicit-fallthrough -Wcovered-switch-default -Wno-noexcept-type -Wnon-virtual-dtor -Wdelete-non-virtual-dtor -Wstring-conversion -fdiagnostics-color -O3  -isysroot /Applications/Xcode.app/Contents/Developer/Platforms/MacOSX.platform/Developer/SDKs/MacOSX10.15.sdk    -fno-exceptions -fno-rtti -UNDEBUG -std=c++14 -MD -MT tools/lld/MachO/CMakeFiles/lldMachO2.dir/OutputSection.cpp.o -MF tools/lld/MachO/CMakeFiles/lldMachO2.dir/OutputSection.cpp.o.d -o tools/lld/MachO/CMakeFiles/lldMachO2.dir/OutputSection.cpp.o -c /Users/buildslave/jenkins/workspace/lldb-cmake/llvm-project/lld/MachO/OutputSection.cpp
[51/1351] /Users/buildslave/jenkins/workspace/lldb-cmake/host-compiler/bin/clang++  -DGTEST_HAS_RTTI=0 -D_DEBUG -D__STDC_CONSTANT_MACROS -D__STDC_FORMAT_MACROS -D__STDC_LIMIT_MACROS -Itools/lld/COFF -I/Users/buildslave/jenkins/workspace/lldb-cmake/llvm-project/lld/COFF -I/Users/buildslave/jenkins/workspace/lldb-cmake/llvm-project/lld/include -Itools/lld/include -I/Applications/Xcode.app/Contents/Developer/Platforms/MacOSX.platform/Developer/SDKs/MacOSX10.15.sdk/usr/include/libxml2 -Iinclude -I/Users/buildslave/jenkins/workspace/lldb-cmake/llvm-project/llvm/include -Wdocumentation -fPIC -fvisibility-inlines-hidden -Werror=date-time -Werror=unguarded-availability-new -fmodules -fmodules-cache-path=/Users/buildslave/jenkins/workspace/lldb-cmake/lldb-build/module.cache -fcxx-modules -Xclang -fmodules-local-submodule-visibility -Wall -Wextra -Wno-unused-parameter -Wwrite-strings -Wcast-qual -Wmissing-field-initializers -pedantic -Wno-long-long -Wimplicit-fallthrough -Wcovered-switch-default -Wno-noexcept-type -Wnon-virtual-dtor -Wdelete-non-virtual-dtor -Wstring-conversion -fdiagnostics-color -O3  -isysroot /Applications/Xcode.app/Contents/Developer/Platforms/MacOSX.platform/Developer/SDKs/MacOSX10.15.sdk    -fno-exceptions -fno-rtti -UNDEBUG -std=c++14 -MD -MT tools/lld/COFF/CMakeFiles/lldCOFF.dir/Driver.cpp.o -MF tools/lld/COFF/CMakeFiles/lldCOFF.dir/Driver.cpp.o.d -o tools/lld/COFF/CMakeFiles/lldCOFF.dir/Driver.cpp.o -c /Users/buildslave/jenkins/workspace/lldb-cmake/llvm-project/lld/COFF/Driver.cpp
[52/1351] : && "/Applications/Xcode.app/Contents/Developer/Toolchains/XcodeDefault.xctoolchain/usr/bin/libtool" -static -no_warning_for_no_symbols -o lib/liblldCOFF.a  tools/lld/COFF/CMakeFiles/lldCOFF.dir/Chunks.cpp.o tools/lld/COFF/CMakeFiles/lldCOFF.dir/DebugTypes.cpp.o tools/lld/COFF/CMakeFiles/lldCOFF.dir/DLL.cpp.o tools/lld/COFF/CMakeFiles/lldCOFF.dir/Driver.cpp.o tools/lld/COFF/CMakeFiles/lldCOFF.dir/DriverUtils.cpp.o tools/lld/COFF/CMakeFiles/lldCOFF.dir/ICF.cpp.o tools/lld/COFF/CMakeFiles/lldCOFF.dir/InputFiles.cpp.o tools/lld/COFF/CMakeFiles/lldCOFF.dir/LLDMapFile.cpp.o tools/lld/COFF/CMakeFiles/lldCOFF.dir/LTO.cpp.o tools/lld/COFF/CMakeFiles/lldCOFF.dir/MapFile.cpp.o tools/lld/COFF/CMakeFiles/lldCOFF.dir/MarkLive.cpp.o tools/lld/COFF/CMakeFiles/lldCOFF.dir/MinGW.cpp.o tools/lld/COFF/CMakeFiles/lldCOFF.dir/PDB.cpp.o tools/lld/COFF/CMakeFiles/lldCOFF.dir/SymbolTable.cpp.o tools/lld/COFF/CMakeFiles/lldCOFF.dir/Symbols.cpp.o tools/lld/COFF/CMakeFiles/lldCOFF.dir/Writer.cpp.o && :
[53/1351] /Users/buildslave/jenkins/workspace/lldb-cmake/host-compiler/bin/clang++  -DGTEST_HAS_RTTI=0 -D_DEBUG -D__STDC_CONSTANT_MACROS -D__STDC_FORMAT_MACROS -D__STDC_LIMIT_MACROS -Itools/lld/MachO -I/Users/buildslave/jenkins/workspace/lldb-cmake/llvm-project/lld/MachO -I/Users/buildslave/jenkins/workspace/lldb-cmake/llvm-project/lld/include -Itools/lld/include -I/Applications/Xcode.app/Contents/Developer/Platforms/MacOSX.platform/Developer/SDKs/MacOSX10.15.sdk/usr/include/libxml2 -Iinclude -I/Users/buildslave/jenkins/workspace/lldb-cmake/llvm-project/llvm/include -Wdocumentation -fPIC -fvisibility-inlines-hidden -Werror=date-time -Werror=unguarded-availability-new -fmodules -fmodules-cache-path=/Users/buildslave/jenkins/workspace/lldb-cmake/lldb-build/module.cache -fcxx-modules -Xclang -fmodules-local-submodule-visibility -Wall -Wextra -Wno-unused-parameter -Wwrite-strings -Wcast-qual -Wmissing-field-initializers -pedantic -Wno-long-long -Wimplicit-fallthrough -Wcovered-switch-default -Wno-noexcept-type -Wnon-virtual-dtor -Wdelete-non-virtual-dtor -Wstring-conversion -fdiagnostics-color -O3  -isysroot /Applications/Xcode.app/Contents/Developer/Platforms/MacOSX.platform/Developer/SDKs/MacOSX10.15.sdk    -fno-exceptions -fno-rtti -UNDEBUG -std=c++14 -MD -MT tools/lld/MachO/CMakeFiles/lldMachO2.dir/OutputSegment.cpp.o -MF tools/lld/MachO/CMakeFiles/lldMachO2.dir/OutputSegment.cpp.o.d -o tools/lld/MachO/CMakeFiles/lldMachO2.dir/OutputSegment.cpp.o -c /Users/buildslave/jenkins/workspace/lldb-cmake/llvm-project/lld/MachO/OutputSegment.cpp
[54/1351] /Users/buildslave/jenkins/workspace/lldb-cmake/host-compiler/bin/clang++  -DGTEST_HAS_RTTI=0 -D_DEBUG -D__STDC_CONSTANT_MACROS -D__STDC_FORMAT_MACROS -D__STDC_LIMIT_MACROS -Itools/lld/MachO -I/Users/buildslave/jenkins/workspace/lldb-cmake/llvm-project/lld/MachO -I/Users/buildslave/jenkins/workspace/lldb-cmake/llvm-project/lld/include -Itools/lld/include -I/Applications/Xcode.app/Contents/Developer/Platforms/MacOSX.platform/Developer/SDKs/MacOSX10.15.sdk/usr/include/libxml2 -Iinclude -I/Users/buildslave/jenkins/workspace/lldb-cmake/llvm-project/llvm/include -Wdocumentation -fPIC -fvisibility-inlines-hidden -Werror=date-time -Werror=unguarded-availability-new -fmodules -fmodules-cache-path=/Users/buildslave/jenkins/workspace/lldb-cmake/lldb-build/module.cache -fcxx-modules -Xclang -fmodules-local-submodule-visibility -Wall -Wextra -Wno-unused-parameter -Wwrite-strings -Wcast-qual -Wmissing-field-initializers -pedantic -Wno-long-long -Wimplicit-fallthrough -Wcovered-switch-default -Wno-noexcept-type -Wnon-virtual-dtor -Wdelete-non-virtual-dtor -Wstring-conversion -fdiagnostics-color -O3  -isysroot /Applications/Xcode.app/Contents/Developer/Platforms/MacOSX.platform/Developer/SDKs/MacOSX10.15.sdk    -fno-exceptions -fno-rtti -UNDEBUG -std=c++14 -MD -MT tools/lld/MachO/CMakeFiles/lldMachO2.dir/SymbolTable.cpp.o -MF tools/lld/MachO/CMakeFiles/lldMachO2.dir/SymbolTable.cpp.o.d -o tools/lld/MachO/CMakeFiles/lldMachO2.dir/SymbolTable.cpp.o -c /Users/buildslave/jenkins/workspace/lldb-cmake/llvm-project/lld/MachO/SymbolTable.cpp
[55/1351] /Users/buildslave/jenkins/workspace/lldb-cmake/host-compiler/bin/clang++  -DGTEST_HAS_RTTI=0 -D_DEBUG -D__STDC_CONSTANT_MACROS -D__STDC_FORMAT_MACROS -D__STDC_LIMIT_MACROS -Itools/lld/MachO -I/Users/buildslave/jenkins/workspace/lldb-cmake/llvm-project/lld/MachO -I/Users/buildslave/jenkins/workspace/lldb-cmake/llvm-project/lld/include -Itools/lld/include -I/Applications/Xcode.app/Contents/Developer/Platforms/MacOSX.platform/Developer/SDKs/MacOSX10.15.sdk/usr/include/libxml2 -Iinclude -I/Users/buildslave/jenkins/workspace/lldb-cmake/llvm-project/llvm/include -Wdocumentation -fPIC -fvisibility-inlines-hidden -Werror=date-time -Werror=unguarded-availability-new -fmodules -fmodules-cache-path=/Users/buildslave/jenkins/workspace/lldb-cmake/lldb-build/module.cache -fcxx-modules -Xclang -fmodules-local-submodule-visibility -Wall -Wextra -Wno-unused-parameter -Wwrite-strings -Wcast-qual -Wmissing-field-initializers -pedantic -Wno-long-long -Wimplicit-fallthrough -Wcovered-switch-default -Wno-noexcept-type -Wnon-virtual-dtor -Wdelete-non-virtual-dtor -Wstring-conversion -fdiagnostics-color -O3  -isysroot /Applications/Xcode.app/Contents/Developer/Platforms/MacOSX.platform/Developer/SDKs/MacOSX10.15.sdk    -fno-exceptions -fno-rtti -UNDEBUG -std=c++14 -MD -MT tools/lld/MachO/CMakeFiles/lldMachO2.dir/Driver.cpp.o -MF tools/lld/MachO/CMakeFiles/lldMachO2.dir/Driver.cpp.o.d -o tools/lld/MachO/CMakeFiles/lldMachO2.dir/Driver.cpp.o -c /Users/buildslave/jenkins/workspace/lldb-cmake/llvm-project/lld/MachO/Driver.cpp
[56/1351] /Users/buildslave/jenkins/workspace/lldb-cmake/host-compiler/bin/clang++  -DGTEST_HAS_RTTI=0 -D_DEBUG -D__STDC_CONSTANT_MACROS -D__STDC_FORMAT_MACROS -D__STDC_LIMIT_MACROS -Itools/lld/MachO -I/Users/buildslave/jenkins/workspace/lldb-cmake/llvm-project/lld/MachO -I/Users/buildslave/jenkins/workspace/lldb-cmake/llvm-project/lld/include -Itools/lld/include -I/Applications/Xcode.app/Contents/Developer/Platforms/MacOSX.platform/Developer/SDKs/MacOSX10.15.sdk/usr/include/libxml2 -Iinclude -I/Users/buildslave/jenkins/workspace/lldb-cmake/llvm-project/llvm/include -Wdocumentation -fPIC -fvisibility-inlines-hidden -Werror=date-time -Werror=unguarded-availability-new -fmodules -fmodules-cache-path=/Users/buildslave/jenkins/workspace/lldb-cmake/lldb-build/module.cache -fcxx-modules -Xclang -fmodules-local-submodule-visibility -Wall -Wextra -Wno-unused-parameter -Wwrite-strings -Wcast-qual -Wmissing-field-initializers -pedantic -Wno-long-long -Wimplicit-fallthrough -Wcovered-switch-default -Wno-noexcept-type -Wnon-virtual-dtor -Wdelete-non-virtual-dtor -Wstring-conversion -fdiagnostics-color -O3  -isysroot /Applications/Xcode.app/Contents/Developer/Platforms/MacOSX.platform/Developer/SDKs/MacOSX10.15.sdk    -fno-exceptions -fno-rtti -UNDEBUG -std=c++14 -MD -MT tools/lld/MachO/CMakeFiles/lldMachO2.dir/Symbols.cpp.o -MF tools/lld/MachO/CMakeFiles/lldMachO2.dir/Symbols.cpp.o.d -o tools/lld/MachO/CMakeFiles/lldMachO2.dir/Symbols.cpp.o -c /Users/buildslave/jenkins/workspace/lldb-cmake/llvm-project/lld/MachO/Symbols.cpp
[57/1351] /Users/buildslave/jenkins/workspace/lldb-cmake/host-compiler/bin/clang++  -DGTEST_HAS_RTTI=0 -D_DEBUG -D__STDC_CONSTANT_MACROS -D__STDC_FORMAT_MACROS -D__STDC_LIMIT_MACROS -Itools/lld/MachO -I/Users/buildslave/jenkins/workspace/lldb-cmake/llvm-project/lld/MachO -I/Users/buildslave/jenkins/workspace/lldb-cmake/llvm-project/lld/include -Itools/lld/include -I/Applications/Xcode.app/Contents/Developer/Platforms/MacOSX.platform/Developer/SDKs/MacOSX10.15.sdk/usr/include/libxml2 -Iinclude -I/Users/buildslave/jenkins/workspace/lldb-cmake/llvm-project/llvm/include -Wdocumentation -fPIC -fvisibility-inlines-hidden -Werror=date-time -Werror=unguarded-availability-new -fmodules -fmodules-cache-path=/Users/buildslave/jenkins/workspace/lldb-cmake/lldb-build/module.cache -fcxx-modules -Xclang -fmodules-local-submodule-visibility -Wall -Wextra -Wno-unused-parameter -Wwrite-strings -Wcast-qual -Wmissing-field-initializers -pedantic -Wno-long-long -Wimplicit-fallthrough -Wcovered-switch-default -Wno-noexcept-type -Wnon-virtual-dtor -Wdelete-non-virtual-dtor -Wstring-conversion -fdiagnostics-color -O3  -isysroot /Applications/Xcode.app/Contents/Developer/Platforms/MacOSX.platform/Developer/SDKs/MacOSX10.15.sdk    -fno-exceptions -fno-rtti -UNDEBUG -std=c++14 -MD -MT tools/lld/MachO/CMakeFiles/lldMachO2.dir/Target.cpp.o -MF tools/lld/MachO/CMakeFiles/lldMachO2.dir/Target.cpp.o.d -o tools/lld/MachO/CMakeFiles/lldMachO2.dir/Target.cpp.o -c /Users/buildslave/jenkins/workspace/lldb-cmake/llvm-project/lld/MachO/Target.cpp
[58/1351] /Users/buildslave/jenkins/workspace/lldb-cmake/host-compiler/bin/clang++  -DGTEST_HAS_RTTI=0 -D_DEBUG -D__STDC_CONSTANT_MACROS -D__STDC_FORMAT_MACROS -D__STDC_LIMIT_MACROS -Itools/lld/MachO -I/Users/buildslave/jenkins/workspace/lldb-cmake/llvm-project/lld/MachO -I/Users/buildslave/jenkins/workspace/lldb-cmake/llvm-project/lld/include -Itools/lld/include -I/Applications/Xcode.app/Contents/Developer/Platforms/MacOSX.platform/Developer/SDKs/MacOSX10.15.sdk/usr/include/libxml2 -Iinclude -I/Users/buildslave/jenkins/workspace/lldb-cmake/llvm-project/llvm/include -Wdocumentation -fPIC -fvisibility-inlines-hidden -Werror=date-time -Werror=unguarded-availability-new -fmodules -fmodules-cache-path=/Users/buildslave/jenkins/workspace/lldb-cmake/lldb-build/module.cache -fcxx-modules -Xclang -fmodules-local-submodule-visibility -Wall -Wextra -Wno-unused-parameter -Wwrite-strings -Wcast-qual -Wmissing-field-initializers -pedantic -Wno-long-long -Wimplicit-fallthrough -Wcovered-switch-default -Wno-noexcept-type -Wnon-virtual-dtor -Wdelete-non-virtual-dtor -Wstring-conversion -fdiagnostics-color -O3  -isysroot /Applications/Xcode.app/Contents/Developer/Platforms/MacOSX.platform/Developer/SDKs/MacOSX10.15.sdk    -fno-exceptions -fno-rtti -UNDEBUG -std=c++14 -MD -MT tools/lld/MachO/CMakeFiles/lldMachO2.dir/InputFiles.cpp.o -MF tools/lld/MachO/CMakeFiles/lldMachO2.dir/InputFiles.cpp.o.d -o tools/lld/MachO/CMakeFiles/lldMachO2.dir/InputFiles.cpp.o -c /Users/buildslave/jenkins/workspace/lldb-cmake/llvm-project/lld/MachO/InputFiles.cpp
[59/1351] cd /Users/buildslave/jenkins/workspace/lldb-cmake/lldb-build && /Users/buildslave/jenkins/workspace/lldb-cmake/lldb-build/bin/llvm-tblgen -gen-opt-parser-defs -I /Users/buildslave/jenkins/workspace/lldb-cmake/llvm-project/lld/wasm -I /Users/buildslave/jenkins/workspace/lldb-cmake/llvm-project/lld/include -I /Users/buildslave/jenkins/workspace/lldb-cmake/lldb-build/tools/lld/include -I /Applications/Xcode.app/Contents/Developer/Platforms/MacOSX.platform/Developer/SDKs/MacOSX10.15.sdk/usr/include/libxml2 -I /Users/buildslave/jenkins/workspace/lldb-cmake/lldb-build/include -I /Users/buildslave/jenkins/workspace/lldb-cmake/llvm-project/llvm/include /Users/buildslave/jenkins/workspace/lldb-cmake/llvm-project/lld/wasm/Options.td --write-if-changed -o tools/lld/wasm/Options.inc -d tools/lld/wasm/Options.inc.d
[60/1351] /Users/buildslave/jenkins/workspace/lldb-cmake/host-compiler/bin/clang++  -DGTEST_HAS_RTTI=0 -D_DEBUG -D__STDC_CONSTANT_MACROS -D__STDC_FORMAT_MACROS -D__STDC_LIMIT_MACROS -Itools/lld/tools/lld -I/Users/buildslave/jenkins/workspace/lldb-cmake/llvm-project/lld/tools/lld -I/Users/buildslave/jenkins/workspace/lldb-cmake/llvm-project/lld/include -Itools/lld/include -I/Applications/Xcode.app/Contents/Developer/Platforms/MacOSX.platform/Developer/SDKs/MacOSX10.15.sdk/usr/include/libxml2 -Iinclude -I/Users/buildslave/jenkins/workspace/lldb-cmake/llvm-project/llvm/include -Wdocumentation -fPIC -fvisibility-inlines-hidden -Werror=date-time -Werror=unguarded-availability-new -fmodules -fmodules-cache-path=/Users/buildslave/jenkins/workspace/lldb-cmake/lldb-build/module.cache -fcxx-modules -Xclang -fmodules-local-submodule-visibility -Wall -Wextra -Wno-unused-parameter -Wwrite-strings -Wcast-qual -Wmissing-field-initializers -pedantic -Wno-long-long -Wimplicit-fallthrough -Wcovered-switch-default -Wno-noexcept-type -Wnon-virtual-dtor -Wdelete-non-virtual-dtor -Wstring-conversion -fdiagnostics-color -O3  -isysroot /Applications/Xcode.app/Contents/Developer/Platforms/MacOSX.platform/Developer/SDKs/MacOSX10.15.sdk    -fno-exceptions -fno-rtti -UNDEBUG -std=c++14 -MD -MT tools/lld/tools/lld/CMakeFiles/lld.dir/lld.cpp.o -MF tools/lld/tools/lld/CMakeFiles/lld.dir/lld.cpp.o.d -o tools/lld/tools/lld/CMakeFiles/lld.dir/lld.cpp.o -c /Users/buildslave/jenkins/workspace/lldb-cmake/llvm-project/lld/tools/lld/lld.cpp
[61/1351] /Users/buildslave/jenkins/workspace/lldb-cmake/host-compiler/bin/clang++  -DGTEST_HAS_RTTI=0 -D_DEBUG -D__STDC_CONSTANT_MACROS -D__STDC_FORMAT_MACROS -D__STDC_LIMIT_MACROS -Itools/lld/ELF -I/Users/buildslave/jenkins/workspace/lldb-cmake/llvm-project/lld/ELF -I/Users/buildslave/jenkins/workspace/lldb-cmake/llvm-project/lld/include -Itools/lld/include -I/Applications/Xcode.app/Contents/Developer/Platforms/MacOSX.platform/Developer/SDKs/MacOSX10.15.sdk/usr/include/libxml2 -Iinclude -I/Users/buildslave/jenkins/workspace/lldb-cmake/llvm-project/llvm/include -Wdocumentation -fPIC -fvisibility-inlines-hidden -Werror=date-time -Werror=unguarded-availability-new -fmodules -fmodules-cache-path=/Users/buildslave/jenkins/workspace/lldb-cmake/lldb-build/module.cache -fcxx-modules -Xclang -fmodules-local-submodule-visibility -Wall -Wextra -Wno-unused-parameter -Wwrite-strings -Wcast-qual -Wmissing-field-initializers -pedantic -Wno-long-long -Wimplicit-fallthrough -Wcovered-switch-default -Wno-noexcept-type -Wnon-virtual-dtor -Wdelete-non-virtual-dtor -Wstring-conversion -fdiagnostics-color -O3  -isysroot /Applications/Xcode.app/Contents/Developer/Platforms/MacOSX.platform/Developer/SDKs/MacOSX10.15.sdk    -fno-exceptions -fno-rtti -UNDEBUG -std=c++14 -MD -MT tools/lld/ELF/CMakeFiles/lldELF.dir/Driver.cpp.o -MF tools/lld/ELF/CMakeFiles/lldELF.dir/Driver.cpp.o.d -o tools/lld/ELF/CMakeFiles/lldELF.dir/Driver.cpp.o -c /Users/buildslave/jenkins/workspace/lldb-cmake/llvm-project/lld/ELF/Driver.cpp
[62/1351] /Users/buildslave/jenkins/workspace/lldb-cmake/host-compiler/bin/clang++  -DGTEST_HAS_RTTI=0 -D_DEBUG -D__STDC_CONSTANT_MACROS -D__STDC_FORMAT_MACROS -D__STDC_LIMIT_MACROS -Itools/lld/MinGW -I/Users/buildslave/jenkins/workspace/lldb-cmake/llvm-project/lld/MinGW -I/Users/buildslave/jenkins/workspace/lldb-cmake/llvm-project/lld/include -Itools/lld/include -I/Applications/Xcode.app/Contents/Developer/Platforms/MacOSX.platform/Developer/SDKs/MacOSX10.15.sdk/usr/include/libxml2 -Iinclude -I/Users/buildslave/jenkins/workspace/lldb-cmake/llvm-project/llvm/include -Wdocumentation -fPIC -fvisibility-inlines-hidden -Werror=date-time -Werror=unguarded-availability-new -fmodules -fmodules-cache-path=/Users/buildslave/jenkins/workspace/lldb-cmake/lldb-build/module.cache -fcxx-modules -Xclang -fmodules-local-submodule-visibility -Wall -Wextra -Wno-unused-parameter -Wwrite-strings -Wcast-qual -Wmissing-field-initializers -pedantic -Wno-long-long -Wimplicit-fallthrough -Wcovered-switch-default -Wno-noexcept-type -Wnon-virtual-dtor -Wdelete-non-virtual-dtor -Wstring-conversion -fdiagnostics-color -O3  -isysroot /Applications/Xcode.app/Contents/Developer/Platforms/MacOSX.platform/Developer/SDKs/MacOSX10.15.sdk    -fno-exceptions -fno-rtti -UNDEBUG -std=c++14 -MD -MT tools/lld/MinGW/CMakeFiles/lldMinGW.dir/Driver.cpp.o -MF tools/lld/MinGW/CMakeFiles/lldMinGW.dir/Driver.cpp.o.d -o tools/lld/MinGW/CMakeFiles/lldMinGW.dir/Driver.cpp.o -c /Users/buildslave/jenkins/workspace/lldb-cmake/llvm-project/lld/MinGW/Driver.cpp
[63/1351] : && "/Applications/Xcode.app/Contents/Developer/Toolchains/XcodeDefault.xctoolchain/usr/bin/libtool" -static -no_warning_for_no_symbols -o lib/liblldMinGW.a  tools/lld/MinGW/CMakeFiles/lldMinGW.dir/Driver.cpp.o && :
[64/1351] /Users/buildslave/jenkins/workspace/lldb-cmake/host-compiler/bin/clang++  -DGTEST_HAS_RTTI=0 -D_DEBUG -D__STDC_CONSTANT_MACROS -D__STDC_FORMAT_MACROS -D__STDC_LIMIT_MACROS -Itools/lld/MachO -I/Users/buildslave/jenkins/workspace/lldb-cmake/llvm-project/lld/MachO -I/Users/buildslave/jenkins/workspace/lldb-cmake/llvm-project/lld/include -Itools/lld/include -I/Applications/Xcode.app/Contents/Developer/Platforms/MacOSX.platform/Developer/SDKs/MacOSX10.15.sdk/usr/include/libxml2 -Iinclude -I/Users/buildslave/jenkins/workspace/lldb-cmake/llvm-project/llvm/include -Wdocumentation -fPIC -fvisibility-inlines-hidden -Werror=date-time -Werror=unguarded-availability-new -fmodules -fmodules-cache-path=/Users/buildslave/jenkins/workspace/lldb-cmake/lldb-build/module.cache -fcxx-modules -Xclang -fmodules-local-submodule-visibility -Wall -Wextra -Wno-unused-parameter -Wwrite-strings -Wcast-qual -Wmissing-field-initializers -pedantic -Wno-long-long -Wimplicit-fallthrough -Wcovered-switch-default -Wno-noexcept-type -Wnon-virtual-dtor -Wdelete-non-virtual-dtor -Wstring-conversion -fdiagnostics-color -O3  -isysroot /Applications/Xcode.app/Contents/Developer/Platforms/MacOSX.platform/Developer/SDKs/MacOSX10.15.sdk    -fno-exceptions -fno-rtti -UNDEBUG -std=c++14 -MD -MT tools/lld/MachO/CMakeFiles/lldMachO2.dir/SyntheticSections.cpp.o -MF tools/lld/MachO/CMakeFiles/lldMachO2.dir/SyntheticSections.cpp.o.d -o tools/lld/MachO/CMakeFiles/lldMachO2.dir/SyntheticSections.cpp.o -c /Users/buildslave/jenkins/workspace/lldb-cmake/llvm-project/lld/MachO/SyntheticSections.cpp
[65/1351] /Users/buildslave/jenkins/workspace/lldb-cmake/host-compiler/bin/clang++  -DGTEST_HAS_RTTI=0 -D_DEBUG -D__STDC_CONSTANT_MACROS -D__STDC_FORMAT_MACROS -D__STDC_LIMIT_MACROS -Itools/lld/wasm -I/Users/buildslave/jenkins/workspace/lldb-cmake/llvm-project/lld/wasm -I/Users/buildslave/jenkins/workspace/lldb-cmake/llvm-project/lld/include -Itools/lld/include -I/Applications/Xcode.app/Contents/Developer/Platforms/MacOSX.platform/Developer/SDKs/MacOSX10.15.sdk/usr/include/libxml2 -Iinclude -I/Users/buildslave/jenkins/workspace/lldb-cmake/llvm-project/llvm/include -Wdocumentation -fPIC -fvisibility-inlines-hidden -Werror=date-time -Werror=unguarded-availability-new -fmodules -fmodules-cache-path=/Users/buildslave/jenkins/workspace/lldb-cmake/lldb-build/module.cache -fcxx-modules -Xclang -fmodules-local-submodule-visibility -Wall -Wextra -Wno-unused-parameter -Wwrite-strings -Wcast-qual -Wmissing-field-initializers -pedantic -Wno-long-long -Wimplicit-fallthrough -Wcovered-switch-default -Wno-noexcept-type -Wnon-virtual-dtor -Wdelete-non-virtual-dtor -Wstring-conversion -fdiagnostics-color -O3  -isysroot /Applications/Xcode.app/Contents/Developer/Platforms/MacOSX.platform/Developer/SDKs/MacOSX10.15.sdk    -fno-exceptions -fno-rtti -UNDEBUG -std=c++14 -MD -MT tools/lld/wasm/CMakeFiles/lldWasm.dir/Relocations.cpp.o -MF tools/lld/wasm/CMakeFiles/lldWasm.dir/Relocations.cpp.o.d -o tools/lld/wasm/CMakeFiles/lldWasm.dir/Relocations.cpp.o -c /Users/buildslave/jenkins/workspace/lldb-cmake/llvm-project/lld/wasm/Relocations.cpp
[66/1351] /Users/buildslave/jenkins/workspace/lldb-cmake/host-compiler/bin/clang++  -DGTEST_HAS_RTTI=0 -D_DEBUG -D__STDC_CONSTANT_MACROS -D__STDC_FORMAT_MACROS -D__STDC_LIMIT_MACROS -Itools/lld/wasm -I/Users/buildslave/jenkins/workspace/lldb-cmake/llvm-project/lld/wasm -I/Users/buildslave/jenkins/workspace/lldb-cmake/llvm-project/lld/include -Itools/lld/include -I/Applications/Xcode.app/Contents/Developer/Platforms/MacOSX.platform/Developer/SDKs/MacOSX10.15.sdk/usr/include/libxml2 -Iinclude -I/Users/buildslave/jenkins/workspace/lldb-cmake/llvm-project/llvm/include -Wdocumentation -fPIC -fvisibility-inlines-hidden -Werror=date-time -Werror=unguarded-availability-new -fmodules -fmodules-cache-path=/Users/buildslave/jenkins/workspace/lldb-cmake/lldb-build/module.cache -fcxx-modules -Xclang -fmodules-local-submodule-visibility -Wall -Wextra -Wno-unused-parameter -Wwrite-strings -Wcast-qual -Wmissing-field-initializers -pedantic -Wno-long-long -Wimplicit-fallthrough -Wcovered-switch-default -Wno-noexcept-type -Wnon-virtual-dtor -Wdelete-non-virtual-dtor -Wstring-conversion -fdiagnostics-color -O3  -isysroot /Applications/Xcode.app/Contents/Developer/Platforms/MacOSX.platform/Developer/SDKs/MacOSX10.15.sdk    -fno-exceptions -fno-rtti -UNDEBUG -std=c++14 -MD -MT tools/lld/wasm/CMakeFiles/lldWasm.dir/OutputSections.cpp.o -MF tools/lld/wasm/CMakeFiles/lldWasm.dir/OutputSections.cpp.o.d -o tools/lld/wasm/CMakeFiles/lldWasm.dir/OutputSections.cpp.o -c /Users/buildslave/jenkins/workspace/lldb-cmake/llvm-project/lld/wasm/OutputSections.cpp
[67/1351] /Users/buildslave/jenkins/workspace/lldb-cmake/host-compiler/bin/clang++  -DGTEST_HAS_RTTI=0 -D_DEBUG -D__STDC_CONSTANT_MACROS -D__STDC_FORMAT_MACROS -D__STDC_LIMIT_MACROS -Itools/lld/wasm -I/Users/buildslave/jenkins/workspace/lldb-cmake/llvm-project/lld/wasm -I/Users/buildslave/jenkins/workspace/lldb-cmake/llvm-project/lld/include -Itools/lld/include -I/Applications/Xcode.app/Contents/Developer/Platforms/MacOSX.platform/Developer/SDKs/MacOSX10.15.sdk/usr/include/libxml2 -Iinclude -I/Users/buildslave/jenkins/workspace/lldb-cmake/llvm-project/llvm/include -Wdocumentation -fPIC -fvisibility-inlines-hidden -Werror=date-time -Werror=unguarded-availability-new -fmodules -fmodules-cache-path=/Users/buildslave/jenkins/workspace/lldb-cmake/lldb-build/module.cache -fcxx-modules -Xclang -fmodules-local-submodule-visibility -Wall -Wextra -Wno-unused-parameter -Wwrite-strings -Wcast-qual -Wmissing-field-initializers -pedantic -Wno-long-long -Wimplicit-fallthrough -Wcovered-switch-default -Wno-noexcept-type -Wnon-virtual-dtor -Wdelete-non-virtual-dtor -Wstring-conversion -fdiagnostics-color -O3  -isysroot /Applications/Xcode.app/Contents/Developer/Platforms/MacOSX.platform/Developer/SDKs/MacOSX10.15.sdk    -fno-exceptions -fno-rtti -UNDEBUG -std=c++14 -MD -MT tools/lld/wasm/CMakeFiles/lldWasm.dir/InputChunks.cpp.o -MF tools/lld/wasm/CMakeFiles/lldWasm.dir/InputChunks.cpp.o.d -o tools/lld/wasm/CMakeFiles/lldWasm.dir/InputChunks.cpp.o -c /Users/buildslave/jenkins/workspace/lldb-cmake/llvm-project/lld/wasm/InputChunks.cpp
[68/1351] /Users/buildslave/jenkins/workspace/lldb-cmake/host-compiler/bin/clang++  -DGTEST_HAS_RTTI=0 -D_DEBUG -D__STDC_CONSTANT_MACROS -D__STDC_FORMAT_MACROS -D__STDC_LIMIT_MACROS -Itools/lld/ELF -I/Users/buildslave/jenkins/workspace/lldb-cmake/llvm-project/lld/ELF -I/Users/buildslave/jenkins/workspace/lldb-cmake/llvm-project/lld/include -Itools/lld/include -I/Applications/Xcode.app/Contents/Developer/Platforms/MacOSX.platform/Developer/SDKs/MacOSX10.15.sdk/usr/include/libxml2 -Iinclude -I/Users/buildslave/jenkins/workspace/lldb-cmake/llvm-project/llvm/include -Wdocumentation -fPIC -fvisibility-inlines-hidden -Werror=date-time -Werror=unguarded-availability-new -fmodules -fmodules-cache-path=/Users/buildslave/jenkins/workspace/lldb-cmake/lldb-build/module.cache -fcxx-modules -Xclang -fmodules-local-submodule-visibility -Wall -Wextra -Wno-unused-parameter -Wwrite-strings -Wcast-qual -Wmissing-field-initializers -pedantic -Wno-long-long -Wimplicit-fallthrough -Wcovered-switch-default -Wno-noexcept-type -Wnon-virtual-dtor -Wdelete-non-virtual-dtor -Wstring-conversion -fdiagnostics-color -O3  -isysroot /Applications/Xcode.app/Contents/Developer/Platforms/MacOSX.platform/Developer/SDKs/MacOSX10.15.sdk    -fno-exceptions -fno-rtti -UNDEBUG -std=c++14 -MD -MT tools/lld/ELF/CMakeFiles/lldELF.dir/Relocations.cpp.o -MF tools/lld/ELF/CMakeFiles/lldELF.dir/Relocations.cpp.o.d -o tools/lld/ELF/CMakeFiles/lldELF.dir/Relocations.cpp.o -c /Users/buildslave/jenkins/workspace/lldb-cmake/llvm-project/lld/ELF/Relocations.cpp
[69/1351] /Users/buildslave/jenkins/workspace/lldb-cmake/host-compiler/bin/clang++  -DGTEST_HAS_RTTI=0 -D_DEBUG -D__STDC_CONSTANT_MACROS -D__STDC_FORMAT_MACROS -D__STDC_LIMIT_MACROS -Itools/lld/MachO -I/Users/buildslave/jenkins/workspace/lldb-cmake/llvm-project/lld/MachO -I/Users/buildslave/jenkins/workspace/lldb-cmake/llvm-project/lld/include -Itools/lld/include -I/Applications/Xcode.app/Contents/Developer/Platforms/MacOSX.platform/Developer/SDKs/MacOSX10.15.sdk/usr/include/libxml2 -Iinclude -I/Users/buildslave/jenkins/workspace/lldb-cmake/llvm-project/llvm/include -Wdocumentation -fPIC -fvisibility-inlines-hidden -Werror=date-time -Werror=unguarded-availability-new -fmodules -fmodules-cache-path=/Users/buildslave/jenkins/workspace/lldb-cmake/lldb-build/module.cache -fcxx-modules -Xclang -fmodules-local-submodule-visibility -Wall -Wextra -Wno-unused-parameter -Wwrite-strings -Wcast-qual -Wmissing-field-initializers -pedantic -Wno-long-long -Wimplicit-fallthrough -Wcovered-switch-default -Wno-noexcept-type -Wnon-virtual-dtor -Wdelete-non-virtual-dtor -Wstring-conversion -fdiagnostics-color -O3  -isysroot /Applications/Xcode.app/Contents/Developer/Platforms/MacOSX.platform/Developer/SDKs/MacOSX10.15.sdk    -fno-exceptions -fno-rtti -UNDEBUG -std=c++14 -MD -MT tools/lld/MachO/CMakeFiles/lldMachO2.dir/Writer.cpp.o -MF tools/lld/MachO/CMakeFiles/lldMachO2.dir/Writer.cpp.o.d -o tools/lld/MachO/CMakeFiles/lldMachO2.dir/Writer.cpp.o -c /Users/buildslave/jenkins/workspace/lldb-cmake/llvm-project/lld/MachO/Writer.cpp
[70/1351] : && "/Applications/Xcode.app/Contents/Developer/Toolchains/XcodeDefault.xctoolchain/usr/bin/libtool" -static -no_warning_for_no_symbols -o lib/liblldMachO2.a  tools/lld/MachO/CMakeFiles/lldMachO2.dir/Arch/X86_64.cpp.o tools/lld/MachO/CMakeFiles/lldMachO2.dir/Driver.cpp.o tools/lld/MachO/CMakeFiles/lldMachO2.dir/ExportTrie.cpp.o tools/lld/MachO/CMakeFiles/lldMachO2.dir/InputFiles.cpp.o tools/lld/MachO/CMakeFiles/lldMachO2.dir/InputSection.cpp.o tools/lld/MachO/CMakeFiles/lldMachO2.dir/MergedOutputSection.cpp.o tools/lld/MachO/CMakeFiles/lldMachO2.dir/OutputSection.cpp.o tools/lld/MachO/CMakeFiles/lldMachO2.dir/OutputSegment.cpp.o tools/lld/MachO/CMakeFiles/lldMachO2.dir/SymbolTable.cpp.o tools/lld/MachO/CMakeFiles/lldMachO2.dir/Symbols.cpp.o tools/lld/MachO/CMakeFiles/lldMachO2.dir/SyntheticSections.cpp.o tools/lld/MachO/CMakeFiles/lldMachO2.dir/Target.cpp.o tools/lld/MachO/CMakeFiles/lldMachO2.dir/Writer.cpp.o && :
[71/1351] /Users/buildslave/jenkins/workspace/lldb-cmake/host-compiler/bin/clang++  -DGTEST_HAS_RTTI=0 -D_DEBUG -D__STDC_CONSTANT_MACROS -D__STDC_FORMAT_MACROS -D__STDC_LIMIT_MACROS -Itools/lld/wasm -I/Users/buildslave/jenkins/workspace/lldb-cmake/llvm-project/lld/wasm -I/Users/buildslave/jenkins/workspace/lldb-cmake/llvm-project/lld/include -Itools/lld/include -I/Applications/Xcode.app/Contents/Developer/Platforms/MacOSX.platform/Developer/SDKs/MacOSX10.15.sdk/usr/include/libxml2 -Iinclude -I/Users/buildslave/jenkins/workspace/lldb-cmake/llvm-project/llvm/include -Wdocumentation -fPIC -fvisibility-inlines-hidden -Werror=date-time -Werror=unguarded-availability-new -fmodules -fmodules-cache-path=/Users/buildslave/jenkins/workspace/lldb-cmake/lldb-build/module.cache -fcxx-modules -Xclang -fmodules-local-submodule-visibility -Wall -Wextra -Wno-unused-parameter -Wwrite-strings -Wcast-qual -Wmissing-field-initializers -pedantic -Wno-long-long -Wimplicit-fallthrough -Wcovered-switch-default -Wno-noexcept-type -Wnon-virtual-dtor -Wdelete-non-virtual-dtor -Wstring-conversion -fdiagnostics-color -O3  -isysroot /Applications/Xcode.app/Contents/Developer/Platforms/MacOSX.platform/Developer/SDKs/MacOSX10.15.sdk    -fno-exceptions -fno-rtti -UNDEBUG -std=c++14 -MD -MT tools/lld/wasm/CMakeFiles/lldWasm.dir/MarkLive.cpp.o -MF tools/lld/wasm/CMakeFiles/lldWasm.dir/MarkLive.cpp.o.d -o tools/lld/wasm/CMakeFiles/lldWasm.dir/MarkLive.cpp.o -c /Users/buildslave/jenkins/workspace/lldb-cmake/llvm-project/lld/wasm/MarkLive.cpp
[72/1351] /Users/buildslave/jenkins/workspace/lldb-cmake/host-compiler/bin/clang++  -DGTEST_HAS_RTTI=0 -D_DEBUG -D__STDC_CONSTANT_MACROS -D__STDC_FORMAT_MACROS -D__STDC_LIMIT_MACROS -Itools/lld/ELF -I/Users/buildslave/jenkins/workspace/lldb-cmake/llvm-project/lld/ELF -I/Users/buildslave/jenkins/workspace/lldb-cmake/llvm-project/lld/include -Itools/lld/include -I/Applications/Xcode.app/Contents/Developer/Platforms/MacOSX.platform/Developer/SDKs/MacOSX10.15.sdk/usr/include/libxml2 -Iinclude -I/Users/buildslave/jenkins/workspace/lldb-cmake/llvm-project/llvm/include -Wdocumentation -fPIC -fvisibility-inlines-hidden -Werror=date-time -Werror=unguarded-availability-new -fmodules -fmodules-cache-path=/Users/buildslave/jenkins/workspace/lldb-cmake/lldb-build/module.cache -fcxx-modules -Xclang -fmodules-local-submodule-visibility -Wall -Wextra -Wno-unused-parameter -Wwrite-strings -Wcast-qual -Wmissing-field-initializers -pedantic -Wno-long-long -Wimplicit-fallthrough -Wcovered-switch-default -Wno-noexcept-type -Wnon-virtual-dtor -Wdelete-non-virtual-dtor -Wstring-conversion -fdiagnostics-color -O3  -isysroot /Applications/Xcode.app/Contents/Developer/Platforms/MacOSX.platform/Developer/SDKs/MacOSX10.15.sdk    -fno-exceptions -fno-rtti -UNDEBUG -std=c++14 -MD -MT tools/lld/ELF/CMakeFiles/lldELF.dir/ScriptParser.cpp.o -MF tools/lld/ELF/CMakeFiles/lldELF.dir/ScriptParser.cpp.o.d -o tools/lld/ELF/CMakeFiles/lldELF.dir/ScriptParser.cpp.o -c /Users/buildslave/jenkins/workspace/lldb-cmake/llvm-project/lld/ELF/ScriptParser.cpp
[73/1351] /Users/buildslave/jenkins/workspace/lldb-cmake/host-compiler/bin/clang++  -DGTEST_HAS_RTTI=0 -D_DEBUG -D__STDC_CONSTANT_MACROS -D__STDC_FORMAT_MACROS -D__STDC_LIMIT_MACROS -Itools/lld/wasm -I/Users/buildslave/jenkins/workspace/lldb-cmake/llvm-project/lld/wasm -I/Users/buildslave/jenkins/workspace/lldb-cmake/llvm-project/lld/include -Itools/lld/include -I/Applications/Xcode.app/Contents/Developer/Platforms/MacOSX.platform/Developer/SDKs/MacOSX10.15.sdk/usr/include/libxml2 -Iinclude -I/Users/buildslave/jenkins/workspace/lldb-cmake/llvm-project/llvm/include -Wdocumentation -fPIC -fvisibility-inlines-hidden -Werror=date-time -Werror=unguarded-availability-new -fmodules -fmodules-cache-path=/Users/buildslave/jenkins/workspace/lldb-cmake/lldb-build/module.cache -fcxx-modules -Xclang -fmodules-local-submodule-visibility -Wall -Wextra -Wno-unused-parameter -Wwrite-strings -Wcast-qual -Wmissing-field-initializers -pedantic -Wno-long-long -Wimplicit-fallthrough -Wcovered-switch-default -Wno-noexcept-type -Wnon-virtual-dtor -Wdelete-non-virtual-dtor -Wstring-conversion -fdiagnostics-color -O3  -isysroot /Applications/Xcode.app/Contents/Developer/Platforms/MacOSX.platform/Developer/SDKs/MacOSX10.15.sdk    -fno-exceptions -fno-rtti -UNDEBUG -std=c++14 -MD -MT tools/lld/wasm/CMakeFiles/lldWasm.dir/LTO.cpp.o -MF tools/lld/wasm/CMakeFiles/lldWasm.dir/LTO.cpp.o.d -o tools/lld/wasm/CMakeFiles/lldWasm.dir/LTO.cpp.o -c /Users/buildslave/jenkins/workspace/lldb-cmake/llvm-project/lld/wasm/LTO.cpp
[74/1351] /Users/buildslave/jenkins/workspace/lldb-cmake/host-compiler/bin/clang++  -DGTEST_HAS_RTTI=0 -D_DEBUG -D__STDC_CONSTANT_MACROS -D__STDC_FORMAT_MACROS -D__STDC_LIMIT_MACROS -Itools/lld/wasm -I/Users/buildslave/jenkins/workspace/lldb-cmake/llvm-project/lld/wasm -I/Users/buildslave/jenkins/workspace/lldb-cmake/llvm-project/lld/include -Itools/lld/include -I/Applications/Xcode.app/Contents/Developer/Platforms/MacOSX.platform/Developer/SDKs/MacOSX10.15.sdk/usr/include/libxml2 -Iinclude -I/Users/buildslave/jenkins/workspace/lldb-cmake/llvm-project/llvm/include -Wdocumentation -fPIC -fvisibility-inlines-hidden -Werror=date-time -Werror=unguarded-availability-new -fmodules -fmodules-cache-path=/Users/buildslave/jenkins/workspace/lldb-cmake/lldb-build/module.cache -fcxx-modules -Xclang -fmodules-local-submodule-visibility -Wall -Wextra -Wno-unused-parameter -Wwrite-strings -Wcast-qual -Wmissing-field-initializers -pedantic -Wno-long-long -Wimplicit-fallthrough -Wcovered-switch-default -Wno-noexcept-type -Wnon-virtual-dtor -Wdelete-non-virtual-dtor -Wstring-conversion -fdiagnostics-color -O3  -isysroot /Applications/Xcode.app/Contents/Developer/Platforms/MacOSX.platform/Developer/SDKs/MacOSX10.15.sdk    -fno-exceptions -fno-rtti -UNDEBUG -std=c++14 -MD -MT tools/lld/wasm/CMakeFiles/lldWasm.dir/Symbols.cpp.o -MF tools/lld/wasm/CMakeFiles/lldWasm.dir/Symbols.cpp.o.d -o tools/lld/wasm/CMakeFiles/lldWasm.dir/Symbols.cpp.o -c /Users/buildslave/jenkins/workspace/lldb-cmake/llvm-project/lld/wasm/Symbols.cpp
[75/1351] /Users/buildslave/jenkins/workspace/lldb-cmake/host-compiler/bin/clang++  -DGTEST_HAS_RTTI=0 -D_DEBUG -D__STDC_CONSTANT_MACROS -D__STDC_FORMAT_MACROS -D__STDC_LIMIT_MACROS -Itools/lld/wasm -I/Users/buildslave/jenkins/workspace/lldb-cmake/llvm-project/lld/wasm -I/Users/buildslave/jenkins/workspace/lldb-cmake/llvm-project/lld/include -Itools/lld/include -I/Applications/Xcode.app/Contents/Developer/Platforms/MacOSX.platform/Developer/SDKs/MacOSX10.15.sdk/usr/include/libxml2 -Iinclude -I/Users/buildslave/jenkins/workspace/lldb-cmake/llvm-project/llvm/include -Wdocumentation -fPIC -fvisibility-inlines-hidden -Werror=date-time -Werror=unguarded-availability-new -fmodules -fmodules-cache-path=/Users/buildslave/jenkins/workspace/lldb-cmake/lldb-build/module.cache -fcxx-modules -Xclang -fmodules-local-submodule-visibility -Wall -Wextra -Wno-unused-parameter -Wwrite-strings -Wcast-qual -Wmissing-field-initializers -pedantic -Wno-long-long -Wimplicit-fallthrough -Wcovered-switch-default -Wno-noexcept-type -Wnon-virtual-dtor -Wdelete-non-virtual-dtor -Wstring-conversion -fdiagnostics-color -O3  -isysroot /Applications/Xcode.app/Contents/Developer/Platforms/MacOSX.platform/Developer/SDKs/MacOSX10.15.sdk    -fno-exceptions -fno-rtti -UNDEBUG -std=c++14 -MD -MT tools/lld/wasm/CMakeFiles/lldWasm.dir/WriterUtils.cpp.o -MF tools/lld/wasm/CMakeFiles/lldWasm.dir/WriterUtils.cpp.o.d -o tools/lld/wasm/CMakeFiles/lldWasm.dir/WriterUtils.cpp.o -c /Users/buildslave/jenkins/workspace/lldb-cmake/llvm-project/lld/wasm/WriterUtils.cpp
[76/1351] /Users/buildslave/jenkins/workspace/lldb-cmake/host-compiler/bin/clang++  -DGTEST_HAS_RTTI=0 -D_DEBUG -D__STDC_CONSTANT_MACROS -D__STDC_FORMAT_MACROS -D__STDC_LIMIT_MACROS -Itools/lld/wasm -I/Users/buildslave/jenkins/workspace/lldb-cmake/llvm-project/lld/wasm -I/Users/buildslave/jenkins/workspace/lldb-cmake/llvm-project/lld/include -Itools/lld/include -I/Applications/Xcode.app/Contents/Developer/Platforms/MacOSX.platform/Developer/SDKs/MacOSX10.15.sdk/usr/include/libxml2 -Iinclude -I/Users/buildslave/jenkins/workspace/lldb-cmake/llvm-project/llvm/include -Wdocumentation -fPIC -fvisibility-inlines-hidden -Werror=date-time -Werror=unguarded-availability-new -fmodules -fmodules-cache-path=/Users/buildslave/jenkins/workspace/lldb-cmake/lldb-build/module.cache -fcxx-modules -Xclang -fmodules-local-submodule-visibility -Wall -Wextra -Wno-unused-parameter -Wwrite-strings -Wcast-qual -Wmissing-field-initializers -pedantic -Wno-long-long -Wimplicit-fallthrough -Wcovered-switch-default -Wno-noexcept-type -Wnon-virtual-dtor -Wdelete-non-virtual-dtor -Wstring-conversion -fdiagnostics-color -O3  -isysroot /Applications/Xcode.app/Contents/Developer/Platforms/MacOSX.platform/Developer/SDKs/MacOSX10.15.sdk    -fno-exceptions -fno-rtti -UNDEBUG -std=c++14 -MD -MT tools/lld/wasm/CMakeFiles/lldWasm.dir/InputFiles.cpp.o -MF tools/lld/wasm/CMakeFiles/lldWasm.dir/InputFiles.cpp.o.d -o tools/lld/wasm/CMakeFiles/lldWasm.dir/InputFiles.cpp.o -c /Users/buildslave/jenkins/workspace/lldb-cmake/llvm-project/lld/wasm/InputFiles.cpp
[77/1351] /Users/buildslave/jenkins/workspace/lldb-cmake/host-compiler/bin/clang++  -DGTEST_HAS_RTTI=0 -D_DEBUG -D__STDC_CONSTANT_MACROS -D__STDC_FORMAT_MACROS -D__STDC_LIMIT_MACROS -Itools/lld/wasm -I/Users/buildslave/jenkins/workspace/lldb-cmake/llvm-project/lld/wasm -I/Users/buildslave/jenkins/workspace/lldb-cmake/llvm-project/lld/include -Itools/lld/include -I/Applications/Xcode.app/Contents/Developer/Platforms/MacOSX.platform/Developer/SDKs/MacOSX10.15.sdk/usr/include/libxml2 -Iinclude -I/Users/buildslave/jenkins/workspace/lldb-cmake/llvm-project/llvm/include -Wdocumentation -fPIC -fvisibility-inlines-hidden -Werror=date-time -Werror=unguarded-availability-new -fmodules -fmodules-cache-path=/Users/buildslave/jenkins/workspace/lldb-cmake/lldb-build/module.cache -fcxx-modules -Xclang -fmodules-local-submodule-visibility -Wall -Wextra -Wno-unused-parameter -Wwrite-strings -Wcast-qual -Wmissing-field-initializers -pedantic -Wno-long-long -Wimplicit-fallthrough -Wcovered-switch-default -Wno-noexcept-type -Wnon-virtual-dtor -Wdelete-non-virtual-dtor -Wstring-conversion -fdiagnostics-color -O3  -isysroot /Applications/Xcode.app/Contents/Developer/Platforms/MacOSX.platform/Developer/SDKs/MacOSX10.15.sdk    -fno-exceptions -fno-rtti -UNDEBUG -std=c++14 -MD -MT tools/lld/wasm/CMakeFiles/lldWasm.dir/Driver.cpp.o -MF tools/lld/wasm/CMakeFiles/lldWasm.dir/Driver.cpp.o.d -o tools/lld/wasm/CMakeFiles/lldWasm.dir/Driver.cpp.o -c /Users/buildslave/jenkins/workspace/lldb-cmake/llvm-project/lld/wasm/Driver.cpp
[78/1351] /Users/buildslave/jenkins/workspace/lldb-cmake/host-compiler/bin/clang++  -DGTEST_HAS_RTTI=0 -D_DEBUG -D__STDC_CONSTANT_MACROS -D__STDC_FORMAT_MACROS -D__STDC_LIMIT_MACROS -Itools/lld/wasm -I/Users/buildslave/jenkins/workspace/lldb-cmake/llvm-project/lld/wasm -I/Users/buildslave/jenkins/workspace/lldb-cmake/llvm-project/lld/include -Itools/lld/include -I/Applications/Xcode.app/Contents/Developer/Platforms/MacOSX.platform/Developer/SDKs/MacOSX10.15.sdk/usr/include/libxml2 -Iinclude -I/Users/buildslave/jenkins/workspace/lldb-cmake/llvm-project/llvm/include -Wdocumentation -fPIC -fvisibility-inlines-hidden -Werror=date-time -Werror=unguarded-availability-new -fmodules -fmodules-cache-path=/Users/buildslave/jenkins/workspace/lldb-cmake/lldb-build/module.cache -fcxx-modules -Xclang -fmodules-local-submodule-visibility -Wall -Wextra -Wno-unused-parameter -Wwrite-strings -Wcast-qual -Wmissing-field-initializers -pedantic -Wno-long-long -Wimplicit-fallthrough -Wcovered-switch-default -Wno-noexcept-type -Wnon-virtual-dtor -Wdelete-non-virtual-dtor -Wstring-conversion -fdiagnostics-color -O3  -isysroot /Applications/Xcode.app/Contents/Developer/Platforms/MacOSX.platform/Developer/SDKs/MacOSX10.15.sdk    -fno-exceptions -fno-rtti -UNDEBUG -std=c++14 -MD -MT tools/lld/wasm/CMakeFiles/lldWasm.dir/SymbolTable.cpp.o -MF tools/lld/wasm/CMakeFiles/lldWasm.dir/SymbolTable.cpp.o.d -o tools/lld/wasm/CMakeFiles/lldWasm.dir/SymbolTable.cpp.o -c /Users/buildslave/jenkins/workspace/lldb-cmake/llvm-project/lld/wasm/SymbolTable.cpp
[79/1351] : && /Users/buildslave/jenkins/workspace/lldb-cmake/host-compiler/bin/clang++  -Wdocumentation -fPIC -fvisibility-inlines-hidden -Werror=date-time -Werror=unguarded-availability-new -fmodules -fmodules-cache-path=/Users/buildslave/jenkins/workspace/lldb-cmake/lldb-build/module.cache -fcxx-modules -Xclang -fmodules-local-submodule-visibility -Wall -Wextra -Wno-unused-parameter -Wwrite-strings -Wcast-qual -Wmissing-field-initializers -pedantic -Wno-long-long -Wimplicit-fallthrough -Wcovered-switch-default -Wno-noexcept-type -Wnon-virtual-dtor -Wdelete-non-virtual-dtor -Wstring-conversion -fdiagnostics-color -fno-common -Woverloaded-virtual -Wno-nested-anon-types -O3  -isysroot /Applications/Xcode.app/Contents/Developer/Platforms/MacOSX.platform/Developer/SDKs/MacOSX10.15.sdk -Wl,-search_paths_first -Wl,-headerpad_max_install_names -Wl,-dead_strip tools/clang/tools/diagtool/CMakeFiles/diagtool.dir/diagtool_main.cpp.o tools/clang/tools/diagtool/CMakeFiles/diagtool.dir/DiagTool.cpp.o tools/clang/tools/diagtool/CMakeFiles/diagtool.dir/DiagnosticNames.cpp.o tools/clang/tools/diagtool/CMakeFiles/diagtool.dir/FindDiagnosticID.cpp.o tools/clang/tools/diagtool/CMakeFiles/diagtool.dir/ListWarnings.cpp.o tools/clang/tools/diagtool/CMakeFiles/diagtool.dir/ShowEnabledWarnings.cpp.o tools/clang/tools/diagtool/CMakeFiles/diagtool.dir/TreeView.cpp.o  -o bin/diagtool  -Wl,-rpath,@loader_path/../lib  lib/libLLVMSupport.a  lib/libclangBasic.a  lib/libclangFrontend.a  lib/libclangDriver.a  lib/libclangParse.a  lib/libclangSerialization.a  lib/libclangSema.a  lib/libclangEdit.a  lib/libclangAnalysis.a  lib/libclangASTMatchers.a  lib/libclangAST.a  lib/libclangLex.a  lib/libclangBasic.a  lib/libLLVMFrontendOpenMP.a  lib/libLLVMTransformUtils.a  lib/libLLVMAnalysis.a  lib/libLLVMObject.a  lib/libLLVMMCParser.a  lib/libLLVMMC.a  lib/libLLVMDebugInfoCodeView.a  lib/libLLVMDebugInfoMSF.a  lib/libLLVMTextAPI.a  lib/libLLVMBitReader.a  lib/libLLVMOption.a  lib/libLLVMProfileData.a  lib/libLLVMCore.a  lib/libLLVMBinaryFormat.a  lib/libLLVMRemarks.a  lib/libLLVMBitstreamReader.a  lib/libLLVMSupport.a  -lz  -lcurses  -lm  lib/libLLVMDemangle.a && :
FAILED: bin/diagtool 
: && /Users/buildslave/jenkins/workspace/lldb-cmake/host-compiler/bin/clang++  -Wdocumentation -fPIC -fvisibility-inlines-hidden -Werror=date-time -Werror=unguarded-availability-new -fmodules -fmodules-cache-path=/Users/buildslave/jenkins/workspace/lldb-cmake/lldb-build/module.cache -fcxx-modules -Xclang -fmodules-local-submodule-visibility -Wall -Wextra -Wno-unused-parameter -Wwrite-strings -Wcast-qual -Wmissing-field-initializers -pedantic -Wno-long-long -Wimplicit-fallthrough -Wcovered-switch-default -Wno-noexcept-type -Wnon-virtual-dtor -Wdelete-non-virtual-dtor -Wstring-conversion -fdiagnostics-color -fno-common -Woverloaded-virtual -Wno-nested-anon-types -O3  -isysroot /Applications/Xcode.app/Contents/Developer/Platforms/MacOSX.platform/Developer/SDKs/MacOSX10.15.sdk -Wl,-search_paths_first -Wl,-headerpad_max_install_names -Wl,-dead_strip tools/clang/tools/diagtool/CMakeFiles/diagtool.dir/diagtool_main.cpp.o tools/clang/tools/diagtool/CMakeFiles/diagtool.dir/DiagTool.cpp.o tools/clang/tools/diagtool/CMakeFiles/diagtool.dir/DiagnosticNames.cpp.o tools/clang/tools/diagtool/CMakeFiles/diagtool.dir/FindDiagnosticID.cpp.o tools/clang/tools/diagtool/CMakeFiles/diagtool.dir/ListWarnings.cpp.o tools/clang/tools/diagtool/CMakeFiles/diagtool.dir/ShowEnabledWarnings.cpp.o tools/clang/tools/diagtool/CMakeFiles/diagtool.dir/TreeView.cpp.o  -o bin/diagtool  -Wl,-rpath,@loader_path/../lib  lib/libLLVMSupport.a  lib/libclangBasic.a  lib/libclangFrontend.a  lib/libclangDriver.a  lib/libclangParse.a  lib/libclangSerialization.a  lib/libclangSema.a  lib/libclangEdit.a  lib/libclangAnalysis.a  lib/libclangASTMatchers.a  lib/libclangAST.a  lib/libclangLex.a  lib/libclangBasic.a  lib/libLLVMFrontendOpenMP.a  lib/libLLVMTransformUtils.a  lib/libLLVMAnalysis.a  lib/libLLVMObject.a  lib/libLLVMMCParser.a  lib/libLLVMMC.a  lib/libLLVMDebugInfoCodeView.a  lib/libLLVMDebugInfoMSF.a  lib/libLLVMTextAPI.a  lib/libLLVMBitReader.a  lib/libLLVMOption.a  lib/libLLVMProfileData.a  lib/libLLVMCore.a  lib/libLLVMBinaryFormat.a  lib/libLLVMRemarks.a  lib/libLLVMBitstreamReader.a  lib/libLLVMSupport.a  -lz  -lcurses  -lm  lib/libLLVMDemangle.a && :
Undefined symbols for architecture x86_64:
  "clang::ento::PackageInfo::dumpToStream(llvm::raw_ostream&) const", referenced from:
      clang::ento::PackageInfo::dump() const in ShowEnabledWarnings.cpp.o
      clang::ento::PackageInfo::dump() const in libclangFrontend.a(CompilerInstance.cpp.o)
      clang::ento::PackageInfo::dump() const in libclangFrontend.a(CompilerInvocation.cpp.o)
      clang::ento::PackageInfo::dump() const in libclangFrontend.a(CreateInvocationFromCommandLine.cpp.o)
      clang::ento::PackageInfo::dump() const in libclangFrontend.a(TextDiagnosticBuffer.cpp.o)
      clang::ento::PackageInfo::dump() const in libclangFrontend.a(FrontendAction.cpp.o)
      clang::ento::PackageInfo::dump() const in libclangFrontend.a(FrontendOptions.cpp.o)
      ...
  "clang::ento::CmdLineOption::dumpToStream(llvm::raw_ostream&) const", referenced from:
      clang::ento::CmdLineOption::dump() const in ShowEnabledWarnings.cpp.o
      clang::ento::CmdLineOption::dump() const in libclangFrontend.a(CompilerInstance.cpp.o)
      clang::ento::CmdLineOption::dump() const in libclangFrontend.a(CompilerInvocation.cpp.o)
      clang::ento::CmdLineOption::dump() const in libclangFrontend.a(CreateInvocationFromCommandLine.cpp.o)
      clang::ento::CmdLineOption::dump() const in libclangFrontend.a(TextDiagnosticBuffer.cpp.o)
      clang::ento::CmdLineOption::dump() const in libclangFrontend.a(FrontendAction.cpp.o)
      clang::ento::CmdLineOption::dump() const in libclangFrontend.a(FrontendOptions.cpp.o)
      ...
  "clang::ento::CheckerInfo::dumpToStream(llvm::raw_ostream&) const", referenced from:
      clang::ento::CheckerInfo::dump() const in ShowEnabledWarnings.cpp.o
      clang::ento::CheckerInfo::dump() const in libclangFrontend.a(CompilerInstance.cpp.o)
      clang::ento::CheckerInfo::dump() const in libclangFrontend.a(CompilerInvocation.cpp.o)
      clang::ento::CheckerInfo::dump() const in libclangFrontend.a(CreateInvocationFromCommandLine.cpp.o)
      clang::ento::CheckerInfo::dump() const in libclangFrontend.a(TextDiagnosticBuffer.cpp.o)
      clang::ento::CheckerInfo::dump() const in libclangFrontend.a(FrontendAction.cpp.o)
      clang::ento::CheckerInfo::dump() const in libclangFrontend.a(FrontendOptions.cpp.o)
      ...
ld: symbol(s) not found for architecture x86_64
clang-11: error: linker command failed with exit code 1 (use -v to see invocation)
[80/1351] : && /Users/buildslave/jenkins/workspace/lldb-cmake/host-compiler/bin/clang++  -Wdocumentation -fPIC -fvisibility-inlines-hidden -Werror=date-time -Werror=unguarded-availability-new -fmodules -fmodules-cache-path=/Users/buildslave/jenkins/workspace/lldb-cmake/lldb-build/module.cache -fcxx-modules -Xclang -fmodules-local-submodule-visibility -Wall -Wextra -Wno-unused-parameter -Wwrite-strings -Wcast-qual -Wmissing-field-initializers -pedantic -Wno-long-long -Wimplicit-fallthrough -Wcovered-switch-default -Wno-noexcept-type -Wnon-virtual-dtor -Wdelete-non-virtual-dtor -Wstring-conversion -fdiagnostics-color -fno-common -Woverloaded-virtual -Wno-nested-anon-types -O3  -isysroot /Applications/Xcode.app/Contents/Developer/Platforms/MacOSX.platform/Developer/SDKs/MacOSX10.15.sdk -Wl,-search_paths_first -Wl,-headerpad_max_install_names -Wl,-dead_strip tools/clang/tools/clang-diff/CMakeFiles/clang-diff.dir/ClangDiff.cpp.o  -o bin/clang-diff  -Wl,-rpath,@loader_path/../lib  lib/libLLVMSupport.a  lib/libclangBasic.a  lib/libclangFrontend.a  lib/libclangSerialization.a  lib/libclangTooling.a  lib/libclangToolingASTDiff.a  lib/libclangFrontend.a  lib/libclangParse.a  lib/libclangSerialization.a  lib/libclangSema.a  lib/libclangEdit.a  lib/libclangAnalysis.a  lib/libclangDriver.a  lib/libLLVMOption.a  lib/libclangASTMatchers.a  lib/libclangFormat.a  lib/libclangToolingInclusions.a  lib/libclangToolingCore.a  lib/libclangRewrite.a  lib/libclangAST.a  lib/libLLVMFrontendOpenMP.a  lib/libLLVMTransformUtils.a  lib/libLLVMAnalysis.a  lib/libLLVMProfileData.a  lib/libLLVMObject.a  lib/libLLVMBitReader.a  lib/libLLVMMCParser.a  lib/libLLVMTextAPI.a  lib/libclangLex.a  lib/libclangBasic.a  lib/libLLVMCore.a  lib/libLLVMRemarks.a  lib/libLLVMBitstreamReader.a  lib/libLLVMMC.a  lib/libLLVMBinaryFormat.a  lib/libLLVMDebugInfoCodeView.a  lib/libLLVMDebugInfoMSF.a  lib/libLLVMSupport.a  -lz  -lcurses  -lm  lib/libLLVMDemangle.a && :
FAILED: bin/clang-diff 
: && /Users/buildslave/jenkins/workspace/lldb-cmake/host-compiler/bin/clang++  -Wdocumentation -fPIC -fvisibility-inlines-hidden -Werror=date-time -Werror=unguarded-availability-new -fmodules -fmodules-cache-path=/Users/buildslave/jenkins/workspace/lldb-cmake/lldb-build/module.cache -fcxx-modules -Xclang -fmodules-local-submodule-visibility -Wall -Wextra -Wno-unused-parameter -Wwrite-strings -Wcast-qual -Wmissing-field-initializers -pedantic -Wno-long-long -Wimplicit-fallthrough -Wcovered-switch-default -Wno-noexcept-type -Wnon-virtual-dtor -Wdelete-non-virtual-dtor -Wstring-conversion -fdiagnostics-color -fno-common -Woverloaded-virtual -Wno-nested-anon-types -O3  -isysroot /Applications/Xcode.app/Contents/Developer/Platforms/MacOSX.platform/Developer/SDKs/MacOSX10.15.sdk -Wl,-search_paths_first -Wl,-headerpad_max_install_names -Wl,-dead_strip tools/clang/tools/clang-diff/CMakeFiles/clang-diff.dir/ClangDiff.cpp.o  -o bin/clang-diff  -Wl,-rpath,@loader_path/../lib  lib/libLLVMSupport.a  lib/libclangBasic.a  lib/libclangFrontend.a  lib/libclangSerialization.a  lib/libclangTooling.a  lib/libclangToolingASTDiff.a  lib/libclangFrontend.a  lib/libclangParse.a  lib/libclangSerialization.a  lib/libclangSema.a  lib/libclangEdit.a  lib/libclangAnalysis.a  lib/libclangDriver.a  lib/libLLVMOption.a  lib/libclangASTMatchers.a  lib/libclangFormat.a  lib/libclangToolingInclusions.a  lib/libclangToolingCore.a  lib/libclangRewrite.a  lib/libclangAST.a  lib/libLLVMFrontendOpenMP.a  lib/libLLVMTransformUtils.a  lib/libLLVMAnalysis.a  lib/libLLVMProfileData.a  lib/libLLVMObject.a  lib/libLLVMBitReader.a  lib/libLLVMMCParser.a  lib/libLLVMTextAPI.a  lib/libclangLex.a  lib/libclangBasic.a  lib/libLLVMCore.a  lib/libLLVMRemarks.a  lib/libLLVMBitstreamReader.a  lib/libLLVMMC.a  lib/libLLVMBinaryFormat.a  lib/libLLVMDebugInfoCodeView.a  lib/libLLVMDebugInfoMSF.a  lib/libLLVMSupport.a  -lz  -lcurses  -lm  lib/libLLVMDemangle.a && :
Undefined symbols for architecture x86_64:
  "clang::ento::PackageInfo::dumpToStream(llvm::raw_ostream&) const", referenced from:
      clang::ento::PackageInfo::dump() const in ClangDiff.cpp.o
      clang::ento::PackageInfo::dump() const in libclangToolingASTDiff.a(ASTDiff.cpp.o)
      clang::ento::PackageInfo::dump() const in libclangFrontend.a(ASTUnit.cpp.o)
      clang::ento::PackageInfo::dump() const in libclangTooling.a(CompilationDatabase.cpp.o)
      clang::ento::PackageInfo::dump() const in libclangTooling.a(ArgumentsAdjusters.cpp.o)
      clang::ento::PackageInfo::dump() const in libclangTooling.a(CommonOptionsParser.cpp.o)
      clang::ento::PackageInfo::dump() const in libclangTooling.a(Tooling.cpp.o)
      ...
  "clang::ento::CmdLineOption::dumpToStream(llvm::raw_ostream&) const", referenced from:
      clang::ento::CmdLineOption::dump() const in ClangDiff.cpp.o
      clang::ento::CmdLineOption::dump() const in libclangToolingASTDiff.a(ASTDiff.cpp.o)
      clang::ento::CmdLineOption::dump() const in libclangFrontend.a(ASTUnit.cpp.o)
      clang::ento::CmdLineOption::dump() const in libclangTooling.a(CompilationDatabase.cpp.o)
      clang::ento::CmdLineOption::dump() const in libclangTooling.a(ArgumentsAdjusters.cpp.o)
      clang::ento::CmdLineOption::dump() const in libclangTooling.a(CommonOptionsParser.cpp.o)
      clang::ento::CmdLineOption::dump() const in libclangTooling.a(Tooling.cpp.o)
      ...
  "clang::ento::CheckerInfo::dumpToStream(llvm::raw_ostream&) const", referenced from:
      clang::ento::CheckerInfo::dump() const in ClangDiff.cpp.o
      clang::ento::CheckerInfo::dump() const in libclangToolingASTDiff.a(ASTDiff.cpp.o)
      clang::ento::CheckerInfo::dump() const in libclangFrontend.a(ASTUnit.cpp.o)
      clang::ento::CheckerInfo::dump() const in libclangTooling.a(CompilationDatabase.cpp.o)
      clang::ento::CheckerInfo::dump() const in libclangTooling.a(ArgumentsAdjusters.cpp.o)
      clang::ento::CheckerInfo::dump() const in libclangTooling.a(CommonOptionsParser.cpp.o)
      clang::ento::CheckerInfo::dump() const in libclangTooling.a(Tooling.cpp.o)
      ...
ld: symbol(s) not found for architecture x86_64
clang-11: error: linker command failed with exit code 1 (use -v to see invocation)
[81/1351] /Users/buildslave/jenkins/workspace/lldb-cmake/host-compiler/bin/clang++  -DGTEST_HAS_RTTI=0 -D_DEBUG -D__STDC_CONSTANT_MACROS -D__STDC_FORMAT_MACROS -D__STDC_LIMIT_MACROS -Itools/lld/wasm -I/Users/buildslave/jenkins/workspace/lldb-cmake/llvm-project/lld/wasm -I/Users/buildslave/jenkins/workspace/lldb-cmake/llvm-project/lld/include -Itools/lld/include -I/Applications/Xcode.app/Contents/Developer/Platforms/MacOSX.platform/Developer/SDKs/MacOSX10.15.sdk/usr/include/libxml2 -Iinclude -I/Users/buildslave/jenkins/workspace/lldb-cmake/llvm-project/llvm/include -Wdocumentation -fPIC -fvisibility-inlines-hidden -Werror=date-time -Werror=unguarded-availability-new -fmodules -fmodules-cache-path=/Users/buildslave/jenkins/workspace/lldb-cmake/lldb-build/module.cache -fcxx-modules -Xclang -fmodules-local-submodule-visibility -Wall -Wextra -Wno-unused-parameter -Wwrite-strings -Wcast-qual -Wmissing-field-initializers -pedantic -Wno-long-long -Wimplicit-fallthrough -Wcovered-switch-default -Wno-noexcept-type -Wnon-virtual-dtor -Wdelete-non-virtual-dtor -Wstring-conversion -fdiagnostics-color -O3  -isysroot /Applications/Xcode.app/Contents/Developer/Platforms/MacOSX.platform/Developer/SDKs/MacOSX10.15.sdk    -fno-exceptions -fno-rtti -UNDEBUG -std=c++14 -MD -MT tools/lld/wasm/CMakeFiles/lldWasm.dir/SyntheticSections.cpp.o -MF tools/lld/wasm/CMakeFiles/lldWasm.dir/SyntheticSections.cpp.o.d -o tools/lld/wasm/CMakeFiles/lldWasm.dir/SyntheticSections.cpp.o -c /Users/buildslave/jenkins/workspace/lldb-cmake/llvm-project/lld/wasm/SyntheticSections.cpp
[82/1351] /Users/buildslave/jenkins/workspace/lldb-cmake/host-compiler/bin/clang++  -DGTEST_HAS_RTTI=0 -D_DEBUG -D__STDC_CONSTANT_MACROS -D__STDC_FORMAT_MACROS -D__STDC_LIMIT_MACROS -Itools/lld/ELF -I/Users/buildslave/jenkins/workspace/lldb-cmake/llvm-project/lld/ELF -I/Users/buildslave/jenkins/workspace/lldb-cmake/llvm-project/lld/include -Itools/lld/include -I/Applications/Xcode.app/Contents/Developer/Platforms/MacOSX.platform/Developer/SDKs/MacOSX10.15.sdk/usr/include/libxml2 -Iinclude -I/Users/buildslave/jenkins/workspace/lldb-cmake/llvm-project/llvm/include -Wdocumentation -fPIC -fvisibility-inlines-hidden -Werror=date-time -Werror=unguarded-availability-new -fmodules -fmodules-cache-path=/Users/buildslave/jenkins/workspace/lldb-cmake/lldb-build/module.cache -fcxx-modules -Xclang -fmodules-local-submodule-visibility -Wall -Wextra -Wno-unused-parameter -Wwrite-strings -Wcast-qual -Wmissing-field-initializers -pedantic -Wno-long-long -Wimplicit-fallthrough -Wcovered-switch-default -Wno-noexcept-type -Wnon-virtual-dtor -Wdelete-non-virtual-dtor -Wstring-conversion -fdiagnostics-color -O3  -isysroot /Applications/Xcode.app/Contents/Developer/Platforms/MacOSX.platform/Developer/SDKs/MacOSX10.15.sdk    -fno-exceptions -fno-rtti -UNDEBUG -std=c++14 -MD -MT tools/lld/ELF/CMakeFiles/lldELF.dir/InputFiles.cpp.o -MF tools/lld/ELF/CMakeFiles/lldELF.dir/InputFiles.cpp.o.d -o tools/lld/ELF/CMakeFiles/lldELF.dir/InputFiles.cpp.o -c /Users/buildslave/jenkins/workspace/lldb-cmake/llvm-project/lld/ELF/InputFiles.cpp
[83/1351] /Users/buildslave/jenkins/workspace/lldb-cmake/host-compiler/bin/clang++  -DGTEST_HAS_RTTI=0 -D_DEBUG -D__STDC_CONSTANT_MACROS -D__STDC_FORMAT_MACROS -D__STDC_LIMIT_MACROS -Itools/lld/wasm -I/Users/buildslave/jenkins/workspace/lldb-cmake/llvm-project/lld/wasm -I/Users/buildslave/jenkins/workspace/lldb-cmake/llvm-project/lld/include -Itools/lld/include -I/Applications/Xcode.app/Contents/Developer/Platforms/MacOSX.platform/Developer/SDKs/MacOSX10.15.sdk/usr/include/libxml2 -Iinclude -I/Users/buildslave/jenkins/workspace/lldb-cmake/llvm-project/llvm/include -Wdocumentation -fPIC -fvisibility-inlines-hidden -Werror=date-time -Werror=unguarded-availability-new -fmodules -fmodules-cache-path=/Users/buildslave/jenkins/workspace/lldb-cmake/lldb-build/module.cache -fcxx-modules -Xclang -fmodules-local-submodule-visibility -Wall -Wextra -Wno-unused-parameter -Wwrite-strings -Wcast-qual -Wmissing-field-initializers -pedantic -Wno-long-long -Wimplicit-fallthrough -Wcovered-switch-default -Wno-noexcept-type -Wnon-virtual-dtor -Wdelete-non-virtual-dtor -Wstring-conversion -fdiagnostics-color -O3  -isysroot /Applications/Xcode.app/Contents/Developer/Platforms/MacOSX.platform/Developer/SDKs/MacOSX10.15.sdk    -fno-exceptions -fno-rtti -UNDEBUG -std=c++14 -MD -MT tools/lld/wasm/CMakeFiles/lldWasm.dir/Writer.cpp.o -MF tools/lld/wasm/CMakeFiles/lldWasm.dir/Writer.cpp.o.d -o tools/lld/wasm/CMakeFiles/lldWasm.dir/Writer.cpp.o -c /Users/buildslave/jenkins/workspace/lldb-cmake/llvm-project/lld/wasm/Writer.cpp
[84/1351] /Users/buildslave/jenkins/workspace/lldb-cmake/host-compiler/bin/clang++  -DGTEST_HAS_RTTI=0 -DHAVE_ROUND -DLLDB_CONFIGURATION_RELEASE -DLLDB_USE_OS_LOG -D_DEBUG -D__STDC_CONSTANT_MACROS -D__STDC_FORMAT_MACROS -D__STDC_LIMIT_MACROS -Itools/lldb/utils/TableGen -I/Users/buildslave/jenkins/workspace/lldb-cmake/llvm-project/lldb/utils/TableGen -I/Users/buildslave/jenkins/workspace/lldb-cmake/llvm-project/lldb/include -Itools/lldb/include -I/Applications/Xcode.app/Contents/Developer/Platforms/MacOSX.platform/Developer/SDKs/MacOSX10.15.sdk/usr/include/libxml2 -Iinclude -I/Users/buildslave/jenkins/workspace/lldb-cmake/llvm-project/llvm/include -I/usr/local/Cellar/python/3.7.1/Frameworks/Python.framework/Versions/3.7/include/python3.7m -I/Users/buildslave/jenkins/workspace/lldb-cmake/llvm-project/llvm/../clang/include -Itools/lldb/../clang/include -I/usr/local/include -Wdocumentation -fPIC -fvisibility-inlines-hidden -Werror=date-time -Werror=unguarded-availability-new -fmodules -fmodules-cache-path=/Users/buildslave/jenkins/workspace/lldb-cmake/lldb-build/module.cache -fcxx-modules -Xclang -fmodules-local-submodule-visibility -Wall -Wextra -Wno-unused-parameter -Wwrite-strings -Wcast-qual -Wmissing-field-initializers -pedantic -Wno-long-long -Wimplicit-fallthrough -Wcovered-switch-default -Wno-noexcept-type -Wnon-virtual-dtor -Wdelete-non-virtual-dtor -Wstring-conversion -fdiagnostics-color -Wno-deprecated-declarations -Wno-unknown-pragmas -Wno-strict-aliasing -Wno-deprecated-register -Wno-vla-extension -O3  -isysroot /Applications/Xcode.app/Contents/Developer/Platforms/MacOSX.platform/Developer/SDKs/MacOSX10.15.sdk    -fno-exceptions -fno-rtti -UNDEBUG -std=c++14 -MD -MT tools/lldb/utils/TableGen/CMakeFiles/lldb-tblgen.dir/LLDBPropertyDefEmitter.cpp.o -MF tools/lldb/utils/TableGen/CMakeFiles/lldb-tblgen.dir/LLDBPropertyDefEmitter.cpp.o.d -o tools/lldb/utils/TableGen/CMakeFiles/lldb-tblgen.dir/LLDBPropertyDefEmitter.cpp.o -c /Users/buildslave/jenkins/workspace/lldb-cmake/llvm-project/lldb/utils/TableGen/LLDBPropertyDefEmitter.cpp
While building module 'LLVM_Utils' imported from /Users/buildslave/jenkins/workspace/lldb-cmake/llvm-project/lldb/utils/TableGen/LLDBTableGenBackends.h:19:
In file included from <module-includes>:8:
/Users/buildslave/jenkins/workspace/lldb-cmake/llvm-project/llvm/include/llvm/ADT/Bitfields.h:215:8: warning: '\param' command used in a comment that is not attached to a function declaration [-Wdocumentation]
  /// \param T, the type of the field once in unpacked form,
       ^~~~~
/Users/buildslave/jenkins/workspace/lldb-cmake/llvm-project/llvm/include/llvm/ADT/Bitfields.h:216:8: warning: '\param' command used in a comment that is not attached to a function declaration [-Wdocumentation]
  /// \param Offset, the position of the first bit,
       ^~~~~
/Users/buildslave/jenkins/workspace/lldb-cmake/llvm-project/llvm/include/llvm/ADT/Bitfields.h:217:8: warning: '\param' command used in a comment that is not attached to a function declaration [-Wdocumentation]
  /// \param Size, the size of the field,
       ^~~~~
/Users/buildslave/jenkins/workspace/lldb-cmake/llvm-project/llvm/include/llvm/ADT/Bitfields.h:218:8: warning: '\param' command used in a comment that is not attached to a function declaration [-Wdocumentation]
  /// \param MaxValue, For enums the maximum enum allowed.
       ^~~~~
4 warnings generated.
[85/1351] /Users/buildslave/jenkins/workspace/lldb-cmake/host-compiler/bin/clang++  -DGTEST_HAS_RTTI=0 -DHAVE_ROUND -DLLDB_CONFIGURATION_RELEASE -DLLDB_USE_OS_LOG -D_DEBUG -D__STDC_CONSTANT_MACROS -D__STDC_FORMAT_MACROS -D__STDC_LIMIT_MACROS -Itools/lldb/utils/TableGen -I/Users/buildslave/jenkins/workspace/lldb-cmake/llvm-project/lldb/utils/TableGen -I/Users/buildslave/jenkins/workspace/lldb-cmake/llvm-project/lldb/include -Itools/lldb/include -I/Applications/Xcode.app/Contents/Developer/Platforms/MacOSX.platform/Developer/SDKs/MacOSX10.15.sdk/usr/include/libxml2 -Iinclude -I/Users/buildslave/jenkins/workspace/lldb-cmake/llvm-project/llvm/include -I/usr/local/Cellar/python/3.7.1/Frameworks/Python.framework/Versions/3.7/include/python3.7m -I/Users/buildslave/jenkins/workspace/lldb-cmake/llvm-project/llvm/../clang/include -Itools/lldb/../clang/include -I/usr/local/include -Wdocumentation -fPIC -fvisibility-inlines-hidden -Werror=date-time -Werror=unguarded-availability-new -fmodules -fmodules-cache-path=/Users/buildslave/jenkins/workspace/lldb-cmake/lldb-build/module.cache -fcxx-modules -Xclang -fmodules-local-submodule-visibility -Wall -Wextra -Wno-unused-parameter -Wwrite-strings -Wcast-qual -Wmissing-field-initializers -pedantic -Wno-long-long -Wimplicit-fallthrough -Wcovered-switch-default -Wno-noexcept-type -Wnon-virtual-dtor -Wdelete-non-virtual-dtor -Wstring-conversion -fdiagnostics-color -Wno-deprecated-declarations -Wno-unknown-pragmas -Wno-strict-aliasing -Wno-deprecated-register -Wno-vla-extension -O3  -isysroot /Applications/Xcode.app/Contents/Developer/Platforms/MacOSX.platform/Developer/SDKs/MacOSX10.15.sdk    -fno-exceptions -fno-rtti -UNDEBUG -std=c++14 -MD -MT tools/lldb/utils/TableGen/CMakeFiles/lldb-tblgen.dir/LLDBTableGen.cpp.o -MF tools/lldb/utils/TableGen/CMakeFiles/lldb-tblgen.dir/LLDBTableGen.cpp.o.d -o tools/lldb/utils/TableGen/CMakeFiles/lldb-tblgen.dir/LLDBTableGen.cpp.o -c /Users/buildslave/jenkins/workspace/lldb-cmake/llvm-project/lldb/utils/TableGen/LLDBTableGen.cpp
[86/1351] /Users/buildslave/jenkins/workspace/lldb-cmake/host-compiler/bin/clang++  -DGTEST_HAS_RTTI=0 -DHAVE_ROUND -DLLDB_CONFIGURATION_RELEASE -DLLDB_USE_OS_LOG -D_DEBUG -D__STDC_CONSTANT_MACROS -D__STDC_FORMAT_MACROS -D__STDC_LIMIT_MACROS -Itools/lldb/utils/TableGen -I/Users/buildslave/jenkins/workspace/lldb-cmake/llvm-project/lldb/utils/TableGen -I/Users/buildslave/jenkins/workspace/lldb-cmake/llvm-project/lldb/include -Itools/lldb/include -I/Applications/Xcode.app/Contents/Developer/Platforms/MacOSX.platform/Developer/SDKs/MacOSX10.15.sdk/usr/include/libxml2 -Iinclude -I/Users/buildslave/jenkins/workspace/lldb-cmake/llvm-project/llvm/include -I/usr/local/Cellar/python/3.7.1/Frameworks/Python.framework/Versions/3.7/include/python3.7m -I/Users/buildslave/jenkins/workspace/lldb-cmake/llvm-project/llvm/../clang/include -Itools/lldb/../clang/include -I/usr/local/include -Wdocumentation -fPIC -fvisibility-inlines-hidden -Werror=date-time -Werror=unguarded-availability-new -fmodules -fmodules-cache-path=/Users/buildslave/jenkins/workspace/lldb-cmake/lldb-build/module.cache -fcxx-modules -Xclang -fmodules-local-submodule-visibility -Wall -Wextra -Wno-unused-parameter -Wwrite-strings -Wcast-qual -Wmissing-field-initializers -pedantic -Wno-long-long -Wimplicit-fallthrough -Wcovered-switch-default -Wno-noexcept-type -Wnon-virtual-dtor -Wdelete-non-virtual-dtor -Wstring-conversion -fdiagnostics-color -Wno-deprecated-declarations -Wno-unknown-pragmas -Wno-strict-aliasing -Wno-deprecated-register -Wno-vla-extension -O3  -isysroot /Applications/Xcode.app/Contents/Developer/Platforms/MacOSX.platform/Developer/SDKs/MacOSX10.15.sdk    -fno-exceptions -fno-rtti -UNDEBUG -std=c++14 -MD -MT tools/lldb/utils/TableGen/CMakeFiles/lldb-tblgen.dir/LLDBOptionDefEmitter.cpp.o -MF tools/lldb/utils/TableGen/CMakeFiles/lldb-tblgen.dir/LLDBOptionDefEmitter.cpp.o.d -o tools/lldb/utils/TableGen/CMakeFiles/lldb-tblgen.dir/LLDBOptionDefEmitter.cpp.o -c /Users/buildslave/jenkins/workspace/lldb-cmake/llvm-project/lldb/utils/TableGen/LLDBOptionDefEmitter.cpp
[87/1351] /Users/buildslave/jenkins/workspace/lldb-cmake/host-compiler/bin/clang++  -DGTEST_HAS_RTTI=0 -D_DEBUG -D__STDC_CONSTANT_MACROS -D__STDC_FORMAT_MACROS -D__STDC_LIMIT_MACROS -Itools/lld/ELF -I/Users/buildslave/jenkins/workspace/lldb-cmake/llvm-project/lld/ELF -I/Users/buildslave/jenkins/workspace/lldb-cmake/llvm-project/lld/include -Itools/lld/include -I/Applications/Xcode.app/Contents/Developer/Platforms/MacOSX.platform/Developer/SDKs/MacOSX10.15.sdk/usr/include/libxml2 -Iinclude -I/Users/buildslave/jenkins/workspace/lldb-cmake/llvm-project/llvm/include -Wdocumentation -fPIC -fvisibility-inlines-hidden -Werror=date-time -Werror=unguarded-availability-new -fmodules -fmodules-cache-path=/Users/buildslave/jenkins/workspace/lldb-cmake/lldb-build/module.cache -fcxx-modules -Xclang -fmodules-local-submodule-visibility -Wall -Wextra -Wno-unused-parameter -Wwrite-strings -Wcast-qual -Wmissing-field-initializers -pedantic -Wno-long-long -Wimplicit-fallthrough -Wcovered-switch-default -Wno-noexcept-type -Wnon-virtual-dtor -Wdelete-non-virtual-dtor -Wstring-conversion -fdiagnostics-color -O3  -isysroot /Applications/Xcode.app/Contents/Developer/Platforms/MacOSX.platform/Developer/SDKs/MacOSX10.15.sdk    -fno-exceptions -fno-rtti -UNDEBUG -std=c++14 -MD -MT tools/lld/ELF/CMakeFiles/lldELF.dir/Writer.cpp.o -MF tools/lld/ELF/CMakeFiles/lldELF.dir/Writer.cpp.o.d -o tools/lld/ELF/CMakeFiles/lldELF.dir/Writer.cpp.o -c /Users/buildslave/jenkins/workspace/lldb-cmake/llvm-project/lld/ELF/Writer.cpp
[88/1351] /Users/buildslave/jenkins/workspace/lldb-cmake/host-compiler/bin/clang++  -DGTEST_HAS_RTTI=0 -D_DEBUG -D__STDC_CONSTANT_MACROS -D__STDC_FORMAT_MACROS -D__STDC_LIMIT_MACROS -Itools/lld/ELF -I/Users/buildslave/jenkins/workspace/lldb-cmake/llvm-project/lld/ELF -I/Users/buildslave/jenkins/workspace/lldb-cmake/llvm-project/lld/include -Itools/lld/include -I/Applications/Xcode.app/Contents/Developer/Platforms/MacOSX.platform/Developer/SDKs/MacOSX10.15.sdk/usr/include/libxml2 -Iinclude -I/Users/buildslave/jenkins/workspace/lldb-cmake/llvm-project/llvm/include -Wdocumentation -fPIC -fvisibility-inlines-hidden -Werror=date-time -Werror=unguarded-availability-new -fmodules -fmodules-cache-path=/Users/buildslave/jenkins/workspace/lldb-cmake/lldb-build/module.cache -fcxx-modules -Xclang -fmodules-local-submodule-visibility -Wall -Wextra -Wno-unused-parameter -Wwrite-strings -Wcast-qual -Wmissing-field-initializers -pedantic -Wno-long-long -Wimplicit-fallthrough -Wcovered-switch-default -Wno-noexcept-type -Wnon-virtual-dtor -Wdelete-non-virtual-dtor -Wstring-conversion -fdiagnostics-color -O3  -isysroot /Applications/Xcode.app/Contents/Developer/Platforms/MacOSX.platform/Developer/SDKs/MacOSX10.15.sdk    -fno-exceptions -fno-rtti -UNDEBUG -std=c++14 -MD -MT tools/lld/ELF/CMakeFiles/lldELF.dir/SyntheticSections.cpp.o -MF tools/lld/ELF/CMakeFiles/lldELF.dir/SyntheticSections.cpp.o.d -o tools/lld/ELF/CMakeFiles/lldELF.dir/SyntheticSections.cpp.o -c /Users/buildslave/jenkins/workspace/lldb-cmake/llvm-project/lld/ELF/SyntheticSections.cpp
ninja: build stopped: subcommand failed.
Command failed: Command '['/usr/local/bin/ninja', '-v']' returned non-zero exit status 1
Command: ['/usr/local/bin/ninja', '-v']
[Pipeline] }
[Pipeline] // timeout
[Pipeline] }
[Pipeline] // stage
[Pipeline] stage
[Pipeline] { (Test)
Stage "Test" skipped due to earlier failure(s)
[Pipeline] }
[Pipeline] // stage
[Pipeline] stage
[Pipeline] { (Declarative: Post Actions)
[Pipeline] scanForIssues
[Clang (LLVM based)] Sleeping for 5 seconds due to JENKINS-32191...
[Clang (LLVM based)] Parsing console log (workspace: '/Users/buildslave/jenkins/workspace/lldb-cmake')
[Clang (LLVM based)] Successfully parsed console log
[Clang (LLVM based)] -> found 4 issues (skipped 4 duplicates)
[Clang (LLVM based)] Post processing issues on 'green-dragon-10' with source code encoding 'UTF-8'
[Clang (LLVM based)] Creating SCM blamer to obtain author and commit information for affected files
[Clang (LLVM based)] Creating SCM miner to obtain statistics for affected repository files
[Clang (LLVM based)] Resolving file names for all issues in source directory '/Users/buildslave/jenkins/workspace/lldb-cmake'
[Clang (LLVM based)] -> resolved paths in source directory (1 found, 0 not found)
[Clang (LLVM based)] Resolving module names from module definitions (build.xml, pom.xml, or Manifest.mf files)
[Clang (LLVM based)] -> resolved module names for 4 issues
[Clang (LLVM based)] Resolving package names (or namespaces) by parsing the affected files
[Clang (LLVM based)] -> resolved package names of 1 affected files
[Clang (LLVM based)] No filter has been set, publishing all 4 issues
[Clang (LLVM based)] Creating fingerprints for all affected code blocks to track issues over different builds
[Clang (LLVM based)] -> created fingerprints for 4 issues (skipped 0 issues)
[Clang (LLVM based)] Copying affected files to Jenkins' build folder '/Users/Shared/Jenkins/Home/jobs/lldb-cmake/builds/22252/files-with-issues'
[Clang (LLVM based)] -> 1 copied, 0 not in workspace, 0 not-found, 0 with I/O error
[Pipeline] junit
Recording test results
Test reports were found but none of them are new. Did leafNodes run? 
For example, /Users/buildslave/jenkins/workspace/lldb-cmake/test/results.xml is 1 day 12 hr old

Hide Details

Error when executing always post condition: hudson.AbortException: Test reports were found but none of them are new. Did leafNodes run? For example, /Users/buildslave/jenkins/workspace/lldb-cmake/test/results.xml is 1 day 12 hr old

Hide Details

at hudson.tasks.junit.TestResult.parse(TestResult.java:222) at hudson.tasks.junit.TestResult.parse(TestResult.java:178) at hudson.tasks.junit.TestResult.<init>(TestResult.java:143) at hudson.tasks.junit.JUnitParser$ParseResultCallable.invoke(JUnitParser.java:146) at hudson.tasks.junit.JUnitParser$ParseResultCallable.invoke(JUnitParser.java:118) at hudson.FilePath$FileCallableWrapper.call(FilePath.java:3069) at hudson.remoting.UserRequest.perform(UserRequest.java:211) at hudson.remoting.UserRequest.perform(UserRequest.java:54) at hudson.remoting.Request$2.run(Request.java:369) at hudson.remoting.InterceptingExecutorService$1.call(InterceptingExecutorService.java:72) at java.util.concurrent.FutureTask.run(Unknown Source) at java.util.concurrent.ThreadPoolExecutor.runWorker(Unknown Source) at java.util.concurrent.ThreadPoolExecutor$Worker.run(Unknown Source) at java.lang.Thread.run(Unknown Source) Suppressed: hudson.remoting.Channel$CallSiteStackTrace: Remote call to green-dragon-10 at hudson.remoting.Channel.attachCallSiteStackTrace(Channel.java:1788) at hudson.remoting.UserRequest$ExceptionResponse.retrieve(UserRequest.java:356) at hudson.remoting.Channel.call(Channel.java:998) at hudson.FilePath.act(FilePath.java:1069) at hudson.FilePath.act(FilePath.java:1058) at hudson.tasks.junit.JUnitParser.parseResult(JUnitParser.java:114) at hudson.tasks.junit.JUnitResultArchiver.parse(JUnitResultArchiver.java:137) at hudson.tasks.junit.JUnitResultArchiver.parseAndAttach(JUnitResultArchiver.java:167) at hudson.tasks.junit.pipeline.JUnitResultsStepExecution.run(JUnitResultsStepExecution.java:52) at hudson.tasks.junit.pipeline.JUnitResultsStepExecution.run(JUnitResultsStepExecution.java:25) at org.jenkinsci.plugins.workflow.steps.SynchronousNonBlockingStepExecution.lambda$start$0(SynchronousNonBlockingStepExecution.java:47) at java.util.concurrent.Executors$RunnableAdapter.call(Executors.java:511) at java.util.concurrent.FutureTask.run(FutureTask.java:266) at java.util.concurrent.ThreadPoolExecutor.runWorker(ThreadPoolExecutor.java:1149) at java.util.concurrent.ThreadPoolExecutor$Worker.run(ThreadPoolExecutor.java:624) at java.lang.Thread.run(Thread.java:748)

Hide Details

[Pipeline] } [Pipeline] // stage [Pipeline] } [Pipeline] // withEnv [Pipeline] } [Pipeline] // node [Pipeline] End of Pipeline ERROR: script returned exit code 1 Finished: FAILURE