FailedConsole Output

Started by timer
Obtained zorg/jenkins/jobs/jobs/lldb-cmake from git https://github.com/llvm/llvm-zorg.git
Running in Durability level: MAX_SURVIVABILITY
[Pipeline] Start of Pipeline
[Pipeline] node
Running on green-dragon-10 in /Users/buildslave/jenkins/workspace/lldb-cmake
[Pipeline] {
[Pipeline] stage
[Pipeline] { (Declarative: Checkout SCM)
[Pipeline] checkout
No credentials specified
Fetching changes from the remote Git repository
 > git rev-parse --is-inside-work-tree # timeout=10
 > git config remote.origin.url https://github.com/llvm/llvm-zorg.git # timeout=10
Fetching upstream changes from https://github.com/llvm/llvm-zorg.git
 > git --version # timeout=10
 > git fetch --tags --force --progress -- https://github.com/llvm/llvm-zorg.git +refs/heads/*:refs/remotes/origin/* # timeout=10
Checking out Revision ac4c27ddd9bf6b75f4430476a1f63a3377b38f2c (refs/remotes/origin/master)
Commit message: "new win32 buildbot"
 > git rev-parse refs/remotes/origin/master^{commit} # timeout=10
 > git rev-parse refs/remotes/origin/origin/master^{commit} # timeout=10
 > git config core.sparsecheckout # timeout=10
 > git checkout -f ac4c27ddd9bf6b75f4430476a1f63a3377b38f2c # timeout=10
 > git rev-list --no-walk ac4c27ddd9bf6b75f4430476a1f63a3377b38f2c # timeout=10
[Pipeline] }
[Pipeline] // stage
[Pipeline] withEnv
[Pipeline] {
[Pipeline] stage
[Pipeline] { (Checkout)
[Pipeline] timeout
Timeout set to expire in 30 min
[Pipeline] {
[Pipeline] dir
Running in /Users/buildslave/jenkins/workspace/lldb-cmake/llvm-project
[Pipeline] {
[Pipeline] checkout
No credentials specified
Fetching changes from the remote Git repository
 > git rev-parse --is-inside-work-tree # timeout=10
 > git config remote.origin.url http://labmaster3.local/git/llvm-project.git # timeout=10
Fetching upstream changes from http://labmaster3.local/git/llvm-project.git
 > git --version # timeout=10
 > git fetch --tags --force --progress -- http://labmaster3.local/git/llvm-project.git +refs/heads/*:refs/remotes/origin/* # timeout=10
Checking out Revision a378c0449507e00e96534ff9ce9034e185425182 (refs/remotes/origin/master)
 > git rev-parse refs/remotes/origin/master^{commit} # timeout=10
 > git rev-parse refs/remotes/origin/origin/master^{commit} # timeout=10
 > git config core.sparsecheckout # timeout=10
 > git checkout -f a378c0449507e00e96534ff9ce9034e185425182 # timeout=10
Commit message: "[Fuchsia] Set projects and runtimes in the cache file"
 > git rev-list --no-walk a378c0449507e00e96534ff9ce9034e185425182 # timeout=10
[Pipeline] }
[Pipeline] // dir
[Pipeline] dir
Running in /Users/buildslave/jenkins/workspace/lldb-cmake/llvm-zorg
[Pipeline] {
[Pipeline] checkout
No credentials specified
Fetching changes from the remote Git repository
Checking out Revision ac4c27ddd9bf6b75f4430476a1f63a3377b38f2c (refs/remotes/origin/master)
Commit message: "new win32 buildbot"
 > git rev-parse --is-inside-work-tree # timeout=10
 > git config remote.origin.url http://labmaster3.local/git/llvm-zorg.git # timeout=10
Fetching upstream changes from http://labmaster3.local/git/llvm-zorg.git
 > git --version # timeout=10
 > git fetch --tags --force --progress -- http://labmaster3.local/git/llvm-zorg.git +refs/heads/*:refs/remotes/origin/* # timeout=10
 > git rev-parse refs/remotes/origin/master^{commit} # timeout=10
 > git rev-parse refs/remotes/origin/origin/master^{commit} # timeout=10
 > git config core.sparsecheckout # timeout=10
 > git checkout -f ac4c27ddd9bf6b75f4430476a1f63a3377b38f2c # timeout=10
 > git rev-list --no-walk ac4c27ddd9bf6b75f4430476a1f63a3377b38f2c # timeout=10
[Pipeline] }
[Pipeline] // dir
[Pipeline] }
[Pipeline] // timeout
[Pipeline] }
[Pipeline] // stage
[Pipeline] stage
[Pipeline] { (Fetch Host Compiler)
[Pipeline] timeout
Timeout set to expire in 10 min
[Pipeline] {
[Pipeline] sh
+ python llvm-zorg/zorg/jenkins/monorepo_build.py fetch
Fetching Compiler

Hide Details

@@@ Fetching Compiler @@@ GETting http://labmaster2.local/artifacts//clang-stage1-RA/latest to /Users/buildslave/jenkins/workspace/lldb-cmake/host-compiler.tar.gz ... done. Decompressing... cd /Users/buildslave/jenkins/workspace/lldb-cmake/host-compiler/ 'tar' 'zxf' '../host-compiler.tar.gz' Completed at: 2020-07-05T17:56:58 @@@@@@
[Pipeline] } [Pipeline] // timeout [Pipeline] } [Pipeline] // stage [Pipeline] stage [Pipeline] { (Build) [Pipeline] timeout Timeout set to expire in 2 hr 0 min [Pipeline] { [Pipeline] sh + set -u + rm -rf build.properties + cd llvm-project + git tag -a -m 'First Commit' first_commit 97724f18c79c7cc81ced24239eb5e883bf1398ef fatal: tag 'first_commit' already exists + true ++ git describe --match first_commit + git_desc=first_commit-359349-ga378c044950 ++ echo first_commit-359349-ga378c044950 ++ cut -f 2 -d - + export GIT_DISTANCE=359349 + GIT_DISTANCE=359349 ++ echo first_commit-359349-ga378c044950 ++ cut -f 3 -d - + sha=ga378c044950 + export GIT_SHA=a378c044950 + GIT_SHA=a378c044950 + cd - /Users/buildslave/jenkins/workspace/lldb-cmake + python llvm-zorg/zorg/jenkins/monorepo_build.py lldb-cmake build --assertions '--projects=clang;libcxx;libcxxabi;compiler-rt;lld;lldb;debuginfo-tests' --compiler-flag=-Wdocumentation --cmake-type=Release You are using pip version 18.1, however version 20.2b1 is available. You should consider upgrading via the 'pip install --upgrade pip' command. You are using pip version 18.1, however version 20.2b1 is available. You should consider upgrading via the 'pip install --upgrade pip' command. Error: missing dependency: os_version v10.13.5, found v10.15.5 installed, requested from clang_build_dependencies.dep:0: os_version == 10.13.5 # Oldest CI nodes are currently 10.13.3 Dependency met brew cmake v3.11.2 Dependency met brew ninja v1.8.2 Dependency met pip psutil v5.4.5 Dependency met pip six v1.11.0 Error: missing dependency: xcode v9.4.1, found v11.5 installed, requested from clang_build_dependencies.dep:5: xcode == 9.4.1
Clean

Hide Details

@@@ Clean @@@ Removing module cache: /Users/buildslave/jenkins/workspace/lldb-cmake/lldb-build/module.cache Completed at: 2020-07-05T17:58:07 @@@@@@
Cmake

Hide Details

@@@ Cmake @@@ cd /Users/buildslave/jenkins/workspace/lldb-cmake/lldb-build '/usr/local/bin/cmake' '-G' 'Ninja' '/Users/buildslave/jenkins/workspace/lldb-cmake/llvm-project/llvm' '-DCMAKE_BUILD_TYPE=Release' '-DCMAKE_EXPORT_COMPILE_COMMANDS=ON' '-DCMAKE_INSTALL_PREFIX=/Users/buildslave/jenkins/workspace/lldb-cmake/lldb-install' '-DCMAKE_MAKE_PROGRAM=/usr/local/bin/ninja' '-DLLDB_TEST_USER_ARGS=--arch;x86_64;--build-dir;/Users/buildslave/jenkins/workspace/lldb-cmake/lldb-build/lldb-test-build.noindex;-s=/Users/buildslave/jenkins/workspace/lldb-cmake/test/logs;-t;--env;TERM=vt100' '-DLLDB_ENABLE_PYTHON=On' '-DLLVM_ENABLE_ASSERTIONS:BOOL=TRUE' '-DLLVM_ENABLE_MODULES=On' '-DLLVM_ENABLE_PROJECTS=clang;libcxx;libcxxabi;compiler-rt;lld;lldb;debuginfo-tests' '-DLLVM_LIT_ARGS=-v --time-tests --shuffle --xunit-xml-output=/Users/buildslave/jenkins/workspace/lldb-cmake/test/results.xml -v' '-DLLVM_VERSION_PATCH=99' '-DCMAKE_C_FLAGS=-Wdocumentation' '-DCMAKE_CXX_FLAGS=-Wdocumentation' '-DCMAKE_C_COMPILER=/Users/buildslave/jenkins/workspace/lldb-cmake/host-compiler/bin/clang' '-DCMAKE_CXX_COMPILER=/Users/buildslave/jenkins/workspace/lldb-cmake/host-compiler/bin/clang++' -- clang project is enabled -- clang-tools-extra project is disabled -- compiler-rt project is enabled -- debuginfo-tests project is enabled -- libc project is disabled -- libclc project is disabled -- libcxx project is enabled -- libcxxabi project is enabled -- libunwind project is disabled -- lld project is enabled -- lldb project is enabled -- mlir project is disabled -- openmp project is disabled -- parallel-libs project is disabled -- polly project is disabled -- pstl project is disabled -- flang project is disabled -- Found libtool - /Applications/Xcode.app/Contents/Developer/Toolchains/XcodeDefault.xctoolchain/usr/bin/libtool -- Found LibXml2: /usr/lib/libxml2.dylib (found version "2.9.4") -- Native target architecture is X86 -- Threads enabled. -- Doxygen disabled. -- Go bindings disabled. -- Ninja version: 1.8.2 -- Found ld64 - /Applications/Xcode.app/Contents/Developer/Toolchains/XcodeDefault.xctoolchain/usr/bin/ld -- Could NOT find OCaml (missing: OCAMLFIND OCAML_VERSION OCAML_STDLIB_PATH) -- Could NOT find OCaml (missing: OCAMLFIND OCAML_VERSION OCAML_STDLIB_PATH) -- OCaml bindings disabled. -- LLVM host triple: x86_64-apple-darwin19.5.0 -- LLVM default target triple: x86_64-apple-darwin19.5.0 -- Building with -fPIC -- Found Python3: /usr/local/Frameworks/Python.framework/Versions/3.7/bin/python3.7 (found version "3.7.1") found components: Interpreter -- Constructing LLVMBuild project information -- Targeting AArch64 -- Targeting AMDGPU -- Targeting ARM -- Targeting AVR -- Targeting BPF -- Targeting Hexagon -- Targeting Lanai -- Targeting Mips -- Targeting MSP430 -- Targeting NVPTX -- Targeting PowerPC -- Targeting RISCV -- Targeting Sparc -- Targeting SystemZ -- Targeting WebAssembly -- Targeting X86 -- Targeting XCore -- Libc++abi will be using libc++ includes from /Users/buildslave/jenkins/workspace/lldb-cmake/llvm-project/libcxxabi/../libcxx/include -- Could not find CrashReporterClient, not linking against it -- Could not find ParallelSTL, libc++abi will not attempt to use it but the build may fail if the libc++ in use needs it to be available. -- Looking for cxxabi.h in /Users/buildslave/jenkins/workspace/lldb-cmake/llvm-project/libcxx/../libcxxabi/include -- Looking for cxxabi.h in /Users/buildslave/jenkins/workspace/lldb-cmake/llvm-project/libcxx/../libcxxabi/include - found -- Looking for __cxxabi_config.h in /Users/buildslave/jenkins/workspace/lldb-cmake/llvm-project/libcxx/../libcxxabi/include -- Looking for __cxxabi_config.h in /Users/buildslave/jenkins/workspace/lldb-cmake/llvm-project/libcxx/../libcxxabi/include - found -- Found OSX_SYSROOT: /Applications/Xcode.app/Contents/Developer/Platforms/MacOSX.platform/Developer/SDKs/MacOSX10.15.sdk -- Got ld supported ARCHES: armv6 armv7 armv7s arm64 arm64e arm64_32 i386 x86_64 x86_64h armv6m armv7k armv7m armv7em -- Toolchain supported arches: armv6;armv7;armv7s;arm64;arm64e;arm64_32;i386;x86_64;x86_64h;armv6m;armv7k;armv7m;armv7em -- Using cached valid architectures for osx. -- OSX supported arches: x86_64;x86_64h -- Using cached valid architectures for iossim. -- ios Simulator supported arches: i386;x86_64 -- Using cached valid architectures for ios. -- ios supported arches: armv6;armv7;armv7s;arm64;armv7k -- Compiler-RT supported architectures: x86_64;x86_64h;i386;armv6;armv7;armv7s;arm64;armv7k -- No arm64 support in /Applications/Xcode.app/Contents/Developer/Platforms/MacOSX.platform/Developer/SDKs/MacOSX10.15.sdk/SDKSettings.plist -- No arm64e support in /Applications/Xcode.app/Contents/Developer/Platforms/MacOSX.platform/Developer/SDKs/MacOSX10.15.sdk/SDKSettings.plist -- Using cached valid architectures for osx. -- OSX supported builtin arches: i386;x86_64;x86_64h -- Using cached valid architectures for iossim. -- ios Simulator supported builtin arches: i386;x86_64 -- Using cached valid architectures for ios. -- ios supported builtin arches: arm64;armv7;armv7k;armv7s -- Builtin supported architectures: i386;x86_64;x86_64h;armv7;armv7k;armv7s;arm64 -- No arm64 support in /Applications/Xcode.app/Contents/Developer/Platforms/MacOSX.platform/Developer/SDKs/MacOSX10.15.sdk/SDKSettings.plist -- No arm64e support in /Applications/Xcode.app/Contents/Developer/Platforms/MacOSX.platform/Developer/SDKs/MacOSX10.15.sdk/SDKSettings.plist -- Using cached valid architectures for osx. -- OSX supported builtin arches: i386;x86_64;x86_64h -- Using cached valid architectures for iossim. -- ios Simulator supported builtin arches: i386;x86_64 -- Using cached valid architectures for ios. -- ios supported builtin arches: arm64;armv7;armv7k;armv7s -- Builtin supported architectures: i386;x86_64;x86_64h;armv7;armv7k;armv7s;arm64 -- check-interception does nothing. -- Generated Sanitizer SUPPORTED_TOOLS list on "Darwin" is "asan;lsan;tsan;ubsan" -- sanitizer_common tests on "Darwin" will run against "asan;lsan;tsan;ubsan" -- Clang version: 11.0.99 -- LLD version: 11.0.99 -- Enable editline support in LLDB: TRUE -- Enable curses support in LLDB: TRUE -- Enable LZMA compression support in LLDB: TRUE -- Could NOT find Lua (missing: LUA_LIBRARIES LUA_INCLUDE_DIR) (Required is at least version "5.3") -- Could NOT find LuaAndSwig (missing: LUA_LIBRARIES LUA_INCLUDE_DIR) -- Enable Lua scripting support in LLDB: FALSE -- Found Python3: /usr/local/Frameworks/Python.framework/Versions/3.7/bin/python3.7 (found version "3.7.1") found components: Interpreter Development -- Enable Python scripting support in LLDB: TRUE -- Found LibXml2: /usr/lib/libxml2.dylib (found suitable version "2.9.4", minimum required is "2.8") -- Enable Libxml 2 support in LLDB: TRUE -- LLDB version: 11.0.99git -- Symbols (liblldb): exporting all symbols from the lldb namespace CMake Warning at /Users/buildslave/jenkins/workspace/lldb-cmake/llvm-project/lldb/tools/debugserver/source/CMakeLists.txt:44 (message): Development code sign identiy not found: 'lldb_codesign' This will cause failures in the test suite.Pass '-DLLDB_USE_SYSTEM_DEBUGSERVER=ON' to use the system one instead.See 'Code Signing on macOS' in the documentation. Call Stack (most recent call first): /Users/buildslave/jenkins/workspace/lldb-cmake/llvm-project/lldb/tools/debugserver/source/CMakeLists.txt:92 (get_debugserver_codesign_identity)

Hide Details

Hide Details

-- LLDB debugserver energy support is disabled -- Could NOT find Doxygen (missing: DOXYGEN_EXECUTABLE) -- Could NOT find epydoc -- LLDB Tests use just-built debugserver: /Users/buildslave/jenkins/workspace/lldb-cmake/lldb-build/./bin/debugserver -- Registering Bye as a pass plugin (static build: OFF) -- LLVM FileCheck Found: /usr/local/bin/FileCheck -- Version: 0.0.0 -- Performing Test HAVE_THREAD_SAFETY_ATTRIBUTES -- failed to compile -- Performing Test HAVE_GNU_POSIX_REGEX -- failed to compile -- Performing Test HAVE_POSIX_REGEX -- success -- Performing Test HAVE_STEADY_CLOCK -- success -- Configuring done -- Generating done -- Build files have been written to: /Users/buildslave/jenkins/workspace/lldb-cmake/lldb-build Completed at: 2020-07-05T17:59:09 @@@@@@
Build

Hide Details

@@@ Build @@@ cd /Users/buildslave/jenkins/workspace/lldb-cmake/lldb-build '/usr/local/bin/ninja' '-v' [1/1265] : && "/Applications/Xcode.app/Contents/Developer/Toolchains/XcodeDefault.xctoolchain/usr/bin/libtool" -static -no_warning_for_no_symbols -o lib/liblldWasm.a tools/lld/wasm/CMakeFiles/lldWasm.dir/Driver.cpp.o tools/lld/wasm/CMakeFiles/lldWasm.dir/InputChunks.cpp.o tools/lld/wasm/CMakeFiles/lldWasm.dir/InputFiles.cpp.o tools/lld/wasm/CMakeFiles/lldWasm.dir/LTO.cpp.o tools/lld/wasm/CMakeFiles/lldWasm.dir/MarkLive.cpp.o tools/lld/wasm/CMakeFiles/lldWasm.dir/OutputSections.cpp.o tools/lld/wasm/CMakeFiles/lldWasm.dir/Relocations.cpp.o tools/lld/wasm/CMakeFiles/lldWasm.dir/SymbolTable.cpp.o tools/lld/wasm/CMakeFiles/lldWasm.dir/Symbols.cpp.o tools/lld/wasm/CMakeFiles/lldWasm.dir/SyntheticSections.cpp.o tools/lld/wasm/CMakeFiles/lldWasm.dir/Writer.cpp.o tools/lld/wasm/CMakeFiles/lldWasm.dir/WriterUtils.cpp.o && : [2/1265] : && "/Applications/Xcode.app/Contents/Developer/Toolchains/XcodeDefault.xctoolchain/usr/bin/libtool" -static -no_warning_for_no_symbols -o lib/liblldELF.a tools/lld/ELF/CMakeFiles/lldELF.dir/AArch64ErrataFix.cpp.o tools/lld/ELF/CMakeFiles/lldELF.dir/Arch/AArch64.cpp.o tools/lld/ELF/CMakeFiles/lldELF.dir/Arch/AMDGPU.cpp.o tools/lld/ELF/CMakeFiles/lldELF.dir/Arch/ARM.cpp.o tools/lld/ELF/CMakeFiles/lldELF.dir/Arch/AVR.cpp.o tools/lld/ELF/CMakeFiles/lldELF.dir/Arch/Hexagon.cpp.o tools/lld/ELF/CMakeFiles/lldELF.dir/Arch/Mips.cpp.o tools/lld/ELF/CMakeFiles/lldELF.dir/Arch/MipsArchTree.cpp.o tools/lld/ELF/CMakeFiles/lldELF.dir/Arch/MSP430.cpp.o tools/lld/ELF/CMakeFiles/lldELF.dir/Arch/PPC.cpp.o tools/lld/ELF/CMakeFiles/lldELF.dir/Arch/PPC64.cpp.o tools/lld/ELF/CMakeFiles/lldELF.dir/Arch/RISCV.cpp.o tools/lld/ELF/CMakeFiles/lldELF.dir/Arch/SPARCV9.cpp.o tools/lld/ELF/CMakeFiles/lldELF.dir/Arch/X86.cpp.o tools/lld/ELF/CMakeFiles/lldELF.dir/Arch/X86_64.cpp.o tools/lld/ELF/CMakeFiles/lldELF.dir/ARMErrataFix.cpp.o tools/lld/ELF/CMakeFiles/lldELF.dir/CallGraphSort.cpp.o tools/lld/ELF/CMakeFiles/lldELF.dir/DWARF.cpp.o tools/lld/ELF/CMakeFiles/lldELF.dir/Driver.cpp.o tools/lld/ELF/CMakeFiles/lldELF.dir/DriverUtils.cpp.o tools/lld/ELF/CMakeFiles/lldELF.dir/EhFrame.cpp.o tools/lld/ELF/CMakeFiles/lldELF.dir/ICF.cpp.o tools/lld/ELF/CMakeFiles/lldELF.dir/InputFiles.cpp.o tools/lld/ELF/CMakeFiles/lldELF.dir/InputSection.cpp.o tools/lld/ELF/CMakeFiles/lldELF.dir/LTO.cpp.o tools/lld/ELF/CMakeFiles/lldELF.dir/LinkerScript.cpp.o tools/lld/ELF/CMakeFiles/lldELF.dir/MapFile.cpp.o tools/lld/ELF/CMakeFiles/lldELF.dir/MarkLive.cpp.o tools/lld/ELF/CMakeFiles/lldELF.dir/OutputSections.cpp.o tools/lld/ELF/CMakeFiles/lldELF.dir/Relocations.cpp.o tools/lld/ELF/CMakeFiles/lldELF.dir/ScriptLexer.cpp.o tools/lld/ELF/CMakeFiles/lldELF.dir/ScriptParser.cpp.o tools/lld/ELF/CMakeFiles/lldELF.dir/SymbolTable.cpp.o tools/lld/ELF/CMakeFiles/lldELF.dir/Symbols.cpp.o tools/lld/ELF/CMakeFiles/lldELF.dir/SyntheticSections.cpp.o tools/lld/ELF/CMakeFiles/lldELF.dir/Target.cpp.o tools/lld/ELF/CMakeFiles/lldELF.dir/Thunks.cpp.o tools/lld/ELF/CMakeFiles/lldELF.dir/Writer.cpp.o && : [3/1265] : && /Users/buildslave/jenkins/workspace/lldb-cmake/host-compiler/bin/clang++ -Wdocumentation -fPIC -fvisibility-inlines-hidden -Werror=date-time -Werror=unguarded-availability-new -fmodules -fmodules-cache-path=/Users/buildslave/jenkins/workspace/lldb-cmake/lldb-build/module.cache -fcxx-modules -Xclang -fmodules-local-submodule-visibility -Wall -Wextra -Wno-unused-parameter -Wwrite-strings -Wcast-qual -Wmissing-field-initializers -pedantic -Wno-long-long -Wimplicit-fallthrough -Wcovered-switch-default -Wno-noexcept-type -Wnon-virtual-dtor -Wdelete-non-virtual-dtor -Wstring-conversion -fdiagnostics-color -fno-common -Woverloaded-virtual -Wno-nested-anon-types -O3 -isysroot /Applications/Xcode.app/Contents/Developer/Platforms/MacOSX.platform/Developer/SDKs/MacOSX10.15.sdk -Wl,-search_paths_first -Wl,-headerpad_max_install_names -Wl,-dead_strip tools/clang/tools/diagtool/CMakeFiles/diagtool.dir/diagtool_main.cpp.o tools/clang/tools/diagtool/CMakeFiles/diagtool.dir/DiagTool.cpp.o tools/clang/tools/diagtool/CMakeFiles/diagtool.dir/DiagnosticNames.cpp.o tools/clang/tools/diagtool/CMakeFiles/diagtool.dir/FindDiagnosticID.cpp.o tools/clang/tools/diagtool/CMakeFiles/diagtool.dir/ListWarnings.cpp.o tools/clang/tools/diagtool/CMakeFiles/diagtool.dir/ShowEnabledWarnings.cpp.o tools/clang/tools/diagtool/CMakeFiles/diagtool.dir/TreeView.cpp.o -o bin/diagtool -Wl,-rpath,@loader_path/../lib lib/libLLVMSupport.a lib/libclangBasic.a lib/libclangFrontend.a lib/libclangDriver.a lib/libclangParse.a lib/libclangSerialization.a lib/libclangSema.a lib/libclangEdit.a lib/libclangAnalysis.a lib/libclangASTMatchers.a lib/libclangAST.a lib/libclangLex.a lib/libclangBasic.a lib/libLLVMFrontendOpenMP.a lib/libLLVMTransformUtils.a lib/libLLVMAnalysis.a lib/libLLVMObject.a lib/libLLVMMCParser.a lib/libLLVMMC.a lib/libLLVMDebugInfoCodeView.a lib/libLLVMDebugInfoMSF.a lib/libLLVMTextAPI.a lib/libLLVMBitReader.a lib/libLLVMOption.a lib/libLLVMProfileData.a lib/libLLVMCore.a lib/libLLVMBinaryFormat.a lib/libLLVMRemarks.a lib/libLLVMBitstreamReader.a lib/libLLVMSupport.a -lz -lcurses -lm lib/libLLVMDemangle.a && : FAILED: bin/diagtool : && /Users/buildslave/jenkins/workspace/lldb-cmake/host-compiler/bin/clang++ -Wdocumentation -fPIC -fvisibility-inlines-hidden -Werror=date-time -Werror=unguarded-availability-new -fmodules -fmodules-cache-path=/Users/buildslave/jenkins/workspace/lldb-cmake/lldb-build/module.cache -fcxx-modules -Xclang -fmodules-local-submodule-visibility -Wall -Wextra -Wno-unused-parameter -Wwrite-strings -Wcast-qual -Wmissing-field-initializers -pedantic -Wno-long-long -Wimplicit-fallthrough -Wcovered-switch-default -Wno-noexcept-type -Wnon-virtual-dtor -Wdelete-non-virtual-dtor -Wstring-conversion -fdiagnostics-color -fno-common -Woverloaded-virtual -Wno-nested-anon-types -O3 -isysroot /Applications/Xcode.app/Contents/Developer/Platforms/MacOSX.platform/Developer/SDKs/MacOSX10.15.sdk -Wl,-search_paths_first -Wl,-headerpad_max_install_names -Wl,-dead_strip tools/clang/tools/diagtool/CMakeFiles/diagtool.dir/diagtool_main.cpp.o tools/clang/tools/diagtool/CMakeFiles/diagtool.dir/DiagTool.cpp.o tools/clang/tools/diagtool/CMakeFiles/diagtool.dir/DiagnosticNames.cpp.o tools/clang/tools/diagtool/CMakeFiles/diagtool.dir/FindDiagnosticID.cpp.o tools/clang/tools/diagtool/CMakeFiles/diagtool.dir/ListWarnings.cpp.o tools/clang/tools/diagtool/CMakeFiles/diagtool.dir/ShowEnabledWarnings.cpp.o tools/clang/tools/diagtool/CMakeFiles/diagtool.dir/TreeView.cpp.o -o bin/diagtool -Wl,-rpath,@loader_path/../lib lib/libLLVMSupport.a lib/libclangBasic.a lib/libclangFrontend.a lib/libclangDriver.a lib/libclangParse.a lib/libclangSerialization.a lib/libclangSema.a lib/libclangEdit.a lib/libclangAnalysis.a lib/libclangASTMatchers.a lib/libclangAST.a lib/libclangLex.a lib/libclangBasic.a lib/libLLVMFrontendOpenMP.a lib/libLLVMTransformUtils.a lib/libLLVMAnalysis.a lib/libLLVMObject.a lib/libLLVMMCParser.a lib/libLLVMMC.a lib/libLLVMDebugInfoCodeView.a lib/libLLVMDebugInfoMSF.a lib/libLLVMTextAPI.a lib/libLLVMBitReader.a lib/libLLVMOption.a lib/libLLVMProfileData.a lib/libLLVMCore.a lib/libLLVMBinaryFormat.a lib/libLLVMRemarks.a lib/libLLVMBitstreamReader.a lib/libLLVMSupport.a -lz -lcurses -lm lib/libLLVMDemangle.a && : Undefined symbols for architecture x86_64: "clang::ento::PackageInfo::dumpToStream(llvm::raw_ostream&) const", referenced from: clang::ento::PackageInfo::dump() const in ShowEnabledWarnings.cpp.o clang::ento::PackageInfo::dump() const in libclangFrontend.a(CompilerInstance.cpp.o) clang::ento::PackageInfo::dump() const in libclangFrontend.a(CompilerInvocation.cpp.o) clang::ento::PackageInfo::dump() const in libclangFrontend.a(CreateInvocationFromCommandLine.cpp.o) clang::ento::PackageInfo::dump() const in libclangFrontend.a(TextDiagnosticBuffer.cpp.o) clang::ento::PackageInfo::dump() const in libclangFrontend.a(FrontendAction.cpp.o) clang::ento::PackageInfo::dump() const in libclangFrontend.a(FrontendOptions.cpp.o) ... "clang::ento::CmdLineOption::dumpToStream(llvm::raw_ostream&) const", referenced from: clang::ento::CmdLineOption::dump() const in ShowEnabledWarnings.cpp.o clang::ento::CmdLineOption::dump() const in libclangFrontend.a(CompilerInstance.cpp.o) clang::ento::CmdLineOption::dump() const in libclangFrontend.a(CompilerInvocation.cpp.o) clang::ento::CmdLineOption::dump() const in libclangFrontend.a(CreateInvocationFromCommandLine.cpp.o) clang::ento::CmdLineOption::dump() const in libclangFrontend.a(TextDiagnosticBuffer.cpp.o) clang::ento::CmdLineOption::dump() const in libclangFrontend.a(FrontendAction.cpp.o) clang::ento::CmdLineOption::dump() const in libclangFrontend.a(FrontendOptions.cpp.o) ... "clang::ento::CheckerInfo::dumpToStream(llvm::raw_ostream&) const", referenced from: clang::ento::CheckerInfo::dump() const in ShowEnabledWarnings.cpp.o clang::ento::CheckerInfo::dump() const in libclangFrontend.a(CompilerInstance.cpp.o) clang::ento::CheckerInfo::dump() const in libclangFrontend.a(CompilerInvocation.cpp.o) clang::ento::CheckerInfo::dump() const in libclangFrontend.a(CreateInvocationFromCommandLine.cpp.o) clang::ento::CheckerInfo::dump() const in libclangFrontend.a(TextDiagnosticBuffer.cpp.o) clang::ento::CheckerInfo::dump() const in libclangFrontend.a(FrontendAction.cpp.o) clang::ento::CheckerInfo::dump() const in libclangFrontend.a(FrontendOptions.cpp.o) ... ld: symbol(s) not found for architecture x86_64 clang-11: error: linker command failed with exit code 1 (use -v to see invocation) [4/1265] : && /Users/buildslave/jenkins/workspace/lldb-cmake/host-compiler/bin/clang++ -Wdocumentation -fPIC -fvisibility-inlines-hidden -Werror=date-time -Werror=unguarded-availability-new -fmodules -fmodules-cache-path=/Users/buildslave/jenkins/workspace/lldb-cmake/lldb-build/module.cache -fcxx-modules -Xclang -fmodules-local-submodule-visibility -Wall -Wextra -Wno-unused-parameter -Wwrite-strings -Wcast-qual -Wmissing-field-initializers -pedantic -Wno-long-long -Wimplicit-fallthrough -Wcovered-switch-default -Wno-noexcept-type -Wnon-virtual-dtor -Wdelete-non-virtual-dtor -Wstring-conversion -fdiagnostics-color -fno-common -Woverloaded-virtual -Wno-nested-anon-types -O3 -isysroot /Applications/Xcode.app/Contents/Developer/Platforms/MacOSX.platform/Developer/SDKs/MacOSX10.15.sdk -Wl,-search_paths_first -Wl,-headerpad_max_install_names -Wl,-dead_strip tools/clang/tools/clang-diff/CMakeFiles/clang-diff.dir/ClangDiff.cpp.o -o bin/clang-diff -Wl,-rpath,@loader_path/../lib lib/libLLVMSupport.a lib/libclangBasic.a lib/libclangFrontend.a lib/libclangSerialization.a lib/libclangTooling.a lib/libclangToolingASTDiff.a lib/libclangFrontend.a lib/libclangParse.a lib/libclangSerialization.a lib/libclangSema.a lib/libclangEdit.a lib/libclangAnalysis.a lib/libclangDriver.a lib/libLLVMOption.a lib/libclangASTMatchers.a lib/libclangFormat.a lib/libclangToolingInclusions.a lib/libclangToolingCore.a lib/libclangRewrite.a lib/libclangAST.a lib/libLLVMFrontendOpenMP.a lib/libLLVMTransformUtils.a lib/libLLVMAnalysis.a lib/libLLVMProfileData.a lib/libLLVMObject.a lib/libLLVMBitReader.a lib/libLLVMMCParser.a lib/libLLVMTextAPI.a lib/libclangLex.a lib/libclangBasic.a lib/libLLVMCore.a lib/libLLVMRemarks.a lib/libLLVMBitstreamReader.a lib/libLLVMMC.a lib/libLLVMBinaryFormat.a lib/libLLVMDebugInfoCodeView.a lib/libLLVMDebugInfoMSF.a lib/libLLVMSupport.a -lz -lcurses -lm lib/libLLVMDemangle.a && : FAILED: bin/clang-diff : && /Users/buildslave/jenkins/workspace/lldb-cmake/host-compiler/bin/clang++ -Wdocumentation -fPIC -fvisibility-inlines-hidden -Werror=date-time -Werror=unguarded-availability-new -fmodules -fmodules-cache-path=/Users/buildslave/jenkins/workspace/lldb-cmake/lldb-build/module.cache -fcxx-modules -Xclang -fmodules-local-submodule-visibility -Wall -Wextra -Wno-unused-parameter -Wwrite-strings -Wcast-qual -Wmissing-field-initializers -pedantic -Wno-long-long -Wimplicit-fallthrough -Wcovered-switch-default -Wno-noexcept-type -Wnon-virtual-dtor -Wdelete-non-virtual-dtor -Wstring-conversion -fdiagnostics-color -fno-common -Woverloaded-virtual -Wno-nested-anon-types -O3 -isysroot /Applications/Xcode.app/Contents/Developer/Platforms/MacOSX.platform/Developer/SDKs/MacOSX10.15.sdk -Wl,-search_paths_first -Wl,-headerpad_max_install_names -Wl,-dead_strip tools/clang/tools/clang-diff/CMakeFiles/clang-diff.dir/ClangDiff.cpp.o -o bin/clang-diff -Wl,-rpath,@loader_path/../lib lib/libLLVMSupport.a lib/libclangBasic.a lib/libclangFrontend.a lib/libclangSerialization.a lib/libclangTooling.a lib/libclangToolingASTDiff.a lib/libclangFrontend.a lib/libclangParse.a lib/libclangSerialization.a lib/libclangSema.a lib/libclangEdit.a lib/libclangAnalysis.a lib/libclangDriver.a lib/libLLVMOption.a lib/libclangASTMatchers.a lib/libclangFormat.a lib/libclangToolingInclusions.a lib/libclangToolingCore.a lib/libclangRewrite.a lib/libclangAST.a lib/libLLVMFrontendOpenMP.a lib/libLLVMTransformUtils.a lib/libLLVMAnalysis.a lib/libLLVMProfileData.a lib/libLLVMObject.a lib/libLLVMBitReader.a lib/libLLVMMCParser.a lib/libLLVMTextAPI.a lib/libclangLex.a lib/libclangBasic.a lib/libLLVMCore.a lib/libLLVMRemarks.a lib/libLLVMBitstreamReader.a lib/libLLVMMC.a lib/libLLVMBinaryFormat.a lib/libLLVMDebugInfoCodeView.a lib/libLLVMDebugInfoMSF.a lib/libLLVMSupport.a -lz -lcurses -lm lib/libLLVMDemangle.a && : Undefined symbols for architecture x86_64: "clang::ento::PackageInfo::dumpToStream(llvm::raw_ostream&) const", referenced from: clang::ento::PackageInfo::dump() const in ClangDiff.cpp.o clang::ento::PackageInfo::dump() const in libclangToolingASTDiff.a(ASTDiff.cpp.o) clang::ento::PackageInfo::dump() const in libclangFrontend.a(ASTUnit.cpp.o) clang::ento::PackageInfo::dump() const in libclangTooling.a(CompilationDatabase.cpp.o) clang::ento::PackageInfo::dump() const in libclangTooling.a(ArgumentsAdjusters.cpp.o) clang::ento::PackageInfo::dump() const in libclangTooling.a(CommonOptionsParser.cpp.o) clang::ento::PackageInfo::dump() const in libclangTooling.a(Tooling.cpp.o) ... "clang::ento::CmdLineOption::dumpToStream(llvm::raw_ostream&) const", referenced from: clang::ento::CmdLineOption::dump() const in ClangDiff.cpp.o clang::ento::CmdLineOption::dump() const in libclangToolingASTDiff.a(ASTDiff.cpp.o) clang::ento::CmdLineOption::dump() const in libclangFrontend.a(ASTUnit.cpp.o) clang::ento::CmdLineOption::dump() const in libclangTooling.a(CompilationDatabase.cpp.o) clang::ento::CmdLineOption::dump() const in libclangTooling.a(ArgumentsAdjusters.cpp.o) clang::ento::CmdLineOption::dump() const in libclangTooling.a(CommonOptionsParser.cpp.o) clang::ento::CmdLineOption::dump() const in libclangTooling.a(Tooling.cpp.o) ... "clang::ento::CheckerInfo::dumpToStream(llvm::raw_ostream&) const", referenced from: clang::ento::CheckerInfo::dump() const in ClangDiff.cpp.o clang::ento::CheckerInfo::dump() const in libclangToolingASTDiff.a(ASTDiff.cpp.o) clang::ento::CheckerInfo::dump() const in libclangFrontend.a(ASTUnit.cpp.o) clang::ento::CheckerInfo::dump() const in libclangTooling.a(CompilationDatabase.cpp.o) clang::ento::CheckerInfo::dump() const in libclangTooling.a(ArgumentsAdjusters.cpp.o) clang::ento::CheckerInfo::dump() const in libclangTooling.a(CommonOptionsParser.cpp.o) clang::ento::CheckerInfo::dump() const in libclangTooling.a(Tooling.cpp.o) ... ld: symbol(s) not found for architecture x86_64 clang-11: error: linker command failed with exit code 1 (use -v to see invocation) [5/1265] : && /Users/buildslave/jenkins/workspace/lldb-cmake/host-compiler/bin/clang++ -Wdocumentation -fPIC -fvisibility-inlines-hidden -Werror=date-time -Werror=unguarded-availability-new -fmodules -fmodules-cache-path=/Users/buildslave/jenkins/workspace/lldb-cmake/lldb-build/module.cache -fcxx-modules -Xclang -fmodules-local-submodule-visibility -Wall -Wextra -Wno-unused-parameter -Wwrite-strings -Wcast-qual -Wmissing-field-initializers -pedantic -Wno-long-long -Wimplicit-fallthrough -Wcovered-switch-default -Wno-noexcept-type -Wnon-virtual-dtor -Wdelete-non-virtual-dtor -Wstring-conversion -fdiagnostics-color -fno-common -Woverloaded-virtual -Wno-nested-anon-types -O3 -isysroot /Applications/Xcode.app/Contents/Developer/Platforms/MacOSX.platform/Developer/SDKs/MacOSX10.15.sdk -Wl,-search_paths_first -Wl,-headerpad_max_install_names -Wl,-dead_strip tools/clang/tools/clang-refactor/CMakeFiles/clang-refactor.dir/ClangRefactor.cpp.o tools/clang/tools/clang-refactor/CMakeFiles/clang-refactor.dir/TestSupport.cpp.o -o bin/clang-refactor -Wl,-rpath,@loader_path/../lib lib/libLLVMOption.a lib/libLLVMSupport.a lib/libclangAST.a lib/libclangBasic.a lib/libclangFormat.a lib/libclangFrontend.a lib/libclangLex.a lib/libclangRewrite.a lib/libclangSerialization.a lib/libclangTooling.a lib/libclangToolingCore.a lib/libclangToolingRefactoring.a lib/libclangIndex.a lib/libclangFormat.a lib/libclangToolingInclusions.a lib/libclangFrontend.a lib/libclangDriver.a lib/libLLVMOption.a lib/libclangParse.a lib/libclangSerialization.a lib/libclangSema.a lib/libclangEdit.a lib/libclangAnalysis.a lib/libclangASTMatchers.a lib/libclangToolingCore.a lib/libclangAST.a lib/libLLVMFrontendOpenMP.a lib/libLLVMTransformUtils.a lib/libLLVMAnalysis.a lib/libLLVMProfileData.a lib/libLLVMObject.a lib/libLLVMBitReader.a lib/libLLVMMCParser.a lib/libLLVMTextAPI.a lib/libclangRewrite.a lib/libclangLex.a lib/libclangBasic.a lib/libLLVMMC.a lib/libLLVMDebugInfoCodeView.a lib/libLLVMDebugInfoMSF.a lib/libLLVMCore.a lib/libLLVMBinaryFormat.a lib/libLLVMRemarks.a lib/libLLVMBitstreamReader.a lib/libLLVMSupport.a -lz -lcurses -lm lib/libLLVMDemangle.a && : FAILED: bin/clang-refactor : && /Users/buildslave/jenkins/workspace/lldb-cmake/host-compiler/bin/clang++ -Wdocumentation -fPIC -fvisibility-inlines-hidden -Werror=date-time -Werror=unguarded-availability-new -fmodules -fmodules-cache-path=/Users/buildslave/jenkins/workspace/lldb-cmake/lldb-build/module.cache -fcxx-modules -Xclang -fmodules-local-submodule-visibility -Wall -Wextra -Wno-unused-parameter -Wwrite-strings -Wcast-qual -Wmissing-field-initializers -pedantic -Wno-long-long -Wimplicit-fallthrough -Wcovered-switch-default -Wno-noexcept-type -Wnon-virtual-dtor -Wdelete-non-virtual-dtor -Wstring-conversion -fdiagnostics-color -fno-common -Woverloaded-virtual -Wno-nested-anon-types -O3 -isysroot /Applications/Xcode.app/Contents/Developer/Platforms/MacOSX.platform/Developer/SDKs/MacOSX10.15.sdk -Wl,-search_paths_first -Wl,-headerpad_max_install_names -Wl,-dead_strip tools/clang/tools/clang-refactor/CMakeFiles/clang-refactor.dir/ClangRefactor.cpp.o tools/clang/tools/clang-refactor/CMakeFiles/clang-refactor.dir/TestSupport.cpp.o -o bin/clang-refactor -Wl,-rpath,@loader_path/../lib lib/libLLVMOption.a lib/libLLVMSupport.a lib/libclangAST.a lib/libclangBasic.a lib/libclangFormat.a lib/libclangFrontend.a lib/libclangLex.a lib/libclangRewrite.a lib/libclangSerialization.a lib/libclangTooling.a lib/libclangToolingCore.a lib/libclangToolingRefactoring.a lib/libclangIndex.a lib/libclangFormat.a lib/libclangToolingInclusions.a lib/libclangFrontend.a lib/libclangDriver.a lib/libLLVMOption.a lib/libclangParse.a lib/libclangSerialization.a lib/libclangSema.a lib/libclangEdit.a lib/libclangAnalysis.a lib/libclangASTMatchers.a lib/libclangToolingCore.a lib/libclangAST.a lib/libLLVMFrontendOpenMP.a lib/libLLVMTransformUtils.a lib/libLLVMAnalysis.a lib/libLLVMProfileData.a lib/libLLVMObject.a lib/libLLVMBitReader.a lib/libLLVMMCParser.a lib/libLLVMTextAPI.a lib/libclangRewrite.a lib/libclangLex.a lib/libclangBasic.a lib/libLLVMMC.a lib/libLLVMDebugInfoCodeView.a lib/libLLVMDebugInfoMSF.a lib/libLLVMCore.a lib/libLLVMBinaryFormat.a lib/libLLVMRemarks.a lib/libLLVMBitstreamReader.a lib/libLLVMSupport.a -lz -lcurses -lm lib/libLLVMDemangle.a && : Undefined symbols for architecture x86_64: "clang::ento::PackageInfo::dumpToStream(llvm::raw_ostream&) const", referenced from: clang::ento::PackageInfo::dump() const in ClangRefactor.cpp.o clang::ento::PackageInfo::dump() const in TestSupport.cpp.o clang::ento::PackageInfo::dump() const in libclangFrontend.a(FrontendAction.cpp.o) clang::ento::PackageInfo::dump() const in libclangToolingRefactoring.a(AtomicChange.cpp.o) clang::ento::PackageInfo::dump() const in libclangToolingRefactoring.a(RefactoringActions.cpp.o) clang::ento::PackageInfo::dump() const in libclangTooling.a(CommonOptionsParser.cpp.o) clang::ento::PackageInfo::dump() const in libclangTooling.a(Tooling.cpp.o) ... "clang::ento::CmdLineOption::dumpToStream(llvm::raw_ostream&) const", referenced from: clang::ento::CmdLineOption::dump() const in ClangRefactor.cpp.o clang::ento::CmdLineOption::dump() const in TestSupport.cpp.o clang::ento::CmdLineOption::dump() const in libclangFrontend.a(FrontendAction.cpp.o) clang::ento::CmdLineOption::dump() const in libclangToolingRefactoring.a(AtomicChange.cpp.o) clang::ento::CmdLineOption::dump() const in libclangToolingRefactoring.a(RefactoringActions.cpp.o) clang::ento::CmdLineOption::dump() const in libclangTooling.a(CommonOptionsParser.cpp.o) clang::ento::CmdLineOption::dump() const in libclangTooling.a(Tooling.cpp.o) ... "clang::ento::CheckerInfo::dumpToStream(llvm::raw_ostream&) const", referenced from: clang::ento::CheckerInfo::dump() const in ClangRefactor.cpp.o clang::ento::CheckerInfo::dump() const in TestSupport.cpp.o clang::ento::CheckerInfo::dump() const in libclangFrontend.a(FrontendAction.cpp.o) clang::ento::CheckerInfo::dump() const in libclangToolingRefactoring.a(AtomicChange.cpp.o) clang::ento::CheckerInfo::dump() const in libclangToolingRefactoring.a(RefactoringActions.cpp.o) clang::ento::CheckerInfo::dump() const in libclangTooling.a(CommonOptionsParser.cpp.o) clang::ento::CheckerInfo::dump() const in libclangTooling.a(Tooling.cpp.o) ... ld: symbol(s) not found for architecture x86_64 clang-11: error: linker command failed with exit code 1 (use -v to see invocation) [6/1265] : && /Users/buildslave/jenkins/workspace/lldb-cmake/host-compiler/bin/clang++ -Wdocumentation -fPIC -fvisibility-inlines-hidden -Werror=date-time -Werror=unguarded-availability-new -fmodules -fmodules-cache-path=/Users/buildslave/jenkins/workspace/lldb-cmake/lldb-build/module.cache -fcxx-modules -Xclang -fmodules-local-submodule-visibility -Wall -Wextra -Wno-unused-parameter -Wwrite-strings -Wcast-qual -Wmissing-field-initializers -pedantic -Wno-long-long -Wimplicit-fallthrough -Wcovered-switch-default -Wno-noexcept-type -Wnon-virtual-dtor -Wdelete-non-virtual-dtor -Wstring-conversion -fdiagnostics-color -fno-common -Woverloaded-virtual -Wno-nested-anon-types -O3 -isysroot /Applications/Xcode.app/Contents/Developer/Platforms/MacOSX.platform/Developer/SDKs/MacOSX10.15.sdk -Wl,-search_paths_first -Wl,-headerpad_max_install_names -Wl,-dead_strip tools/clang/tools/clang-rename/CMakeFiles/clang-rename.dir/ClangRename.cpp.o -o bin/clang-rename -Wl,-rpath,@loader_path/../lib lib/libLLVMOption.a lib/libLLVMSupport.a lib/libclangBasic.a lib/libclangFrontend.a lib/libclangRewrite.a lib/libclangSerialization.a lib/libclangTooling.a lib/libclangToolingCore.a lib/libclangToolingRefactoring.a lib/libclangIndex.a lib/libclangFrontend.a lib/libclangDriver.a lib/libLLVMOption.a lib/libclangParse.a lib/libclangSerialization.a lib/libclangSema.a lib/libclangEdit.a lib/libclangAnalysis.a lib/libclangASTMatchers.a lib/libclangFormat.a lib/libclangToolingInclusions.a lib/libclangToolingCore.a lib/libclangRewrite.a lib/libclangAST.a lib/libLLVMFrontendOpenMP.a lib/libLLVMTransformUtils.a lib/libLLVMAnalysis.a lib/libLLVMProfileData.a lib/libLLVMObject.a lib/libLLVMBitReader.a lib/libLLVMMCParser.a lib/libLLVMTextAPI.a lib/libclangLex.a lib/libclangBasic.a lib/libLLVMCore.a lib/libLLVMRemarks.a lib/libLLVMBitstreamReader.a lib/libLLVMMC.a lib/libLLVMBinaryFormat.a lib/libLLVMDebugInfoCodeView.a lib/libLLVMDebugInfoMSF.a lib/libLLVMSupport.a -lz -lcurses -lm lib/libLLVMDemangle.a && : FAILED: bin/clang-rename : && /Users/buildslave/jenkins/workspace/lldb-cmake/host-compiler/bin/clang++ -Wdocumentation -fPIC -fvisibility-inlines-hidden -Werror=date-time -Werror=unguarded-availability-new -fmodules -fmodules-cache-path=/Users/buildslave/jenkins/workspace/lldb-cmake/lldb-build/module.cache -fcxx-modules -Xclang -fmodules-local-submodule-visibility -Wall -Wextra -Wno-unused-parameter -Wwrite-strings -Wcast-qual -Wmissing-field-initializers -pedantic -Wno-long-long -Wimplicit-fallthrough -Wcovered-switch-default -Wno-noexcept-type -Wnon-virtual-dtor -Wdelete-non-virtual-dtor -Wstring-conversion -fdiagnostics-color -fno-common -Woverloaded-virtual -Wno-nested-anon-types -O3 -isysroot /Applications/Xcode.app/Contents/Developer/Platforms/MacOSX.platform/Developer/SDKs/MacOSX10.15.sdk -Wl,-search_paths_first -Wl,-headerpad_max_install_names -Wl,-dead_strip tools/clang/tools/clang-rename/CMakeFiles/clang-rename.dir/ClangRename.cpp.o -o bin/clang-rename -Wl,-rpath,@loader_path/../lib lib/libLLVMOption.a lib/libLLVMSupport.a lib/libclangBasic.a lib/libclangFrontend.a lib/libclangRewrite.a lib/libclangSerialization.a lib/libclangTooling.a lib/libclangToolingCore.a lib/libclangToolingRefactoring.a lib/libclangIndex.a lib/libclangFrontend.a lib/libclangDriver.a lib/libLLVMOption.a lib/libclangParse.a lib/libclangSerialization.a lib/libclangSema.a lib/libclangEdit.a lib/libclangAnalysis.a lib/libclangASTMatchers.a lib/libclangFormat.a lib/libclangToolingInclusions.a lib/libclangToolingCore.a lib/libclangRewrite.a lib/libclangAST.a lib/libLLVMFrontendOpenMP.a lib/libLLVMTransformUtils.a lib/libLLVMAnalysis.a lib/libLLVMProfileData.a lib/libLLVMObject.a lib/libLLVMBitReader.a lib/libLLVMMCParser.a lib/libLLVMTextAPI.a lib/libclangLex.a lib/libclangBasic.a lib/libLLVMCore.a lib/libLLVMRemarks.a lib/libLLVMBitstreamReader.a lib/libLLVMMC.a lib/libLLVMBinaryFormat.a lib/libLLVMDebugInfoCodeView.a lib/libLLVMDebugInfoMSF.a lib/libLLVMSupport.a -lz -lcurses -lm lib/libLLVMDemangle.a && : Undefined symbols for architecture x86_64: "clang::ento::PackageInfo::dumpToStream(llvm::raw_ostream&) const", referenced from: clang::ento::PackageInfo::dump() const in ClangRename.cpp.o clang::ento::PackageInfo::dump() const in libclangFrontend.a(FrontendAction.cpp.o) clang::ento::PackageInfo::dump() const in libclangFrontend.a(TextDiagnosticPrinter.cpp.o) clang::ento::PackageInfo::dump() const in libclangToolingRefactoring.a(RenamingAction.cpp.o) clang::ento::PackageInfo::dump() const in libclangTooling.a(Refactoring.cpp.o) clang::ento::PackageInfo::dump() const in libclangToolingRefactoring.a(USRFindingAction.cpp.o) clang::ento::PackageInfo::dump() const in libclangTooling.a(CommonOptionsParser.cpp.o) ... "clang::ento::CmdLineOption::dumpToStream(llvm::raw_ostream&) const", referenced from: clang::ento::CmdLineOption::dump() const in ClangRename.cpp.o clang::ento::CmdLineOption::dump() const in libclangFrontend.a(FrontendAction.cpp.o) clang::ento::CmdLineOption::dump() const in libclangFrontend.a(TextDiagnosticPrinter.cpp.o) clang::ento::CmdLineOption::dump() const in libclangToolingRefactoring.a(RenamingAction.cpp.o) clang::ento::CmdLineOption::dump() const in libclangTooling.a(Refactoring.cpp.o) clang::ento::CmdLineOption::dump() const in libclangToolingRefactoring.a(USRFindingAction.cpp.o) clang::ento::CmdLineOption::dump() const in libclangTooling.a(CommonOptionsParser.cpp.o) ... "clang::ento::CheckerInfo::dumpToStream(llvm::raw_ostream&) const", referenced from: clang::ento::CheckerInfo::dump() const in ClangRename.cpp.o clang::ento::CheckerInfo::dump() const in libclangFrontend.a(FrontendAction.cpp.o) clang::ento::CheckerInfo::dump() const in libclangFrontend.a(TextDiagnosticPrinter.cpp.o) clang::ento::CheckerInfo::dump() const in libclangToolingRefactoring.a(RenamingAction.cpp.o) clang::ento::CheckerInfo::dump() const in libclangTooling.a(Refactoring.cpp.o) clang::ento::CheckerInfo::dump() const in libclangToolingRefactoring.a(USRFindingAction.cpp.o) clang::ento::CheckerInfo::dump() const in libclangTooling.a(CommonOptionsParser.cpp.o) ... ld: symbol(s) not found for architecture x86_64 clang-11: error: linker command failed with exit code 1 (use -v to see invocation) [7/1265] : && /Users/buildslave/jenkins/workspace/lldb-cmake/host-compiler/bin/clang++ -Wdocumentation -fPIC -fvisibility-inlines-hidden -Werror=date-time -Werror=unguarded-availability-new -fmodules -fmodules-cache-path=/Users/buildslave/jenkins/workspace/lldb-cmake/lldb-build/module.cache -fcxx-modules -Xclang -fmodules-local-submodule-visibility -Wall -Wextra -Wno-unused-parameter -Wwrite-strings -Wcast-qual -Wmissing-field-initializers -pedantic -Wno-long-long -Wimplicit-fallthrough -Wcovered-switch-default -Wno-noexcept-type -Wnon-virtual-dtor -Wdelete-non-virtual-dtor -Wstring-conversion -fdiagnostics-color -fno-common -Woverloaded-virtual -Wno-nested-anon-types -O3 -isysroot /Applications/Xcode.app/Contents/Developer/Platforms/MacOSX.platform/Developer/SDKs/MacOSX10.15.sdk -Wl,-search_paths_first -Wl,-headerpad_max_install_names -Wl,-dead_strip tools/clang/tools/arcmt-test/CMakeFiles/arcmt-test.dir/arcmt-test.cpp.o -o bin/arcmt-test -Wl,-rpath,@loader_path/../lib lib/libLLVMSupport.a lib/libclangARCMigrate.a lib/libclangBasic.a lib/libclangFrontend.a lib/libclangLex.a lib/libclangSerialization.a lib/libclangDriver.a lib/libclangParse.a lib/libLLVMOption.a lib/libclangRewrite.a lib/libclangSema.a lib/libclangAnalysis.a lib/libclangASTMatchers.a lib/libclangEdit.a lib/libclangAST.a lib/libclangLex.a lib/libclangBasic.a lib/libLLVMFrontendOpenMP.a lib/libLLVMTransformUtils.a lib/libLLVMAnalysis.a lib/libLLVMProfileData.a lib/libLLVMObject.a lib/libLLVMBitReader.a lib/libLLVMCore.a lib/libLLVMRemarks.a lib/libLLVMBitstreamReader.a lib/libLLVMMCParser.a lib/libLLVMMC.a lib/libLLVMDebugInfoCodeView.a lib/libLLVMDebugInfoMSF.a lib/libLLVMTextAPI.a lib/libLLVMBinaryFormat.a lib/libLLVMSupport.a -lz -lcurses -lm lib/libLLVMDemangle.a && : FAILED: bin/arcmt-test : && /Users/buildslave/jenkins/workspace/lldb-cmake/host-compiler/bin/clang++ -Wdocumentation -fPIC -fvisibility-inlines-hidden -Werror=date-time -Werror=unguarded-availability-new -fmodules -fmodules-cache-path=/Users/buildslave/jenkins/workspace/lldb-cmake/lldb-build/module.cache -fcxx-modules -Xclang -fmodules-local-submodule-visibility -Wall -Wextra -Wno-unused-parameter -Wwrite-strings -Wcast-qual -Wmissing-field-initializers -pedantic -Wno-long-long -Wimplicit-fallthrough -Wcovered-switch-default -Wno-noexcept-type -Wnon-virtual-dtor -Wdelete-non-virtual-dtor -Wstring-conversion -fdiagnostics-color -fno-common -Woverloaded-virtual -Wno-nested-anon-types -O3 -isysroot /Applications/Xcode.app/Contents/Developer/Platforms/MacOSX.platform/Developer/SDKs/MacOSX10.15.sdk -Wl,-search_paths_first -Wl,-headerpad_max_install_names -Wl,-dead_strip tools/clang/tools/arcmt-test/CMakeFiles/arcmt-test.dir/arcmt-test.cpp.o -o bin/arcmt-test -Wl,-rpath,@loader_path/../lib lib/libLLVMSupport.a lib/libclangARCMigrate.a lib/libclangBasic.a lib/libclangFrontend.a lib/libclangLex.a lib/libclangSerialization.a lib/libclangDriver.a lib/libclangParse.a lib/libLLVMOption.a lib/libclangRewrite.a lib/libclangSema.a lib/libclangAnalysis.a lib/libclangASTMatchers.a lib/libclangEdit.a lib/libclangAST.a lib/libclangLex.a lib/libclangBasic.a lib/libLLVMFrontendOpenMP.a lib/libLLVMTransformUtils.a lib/libLLVMAnalysis.a lib/libLLVMProfileData.a lib/libLLVMObject.a lib/libLLVMBitReader.a lib/libLLVMCore.a lib/libLLVMRemarks.a lib/libLLVMBitstreamReader.a lib/libLLVMMCParser.a lib/libLLVMMC.a lib/libLLVMDebugInfoCodeView.a lib/libLLVMDebugInfoMSF.a lib/libLLVMTextAPI.a lib/libLLVMBinaryFormat.a lib/libLLVMSupport.a -lz -lcurses -lm lib/libLLVMDemangle.a && : Undefined symbols for architecture x86_64: "clang::ento::PackageInfo::dumpToStream(llvm::raw_ostream&) const", referenced from: clang::ento::PackageInfo::dump() const in arcmt-test.cpp.o clang::ento::PackageInfo::dump() const in libclangFrontend.a(CompilerInvocation.cpp.o) clang::ento::PackageInfo::dump() const in libclangFrontend.a(TextDiagnosticPrinter.cpp.o) clang::ento::PackageInfo::dump() const in libclangFrontend.a(VerifyDiagnosticConsumer.cpp.o) clang::ento::PackageInfo::dump() const in libclangARCMigrate.a(ARCMT.cpp.o) clang::ento::PackageInfo::dump() const in libclangARCMigrate.a(Transforms.cpp.o) clang::ento::PackageInfo::dump() const in libclangFrontend.a(FrontendAction.cpp.o) ... "clang::ento::CmdLineOption::dumpToStream(llvm::raw_ostream&) const", referenced from: clang::ento::CmdLineOption::dump() const in arcmt-test.cpp.o clang::ento::CmdLineOption::dump() const in libclangFrontend.a(CompilerInvocation.cpp.o) clang::ento::CmdLineOption::dump() const in libclangFrontend.a(TextDiagnosticPrinter.cpp.o) clang::ento::CmdLineOption::dump() const in libclangFrontend.a(VerifyDiagnosticConsumer.cpp.o) clang::ento::CmdLineOption::dump() const in libclangARCMigrate.a(ARCMT.cpp.o) clang::ento::CmdLineOption::dump() const in libclangARCMigrate.a(Transforms.cpp.o) clang::ento::CmdLineOption::dump() const in libclangFrontend.a(FrontendAction.cpp.o) ... "clang::ento::CheckerInfo::dumpToStream(llvm::raw_ostream&) const", referenced from: clang::ento::CheckerInfo::dump() const in arcmt-test.cpp.o clang::ento::CheckerInfo::dump() const in libclangFrontend.a(CompilerInvocation.cpp.o) clang::ento::CheckerInfo::dump() const in libclangFrontend.a(TextDiagnosticPrinter.cpp.o) clang::ento::CheckerInfo::dump() const in libclangFrontend.a(VerifyDiagnosticConsumer.cpp.o) clang::ento::CheckerInfo::dump() const in libclangARCMigrate.a(ARCMT.cpp.o) clang::ento::CheckerInfo::dump() const in libclangARCMigrate.a(Transforms.cpp.o) clang::ento::CheckerInfo::dump() const in libclangFrontend.a(FrontendAction.cpp.o) ... ld: symbol(s) not found for architecture x86_64 clang-11: error: linker command failed with exit code 1 (use -v to see invocation) [8/1265] : && /Users/buildslave/jenkins/workspace/lldb-cmake/host-compiler/bin/clang++ -Wdocumentation -fPIC -fvisibility-inlines-hidden -Werror=date-time -Werror=unguarded-availability-new -fmodules -fmodules-cache-path=/Users/buildslave/jenkins/workspace/lldb-cmake/lldb-build/module.cache -fcxx-modules -Xclang -fmodules-local-submodule-visibility -Wall -Wextra -Wno-unused-parameter -Wwrite-strings -Wcast-qual -Wmissing-field-initializers -pedantic -Wno-long-long -Wimplicit-fallthrough -Wcovered-switch-default -Wno-noexcept-type -Wnon-virtual-dtor -Wdelete-non-virtual-dtor -Wstring-conversion -fdiagnostics-color -fno-common -Woverloaded-virtual -Wno-nested-anon-types -O3 -isysroot /Applications/Xcode.app/Contents/Developer/Platforms/MacOSX.platform/Developer/SDKs/MacOSX10.15.sdk -Wl,-search_paths_first -Wl,-headerpad_max_install_names -Wl,-dead_strip tools/clang/tools/clang-extdef-mapping/CMakeFiles/clang-extdef-mapping.dir/ClangExtDefMapGen.cpp.o -o bin/clang-extdef-mapping -Wl,-rpath,@loader_path/../lib lib/libLLVMAArch64CodeGen.a lib/libLLVMAArch64AsmParser.a lib/libLLVMAArch64Desc.a lib/libLLVMAArch64Disassembler.a lib/libLLVMAArch64Info.a lib/libLLVMAArch64Utils.a lib/libLLVMAMDGPUCodeGen.a lib/libLLVMAMDGPUAsmParser.a lib/libLLVMAMDGPUDesc.a lib/libLLVMAMDGPUDisassembler.a lib/libLLVMAMDGPUInfo.a lib/libLLVMAMDGPUUtils.a lib/libLLVMARMCodeGen.a lib/libLLVMARMAsmParser.a lib/libLLVMARMDesc.a lib/libLLVMARMDisassembler.a lib/libLLVMARMInfo.a lib/libLLVMARMUtils.a lib/libLLVMAVRCodeGen.a lib/libLLVMAVRAsmParser.a lib/libLLVMAVRDesc.a lib/libLLVMAVRDisassembler.a lib/libLLVMAVRInfo.a lib/libLLVMBPFCodeGen.a lib/libLLVMBPFAsmParser.a lib/libLLVMBPFDesc.a lib/libLLVMBPFDisassembler.a lib/libLLVMBPFInfo.a lib/libLLVMHexagonCodeGen.a lib/libLLVMHexagonAsmParser.a lib/libLLVMHexagonDesc.a lib/libLLVMHexagonDisassembler.a lib/libLLVMHexagonInfo.a lib/libLLVMLanaiCodeGen.a lib/libLLVMLanaiAsmParser.a lib/libLLVMLanaiDesc.a lib/libLLVMLanaiDisassembler.a lib/libLLVMLanaiInfo.a lib/libLLVMMipsCodeGen.a lib/libLLVMMipsAsmParser.a lib/libLLVMMipsDesc.a lib/libLLVMMipsDisassembler.a lib/libLLVMMipsInfo.a lib/libLLVMMSP430CodeGen.a lib/libLLVMMSP430AsmParser.a lib/libLLVMMSP430Desc.a lib/libLLVMMSP430Disassembler.a lib/libLLVMMSP430Info.a lib/libLLVMNVPTXCodeGen.a lib/libLLVMNVPTXDesc.a lib/libLLVMNVPTXInfo.a lib/libLLVMPowerPCCodeGen.a lib/libLLVMPowerPCAsmParser.a lib/libLLVMPowerPCDesc.a lib/libLLVMPowerPCDisassembler.a lib/libLLVMPowerPCInfo.a lib/libLLVMRISCVCodeGen.a lib/libLLVMRISCVAsmParser.a lib/libLLVMRISCVDesc.a lib/libLLVMRISCVDisassembler.a lib/libLLVMRISCVInfo.a lib/libLLVMRISCVUtils.a lib/libLLVMSparcCodeGen.a lib/libLLVMSparcAsmParser.a lib/libLLVMSparcDesc.a lib/libLLVMSparcDisassembler.a lib/libLLVMSparcInfo.a lib/libLLVMSystemZCodeGen.a lib/libLLVMSystemZAsmParser.a lib/libLLVMSystemZDesc.a lib/libLLVMSystemZDisassembler.a lib/libLLVMSystemZInfo.a lib/libLLVMWebAssemblyCodeGen.a lib/libLLVMWebAssemblyAsmParser.a lib/libLLVMWebAssemblyDesc.a lib/libLLVMWebAssemblyDisassembler.a lib/libLLVMWebAssemblyInfo.a lib/libLLVMX86CodeGen.a lib/libLLVMX86AsmParser.a lib/libLLVMX86Desc.a lib/libLLVMX86Disassembler.a lib/libLLVMX86Info.a lib/libLLVMXCoreCodeGen.a lib/libLLVMXCoreDesc.a lib/libLLVMXCoreDisassembler.a lib/libLLVMXCoreInfo.a lib/libLLVMSupport.a lib/libclangAST.a lib/libclangBasic.a lib/libclangCrossTU.a lib/libclangFrontend.a lib/libclangSerialization.a lib/libclangTooling.a lib/libLLVMAArch64Desc.a lib/libLLVMAArch64Info.a lib/libLLVMAArch64Utils.a lib/libLLVMMIRParser.a lib/libLLVMAMDGPUDesc.a lib/libLLVMAMDGPUInfo.a lib/libLLVMAMDGPUUtils.a lib/libLLVMARMDesc.a lib/libLLVMARMInfo.a lib/libLLVMARMUtils.a lib/libLLVMHexagonDesc.a lib/libLLVMHexagonInfo.a lib/libLLVMLanaiDesc.a lib/libLLVMLanaiInfo.a lib/libLLVMipo.a lib/libLLVMVectorize.a lib/libLLVMIRReader.a lib/libLLVMAsmParser.a lib/libLLVMInstrumentation.a lib/libLLVMLinker.a lib/libLLVMSystemZDesc.a lib/libLLVMSystemZInfo.a lib/libLLVMWebAssemblyDesc.a lib/libLLVMWebAssemblyInfo.a lib/libLLVMCFGuard.a lib/libLLVMGlobalISel.a lib/libLLVMAsmPrinter.a lib/libLLVMDebugInfoDWARF.a lib/libLLVMSelectionDAG.a lib/libLLVMCodeGen.a lib/libLLVMScalarOpts.a lib/libLLVMAggressiveInstCombine.a lib/libLLVMInstCombine.a lib/libLLVMBitWriter.a lib/libLLVMTarget.a lib/libLLVMMCDisassembler.a lib/libclangIndex.a lib/libclangFrontend.a lib/libclangParse.a lib/libclangSerialization.a lib/libclangSema.a lib/libclangEdit.a lib/libclangAnalysis.a lib/libclangDriver.a lib/libLLVMOption.a lib/libclangASTMatchers.a lib/libclangFormat.a lib/libclangToolingInclusions.a lib/libclangToolingCore.a lib/libclangAST.a lib/libLLVMFrontendOpenMP.a lib/libLLVMTransformUtils.a lib/libLLVMAnalysis.a lib/libLLVMProfileData.a lib/libLLVMObject.a lib/libLLVMMCParser.a lib/libLLVMBitReader.a lib/libLLVMTextAPI.a lib/libclangRewrite.a lib/libclangLex.a lib/libclangBasic.a lib/libLLVMCore.a lib/libLLVMRemarks.a lib/libLLVMBitstreamReader.a lib/libLLVMMC.a lib/libLLVMBinaryFormat.a lib/libLLVMDebugInfoCodeView.a lib/libLLVMDebugInfoMSF.a lib/libLLVMSupport.a -lz -lcurses -lm lib/libLLVMDemangle.a && : FAILED: bin/clang-extdef-mapping : && /Users/buildslave/jenkins/workspace/lldb-cmake/host-compiler/bin/clang++ -Wdocumentation -fPIC -fvisibility-inlines-hidden -Werror=date-time -Werror=unguarded-availability-new -fmodules -fmodules-cache-path=/Users/buildslave/jenkins/workspace/lldb-cmake/lldb-build/module.cache -fcxx-modules -Xclang -fmodules-local-submodule-visibility -Wall -Wextra -Wno-unused-parameter -Wwrite-strings -Wcast-qual -Wmissing-field-initializers -pedantic -Wno-long-long -Wimplicit-fallthrough -Wcovered-switch-default -Wno-noexcept-type -Wnon-virtual-dtor -Wdelete-non-virtual-dtor -Wstring-conversion -fdiagnostics-color -fno-common -Woverloaded-virtual -Wno-nested-anon-types -O3 -isysroot /Applications/Xcode.app/Contents/Developer/Platforms/MacOSX.platform/Developer/SDKs/MacOSX10.15.sdk -Wl,-search_paths_first -Wl,-headerpad_max_install_names -Wl,-dead_strip tools/clang/tools/clang-extdef-mapping/CMakeFiles/clang-extdef-mapping.dir/ClangExtDefMapGen.cpp.o -o bin/clang-extdef-mapping -Wl,-rpath,@loader_path/../lib lib/libLLVMAArch64CodeGen.a lib/libLLVMAArch64AsmParser.a lib/libLLVMAArch64Desc.a lib/libLLVMAArch64Disassembler.a lib/libLLVMAArch64Info.a lib/libLLVMAArch64Utils.a lib/libLLVMAMDGPUCodeGen.a lib/libLLVMAMDGPUAsmParser.a lib/libLLVMAMDGPUDesc.a lib/libLLVMAMDGPUDisassembler.a lib/libLLVMAMDGPUInfo.a lib/libLLVMAMDGPUUtils.a lib/libLLVMARMCodeGen.a lib/libLLVMARMAsmParser.a lib/libLLVMARMDesc.a lib/libLLVMARMDisassembler.a lib/libLLVMARMInfo.a lib/libLLVMARMUtils.a lib/libLLVMAVRCodeGen.a lib/libLLVMAVRAsmParser.a lib/libLLVMAVRDesc.a lib/libLLVMAVRDisassembler.a lib/libLLVMAVRInfo.a lib/libLLVMBPFCodeGen.a lib/libLLVMBPFAsmParser.a lib/libLLVMBPFDesc.a lib/libLLVMBPFDisassembler.a lib/libLLVMBPFInfo.a lib/libLLVMHexagonCodeGen.a lib/libLLVMHexagonAsmParser.a lib/libLLVMHexagonDesc.a lib/libLLVMHexagonDisassembler.a lib/libLLVMHexagonInfo.a lib/libLLVMLanaiCodeGen.a lib/libLLVMLanaiAsmParser.a lib/libLLVMLanaiDesc.a lib/libLLVMLanaiDisassembler.a lib/libLLVMLanaiInfo.a lib/libLLVMMipsCodeGen.a lib/libLLVMMipsAsmParser.a lib/libLLVMMipsDesc.a lib/libLLVMMipsDisassembler.a lib/libLLVMMipsInfo.a lib/libLLVMMSP430CodeGen.a lib/libLLVMMSP430AsmParser.a lib/libLLVMMSP430Desc.a lib/libLLVMMSP430Disassembler.a lib/libLLVMMSP430Info.a lib/libLLVMNVPTXCodeGen.a lib/libLLVMNVPTXDesc.a lib/libLLVMNVPTXInfo.a lib/libLLVMPowerPCCodeGen.a lib/libLLVMPowerPCAsmParser.a lib/libLLVMPowerPCDesc.a lib/libLLVMPowerPCDisassembler.a lib/libLLVMPowerPCInfo.a lib/libLLVMRISCVCodeGen.a lib/libLLVMRISCVAsmParser.a lib/libLLVMRISCVDesc.a lib/libLLVMRISCVDisassembler.a lib/libLLVMRISCVInfo.a lib/libLLVMRISCVUtils.a lib/libLLVMSparcCodeGen.a lib/libLLVMSparcAsmParser.a lib/libLLVMSparcDesc.a lib/libLLVMSparcDisassembler.a lib/libLLVMSparcInfo.a lib/libLLVMSystemZCodeGen.a lib/libLLVMSystemZAsmParser.a lib/libLLVMSystemZDesc.a lib/libLLVMSystemZDisassembler.a lib/libLLVMSystemZInfo.a lib/libLLVMWebAssemblyCodeGen.a lib/libLLVMWebAssemblyAsmParser.a lib/libLLVMWebAssemblyDesc.a lib/libLLVMWebAssemblyDisassembler.a lib/libLLVMWebAssemblyInfo.a lib/libLLVMX86CodeGen.a lib/libLLVMX86AsmParser.a lib/libLLVMX86Desc.a lib/libLLVMX86Disassembler.a lib/libLLVMX86Info.a lib/libLLVMXCoreCodeGen.a lib/libLLVMXCoreDesc.a lib/libLLVMXCoreDisassembler.a lib/libLLVMXCoreInfo.a lib/libLLVMSupport.a lib/libclangAST.a lib/libclangBasic.a lib/libclangCrossTU.a lib/libclangFrontend.a lib/libclangSerialization.a lib/libclangTooling.a lib/libLLVMAArch64Desc.a lib/libLLVMAArch64Info.a lib/libLLVMAArch64Utils.a lib/libLLVMMIRParser.a lib/libLLVMAMDGPUDesc.a lib/libLLVMAMDGPUInfo.a lib/libLLVMAMDGPUUtils.a lib/libLLVMARMDesc.a lib/libLLVMARMInfo.a lib/libLLVMARMUtils.a lib/libLLVMHexagonDesc.a lib/libLLVMHexagonInfo.a lib/libLLVMLanaiDesc.a lib/libLLVMLanaiInfo.a lib/libLLVMipo.a lib/libLLVMVectorize.a lib/libLLVMIRReader.a lib/libLLVMAsmParser.a lib/libLLVMInstrumentation.a lib/libLLVMLinker.a lib/libLLVMSystemZDesc.a lib/libLLVMSystemZInfo.a lib/libLLVMWebAssemblyDesc.a lib/libLLVMWebAssemblyInfo.a lib/libLLVMCFGuard.a lib/libLLVMGlobalISel.a lib/libLLVMAsmPrinter.a lib/libLLVMDebugInfoDWARF.a lib/libLLVMSelectionDAG.a lib/libLLVMCodeGen.a lib/libLLVMScalarOpts.a lib/libLLVMAggressiveInstCombine.a lib/libLLVMInstCombine.a lib/libLLVMBitWriter.a lib/libLLVMTarget.a lib/libLLVMMCDisassembler.a lib/libclangIndex.a lib/libclangFrontend.a lib/libclangParse.a lib/libclangSerialization.a lib/libclangSema.a lib/libclangEdit.a lib/libclangAnalysis.a lib/libclangDriver.a lib/libLLVMOption.a lib/libclangASTMatchers.a lib/libclangFormat.a lib/libclangToolingInclusions.a lib/libclangToolingCore.a lib/libclangAST.a lib/libLLVMFrontendOpenMP.a lib/libLLVMTransformUtils.a lib/libLLVMAnalysis.a lib/libLLVMProfileData.a lib/libLLVMObject.a lib/libLLVMMCParser.a lib/libLLVMBitReader.a lib/libLLVMTextAPI.a lib/libclangRewrite.a lib/libclangLex.a lib/libclangBasic.a lib/libLLVMCore.a lib/libLLVMRemarks.a lib/libLLVMBitstreamReader.a lib/libLLVMMC.a lib/libLLVMBinaryFormat.a lib/libLLVMDebugInfoCodeView.a lib/libLLVMDebugInfoMSF.a lib/libLLVMSupport.a -lz -lcurses -lm lib/libLLVMDemangle.a && : Undefined symbols for architecture x86_64: "clang::ento::PackageInfo::dumpToStream(llvm::raw_ostream&) const", referenced from: clang::ento::PackageInfo::dump() const in ClangExtDefMapGen.cpp.o clang::ento::PackageInfo::dump() const in libclangFrontend.a(FrontendAction.cpp.o) clang::ento::PackageInfo::dump() const in libclangTooling.a(CommonOptionsParser.cpp.o) clang::ento::PackageInfo::dump() const in libclangTooling.a(Tooling.cpp.o) clang::ento::PackageInfo::dump() const in libclangCrossTU.a(CrossTranslationUnit.cpp.o) clang::ento::PackageInfo::dump() const in libclangFrontend.a(CompilerInstance.cpp.o) clang::ento::PackageInfo::dump() const in libclangFrontend.a(MultiplexConsumer.cpp.o) ... "clang::ento::CmdLineOption::dumpToStream(llvm::raw_ostream&) const", referenced from: clang::ento::CmdLineOption::dump() const in ClangExtDefMapGen.cpp.o clang::ento::CmdLineOption::dump() const in libclangFrontend.a(FrontendAction.cpp.o) clang::ento::CmdLineOption::dump() const in libclangTooling.a(CommonOptionsParser.cpp.o) clang::ento::CmdLineOption::dump() const in libclangTooling.a(Tooling.cpp.o) clang::ento::CmdLineOption::dump() const in libclangCrossTU.a(CrossTranslationUnit.cpp.o) clang::ento::CmdLineOption::dump() const in libclangFrontend.a(CompilerInstance.cpp.o) clang::ento::CmdLineOption::dump() const in libclangFrontend.a(MultiplexConsumer.cpp.o) ... "clang::ento::CheckerInfo::dumpToStream(llvm::raw_ostream&) const", referenced from: clang::ento::CheckerInfo::dump() const in ClangExtDefMapGen.cpp.o clang::ento::CheckerInfo::dump() const in libclangFrontend.a(FrontendAction.cpp.o) clang::ento::CheckerInfo::dump() const in libclangTooling.a(CommonOptionsParser.cpp.o) clang::ento::CheckerInfo::dump() const in libclangTooling.a(Tooling.cpp.o) clang::ento::CheckerInfo::dump() const in libclangCrossTU.a(CrossTranslationUnit.cpp.o) clang::ento::CheckerInfo::dump() const in libclangFrontend.a(CompilerInstance.cpp.o) clang::ento::CheckerInfo::dump() const in libclangFrontend.a(MultiplexConsumer.cpp.o) ... ld: symbol(s) not found for architecture x86_64 clang-11: error: linker command failed with exit code 1 (use -v to see invocation) [9/1265] : && /Users/buildslave/jenkins/workspace/lldb-cmake/host-compiler/bin/clang++ -Wdocumentation -fPIC -fvisibility-inlines-hidden -Werror=date-time -Werror=unguarded-availability-new -fmodules -fmodules-cache-path=/Users/buildslave/jenkins/workspace/lldb-cmake/lldb-build/module.cache -fcxx-modules -Xclang -fmodules-local-submodule-visibility -Wall -Wextra -Wno-unused-parameter -Wwrite-strings -Wcast-qual -Wmissing-field-initializers -pedantic -Wno-long-long -Wimplicit-fallthrough -Wcovered-switch-default -Wno-noexcept-type -Wnon-virtual-dtor -Wdelete-non-virtual-dtor -Wstring-conversion -fdiagnostics-color -fno-common -Woverloaded-virtual -Wno-nested-anon-types -O3 -isysroot /Applications/Xcode.app/Contents/Developer/Platforms/MacOSX.platform/Developer/SDKs/MacOSX10.15.sdk -Wl,-search_paths_first -Wl,-headerpad_max_install_names -Wl,-dead_strip tools/clang/tools/clang-import-test/CMakeFiles/clang-import-test.dir/clang-import-test.cpp.o -o bin/clang-import-test -Wl,-rpath,@loader_path/../lib lib/libLLVMCore.a lib/libLLVMSupport.a lib/libclangAST.a lib/libclangBasic.a lib/libclangCodeGen.a lib/libclangDriver.a lib/libclangFrontend.a lib/libclangLex.a lib/libclangParse.a lib/libclangSerialization.a lib/libclangDriver.a lib/libLLVMOption.a lib/libclangSema.a lib/libclangEdit.a lib/libclangAnalysis.a lib/libclangASTMatchers.a lib/libclangAST.a lib/libclangLex.a lib/libclangBasic.a lib/libLLVMCoverage.a lib/libLLVMLTO.a lib/libLLVMExtensions.a lib/libLLVMCodeGen.a lib/libLLVMObjCARCOpts.a lib/libLLVMPasses.a lib/libLLVMCoroutines.a lib/libLLVMipo.a lib/libLLVMFrontendOpenMP.a lib/libLLVMBitWriter.a lib/libLLVMIRReader.a lib/libLLVMAsmParser.a lib/libLLVMLinker.a lib/libLLVMInstrumentation.a lib/libLLVMVectorize.a lib/libLLVMScalarOpts.a lib/libLLVMAggressiveInstCombine.a lib/libLLVMInstCombine.a lib/libLLVMTarget.a lib/libLLVMTransformUtils.a lib/libLLVMAnalysis.a lib/libLLVMObject.a lib/libLLVMBitReader.a lib/libLLVMMCParser.a lib/libLLVMMC.a lib/libLLVMDebugInfoCodeView.a lib/libLLVMDebugInfoMSF.a lib/libLLVMTextAPI.a lib/libLLVMProfileData.a lib/libLLVMCore.a lib/libLLVMBinaryFormat.a lib/libLLVMRemarks.a lib/libLLVMBitstreamReader.a lib/libLLVMSupport.a -lz -lcurses -lm lib/libLLVMDemangle.a && : FAILED: bin/clang-import-test : && /Users/buildslave/jenkins/workspace/lldb-cmake/host-compiler/bin/clang++ -Wdocumentation -fPIC -fvisibility-inlines-hidden -Werror=date-time -Werror=unguarded-availability-new -fmodules -fmodules-cache-path=/Users/buildslave/jenkins/workspace/lldb-cmake/lldb-build/module.cache -fcxx-modules -Xclang -fmodules-local-submodule-visibility -Wall -Wextra -Wno-unused-parameter -Wwrite-strings -Wcast-qual -Wmissing-field-initializers -pedantic -Wno-long-long -Wimplicit-fallthrough -Wcovered-switch-default -Wno-noexcept-type -Wnon-virtual-dtor -Wdelete-non-virtual-dtor -Wstring-conversion -fdiagnostics-color -fno-common -Woverloaded-virtual -Wno-nested-anon-types -O3 -isysroot /Applications/Xcode.app/Contents/Developer/Platforms/MacOSX.platform/Developer/SDKs/MacOSX10.15.sdk -Wl,-search_paths_first -Wl,-headerpad_max_install_names -Wl,-dead_strip tools/clang/tools/clang-import-test/CMakeFiles/clang-import-test.dir/clang-import-test.cpp.o -o bin/clang-import-test -Wl,-rpath,@loader_path/../lib lib/libLLVMCore.a lib/libLLVMSupport.a lib/libclangAST.a lib/libclangBasic.a lib/libclangCodeGen.a lib/libclangDriver.a lib/libclangFrontend.a lib/libclangLex.a lib/libclangParse.a lib/libclangSerialization.a lib/libclangDriver.a lib/libLLVMOption.a lib/libclangSema.a lib/libclangEdit.a lib/libclangAnalysis.a lib/libclangASTMatchers.a lib/libclangAST.a lib/libclangLex.a lib/libclangBasic.a lib/libLLVMCoverage.a lib/libLLVMLTO.a lib/libLLVMExtensions.a lib/libLLVMCodeGen.a lib/libLLVMObjCARCOpts.a lib/libLLVMPasses.a lib/libLLVMCoroutines.a lib/libLLVMipo.a lib/libLLVMFrontendOpenMP.a lib/libLLVMBitWriter.a lib/libLLVMIRReader.a lib/libLLVMAsmParser.a lib/libLLVMLinker.a lib/libLLVMInstrumentation.a lib/libLLVMVectorize.a lib/libLLVMScalarOpts.a lib/libLLVMAggressiveInstCombine.a lib/libLLVMInstCombine.a lib/libLLVMTarget.a lib/libLLVMTransformUtils.a lib/libLLVMAnalysis.a lib/libLLVMObject.a lib/libLLVMBitReader.a lib/libLLVMMCParser.a lib/libLLVMMC.a lib/libLLVMDebugInfoCodeView.a lib/libLLVMDebugInfoMSF.a lib/libLLVMTextAPI.a lib/libLLVMProfileData.a lib/libLLVMCore.a lib/libLLVMBinaryFormat.a lib/libLLVMRemarks.a lib/libLLVMBitstreamReader.a lib/libLLVMSupport.a -lz -lcurses -lm lib/libLLVMDemangle.a && : Undefined symbols for architecture x86_64: "clang::ento::PackageInfo::dumpToStream(llvm::raw_ostream&) const", referenced from: clang::ento::PackageInfo::dump() const in clang-import-test.cpp.o clang::ento::PackageInfo::dump() const in libclangCodeGen.a(ModuleBuilder.cpp.o) clang::ento::PackageInfo::dump() const in libclangFrontend.a(ASTConsumers.cpp.o) clang::ento::PackageInfo::dump() const in libclangFrontend.a(CompilerInstance.cpp.o) clang::ento::PackageInfo::dump() const in libclangFrontend.a(MultiplexConsumer.cpp.o) clang::ento::PackageInfo::dump() const in libclangFrontend.a(CompilerInvocation.cpp.o) clang::ento::PackageInfo::dump() const in libclangFrontend.a(TextDiagnosticBuffer.cpp.o) ... "clang::ento::CmdLineOption::dumpToStream(llvm::raw_ostream&) const", referenced from: clang::ento::CmdLineOption::dump() const in clang-import-test.cpp.o clang::ento::CmdLineOption::dump() const in libclangCodeGen.a(ModuleBuilder.cpp.o) clang::ento::CmdLineOption::dump() const in libclangFrontend.a(ASTConsumers.cpp.o) clang::ento::CmdLineOption::dump() const in libclangFrontend.a(CompilerInstance.cpp.o) clang::ento::CmdLineOption::dump() const in libclangFrontend.a(MultiplexConsumer.cpp.o) clang::ento::CmdLineOption::dump() const in libclangFrontend.a(CompilerInvocation.cpp.o) clang::ento::CmdLineOption::dump() const in libclangFrontend.a(TextDiagnosticBuffer.cpp.o) ... "clang::ento::CheckerInfo::dumpToStream(llvm::raw_ostream&) const", referenced from: clang::ento::CheckerInfo::dump() const in clang-import-test.cpp.o clang::ento::CheckerInfo::dump() const in libclangCodeGen.a(ModuleBuilder.cpp.o) clang::ento::CheckerInfo::dump() const in libclangFrontend.a(ASTConsumers.cpp.o) clang::ento::CheckerInfo::dump() const in libclangFrontend.a(CompilerInstance.cpp.o) clang::ento::CheckerInfo::dump() const in libclangFrontend.a(MultiplexConsumer.cpp.o) clang::ento::CheckerInfo::dump() const in libclangFrontend.a(CompilerInvocation.cpp.o) clang::ento::CheckerInfo::dump() const in libclangFrontend.a(TextDiagnosticBuffer.cpp.o) ... ld: symbol(s) not found for architecture x86_64 clang-11: error: linker command failed with exit code 1 (use -v to see invocation) [10/1265] : && /Users/buildslave/jenkins/workspace/lldb-cmake/host-compiler/bin/clang++ -Wdocumentation -fPIC -fvisibility-inlines-hidden -Werror=date-time -Werror=unguarded-availability-new -fmodules -fmodules-cache-path=/Users/buildslave/jenkins/workspace/lldb-cmake/lldb-build/module.cache -fcxx-modules -Xclang -fmodules-local-submodule-visibility -Wall -Wextra -Wno-unused-parameter -Wwrite-strings -Wcast-qual -Wmissing-field-initializers -pedantic -Wno-long-long -Wimplicit-fallthrough -Wcovered-switch-default -Wno-noexcept-type -Wnon-virtual-dtor -Wdelete-non-virtual-dtor -Wstring-conversion -fdiagnostics-color -fno-common -Woverloaded-virtual -Wno-nested-anon-types -O3 -isysroot /Applications/Xcode.app/Contents/Developer/Platforms/MacOSX.platform/Developer/SDKs/MacOSX10.15.sdk -dynamiclib -Wl,-headerpad_max_install_names -Wl,-dead_strip -Wl,-exported_symbols_list,"/Users/buildslave/jenkins/workspace/lldb-cmake/lldb-build/tools/clang/tools/libclang/libclang.exports" -Wl,-compatibility_version -Wl,1 -Wl,-current_version -Wl,11.0.99 -o lib/libclang.dylib -install_name @rpath/libclang.dylib tools/clang/tools/libclang/CMakeFiles/libclang.dir/ARCMigrate.cpp.o tools/clang/tools/libclang/CMakeFiles/libclang.dir/BuildSystem.cpp.o tools/clang/tools/libclang/CMakeFiles/libclang.dir/CIndex.cpp.o tools/clang/tools/libclang/CMakeFiles/libclang.dir/CIndexCXX.cpp.o tools/clang/tools/libclang/CMakeFiles/libclang.dir/CIndexCodeCompletion.cpp.o tools/clang/tools/libclang/CMakeFiles/libclang.dir/CIndexDiagnostic.cpp.o tools/clang/tools/libclang/CMakeFiles/libclang.dir/CIndexHigh.cpp.o tools/clang/tools/libclang/CMakeFiles/libclang.dir/CIndexInclusionStack.cpp.o tools/clang/tools/libclang/CMakeFiles/libclang.dir/CIndexUSRs.cpp.o tools/clang/tools/libclang/CMakeFiles/libclang.dir/CIndexer.cpp.o tools/clang/tools/libclang/CMakeFiles/libclang.dir/CXComment.cpp.o tools/clang/tools/libclang/CMakeFiles/libclang.dir/CXCursor.cpp.o tools/clang/tools/libclang/CMakeFiles/libclang.dir/CXIndexDataConsumer.cpp.o tools/clang/tools/libclang/CMakeFiles/libclang.dir/CXCompilationDatabase.cpp.o tools/clang/tools/libclang/CMakeFiles/libclang.dir/CXLoadedDiagnostic.cpp.o tools/clang/tools/libclang/CMakeFiles/libclang.dir/CXSourceLocation.cpp.o tools/clang/tools/libclang/CMakeFiles/libclang.dir/CXStoredDiagnostic.cpp.o tools/clang/tools/libclang/CMakeFiles/libclang.dir/CXString.cpp.o tools/clang/tools/libclang/CMakeFiles/libclang.dir/CXType.cpp.o tools/clang/tools/libclang/CMakeFiles/libclang.dir/Indexing.cpp.o tools/clang/tools/libclang/CMakeFiles/libclang.dir/FatalErrorHandler.cpp.o -Wl,-rpath,@loader_path/../lib lib/libclangAST.a lib/libclangBasic.a lib/libclangDriver.a lib/libclangFrontend.a lib/libclangIndex.a lib/libclangLex.a lib/libclangSema.a lib/libclangSerialization.a lib/libclangTooling.a lib/libclangARCMigrate.a lib/libLLVMAArch64CodeGen.a lib/libLLVMAArch64AsmParser.a lib/libLLVMAArch64Desc.a lib/libLLVMAArch64Disassembler.a lib/libLLVMAArch64Info.a lib/libLLVMAArch64Utils.a lib/libLLVMAMDGPUCodeGen.a lib/libLLVMAMDGPUAsmParser.a lib/libLLVMAMDGPUDesc.a lib/libLLVMAMDGPUDisassembler.a lib/libLLVMAMDGPUInfo.a lib/libLLVMAMDGPUUtils.a lib/libLLVMARMCodeGen.a lib/libLLVMARMAsmParser.a lib/libLLVMARMDesc.a lib/libLLVMARMDisassembler.a lib/libLLVMARMInfo.a lib/libLLVMARMUtils.a lib/libLLVMAVRCodeGen.a lib/libLLVMAVRAsmParser.a lib/libLLVMAVRDesc.a lib/libLLVMAVRDisassembler.a lib/libLLVMAVRInfo.a lib/libLLVMBPFCodeGen.a lib/libLLVMBPFAsmParser.a lib/libLLVMBPFDesc.a lib/libLLVMBPFDisassembler.a lib/libLLVMBPFInfo.a lib/libLLVMHexagonCodeGen.a lib/libLLVMHexagonAsmParser.a lib/libLLVMHexagonDesc.a lib/libLLVMHexagonDisassembler.a lib/libLLVMHexagonInfo.a lib/libLLVMLanaiCodeGen.a lib/libLLVMLanaiAsmParser.a lib/libLLVMLanaiDesc.a lib/libLLVMLanaiDisassembler.a lib/libLLVMLanaiInfo.a lib/libLLVMMipsCodeGen.a lib/libLLVMMipsAsmParser.a lib/libLLVMMipsDesc.a lib/libLLVMMipsDisassembler.a lib/libLLVMMipsInfo.a lib/libLLVMMSP430CodeGen.a lib/libLLVMMSP430AsmParser.a lib/libLLVMMSP430Desc.a lib/libLLVMMSP430Disassembler.a lib/libLLVMMSP430Info.a lib/libLLVMNVPTXCodeGen.a lib/libLLVMNVPTXDesc.a lib/libLLVMNVPTXInfo.a lib/libLLVMPowerPCCodeGen.a lib/libLLVMPowerPCAsmParser.a lib/libLLVMPowerPCDesc.a lib/libLLVMPowerPCDisassembler.a lib/libLLVMPowerPCInfo.a lib/libLLVMRISCVCodeGen.a lib/libLLVMRISCVAsmParser.a lib/libLLVMRISCVDesc.a lib/libLLVMRISCVDisassembler.a lib/libLLVMRISCVInfo.a lib/libLLVMRISCVUtils.a lib/libLLVMSparcCodeGen.a lib/libLLVMSparcAsmParser.a lib/libLLVMSparcDesc.a lib/libLLVMSparcDisassembler.a lib/libLLVMSparcInfo.a lib/libLLVMSystemZCodeGen.a lib/libLLVMSystemZAsmParser.a lib/libLLVMSystemZDesc.a lib/libLLVMSystemZDisassembler.a lib/libLLVMSystemZInfo.a lib/libLLVMWebAssemblyCodeGen.a lib/libLLVMWebAssemblyAsmParser.a lib/libLLVMWebAssemblyDesc.a lib/libLLVMWebAssemblyDisassembler.a lib/libLLVMWebAssemblyInfo.a lib/libLLVMX86CodeGen.a lib/libLLVMX86AsmParser.a lib/libLLVMX86Desc.a lib/libLLVMX86Disassembler.a lib/libLLVMX86Info.a lib/libLLVMXCoreCodeGen.a lib/libLLVMXCoreDesc.a lib/libLLVMXCoreDisassembler.a lib/libLLVMXCoreInfo.a lib/libLLVMCore.a lib/libLLVMSupport.a lib/libclangFormat.a lib/libclangToolingInclusions.a lib/libclangToolingCore.a lib/libclangFrontend.a lib/libclangDriver.a lib/libLLVMOption.a lib/libclangParse.a lib/libclangSerialization.a lib/libclangSema.a lib/libclangEdit.a lib/libclangRewrite.a lib/libclangAnalysis.a lib/libclangASTMatchers.a lib/libclangAST.a lib/libclangLex.a lib/libclangBasic.a lib/libLLVMAArch64Desc.a lib/libLLVMAArch64Info.a lib/libLLVMAArch64Utils.a lib/libLLVMMIRParser.a lib/libLLVMAMDGPUDesc.a lib/libLLVMAMDGPUInfo.a lib/libLLVMAMDGPUUtils.a lib/libLLVMARMDesc.a lib/libLLVMARMInfo.a lib/libLLVMARMUtils.a lib/libLLVMHexagonDesc.a lib/libLLVMHexagonInfo.a lib/libLLVMLanaiDesc.a lib/libLLVMLanaiInfo.a lib/libLLVMipo.a lib/libLLVMFrontendOpenMP.a lib/libLLVMVectorize.a lib/libLLVMIRReader.a lib/libLLVMAsmParser.a lib/libLLVMInstrumentation.a lib/libLLVMLinker.a lib/libLLVMSystemZDesc.a lib/libLLVMSystemZInfo.a lib/libLLVMWebAssemblyDesc.a lib/libLLVMWebAssemblyInfo.a lib/libLLVMCFGuard.a lib/libLLVMGlobalISel.a lib/libLLVMAsmPrinter.a lib/libLLVMDebugInfoDWARF.a lib/libLLVMSelectionDAG.a lib/libLLVMCodeGen.a lib/libLLVMScalarOpts.a lib/libLLVMAggressiveInstCombine.a lib/libLLVMInstCombine.a lib/libLLVMBitWriter.a lib/libLLVMTarget.a lib/libLLVMTransformUtils.a lib/libLLVMAnalysis.a lib/libLLVMProfileData.a lib/libLLVMObject.a lib/libLLVMBitReader.a lib/libLLVMCore.a lib/libLLVMRemarks.a lib/libLLVMBitstreamReader.a lib/libLLVMMCParser.a lib/libLLVMTextAPI.a lib/libLLVMMCDisassembler.a lib/libLLVMMC.a lib/libLLVMBinaryFormat.a lib/libLLVMDebugInfoCodeView.a lib/libLLVMDebugInfoMSF.a lib/libLLVMSupport.a -lz -lcurses -lm lib/libLLVMDemangle.a && : FAILED: lib/libclang.dylib : && /Users/buildslave/jenkins/workspace/lldb-cmake/host-compiler/bin/clang++ -Wdocumentation -fPIC -fvisibility-inlines-hidden -Werror=date-time -Werror=unguarded-availability-new -fmodules -fmodules-cache-path=/Users/buildslave/jenkins/workspace/lldb-cmake/lldb-build/module.cache -fcxx-modules -Xclang -fmodules-local-submodule-visibility -Wall -Wextra -Wno-unused-parameter -Wwrite-strings -Wcast-qual -Wmissing-field-initializers -pedantic -Wno-long-long -Wimplicit-fallthrough -Wcovered-switch-default -Wno-noexcept-type -Wnon-virtual-dtor -Wdelete-non-virtual-dtor -Wstring-conversion -fdiagnostics-color -fno-common -Woverloaded-virtual -Wno-nested-anon-types -O3 -isysroot /Applications/Xcode.app/Contents/Developer/Platforms/MacOSX.platform/Developer/SDKs/MacOSX10.15.sdk -dynamiclib -Wl,-headerpad_max_install_names -Wl,-dead_strip -Wl,-exported_symbols_list,"/Users/buildslave/jenkins/workspace/lldb-cmake/lldb-build/tools/clang/tools/libclang/libclang.exports" -Wl,-compatibility_version -Wl,1 -Wl,-current_version -Wl,11.0.99 -o lib/libclang.dylib -install_name @rpath/libclang.dylib tools/clang/tools/libclang/CMakeFiles/libclang.dir/ARCMigrate.cpp.o tools/clang/tools/libclang/CMakeFiles/libclang.dir/BuildSystem.cpp.o tools/clang/tools/libclang/CMakeFiles/libclang.dir/CIndex.cpp.o tools/clang/tools/libclang/CMakeFiles/libclang.dir/CIndexCXX.cpp.o tools/clang/tools/libclang/CMakeFiles/libclang.dir/CIndexCodeCompletion.cpp.o tools/clang/tools/libclang/CMakeFiles/libclang.dir/CIndexDiagnostic.cpp.o tools/clang/tools/libclang/CMakeFiles/libclang.dir/CIndexHigh.cpp.o tools/clang/tools/libclang/CMakeFiles/libclang.dir/CIndexInclusionStack.cpp.o tools/clang/tools/libclang/CMakeFiles/libclang.dir/CIndexUSRs.cpp.o tools/clang/tools/libclang/CMakeFiles/libclang.dir/CIndexer.cpp.o tools/clang/tools/libclang/CMakeFiles/libclang.dir/CXComment.cpp.o tools/clang/tools/libclang/CMakeFiles/libclang.dir/CXCursor.cpp.o tools/clang/tools/libclang/CMakeFiles/libclang.dir/CXIndexDataConsumer.cpp.o tools/clang/tools/libclang/CMakeFiles/libclang.dir/CXCompilationDatabase.cpp.o tools/clang/tools/libclang/CMakeFiles/libclang.dir/CXLoadedDiagnostic.cpp.o tools/clang/tools/libclang/CMakeFiles/libclang.dir/CXSourceLocation.cpp.o tools/clang/tools/libclang/CMakeFiles/libclang.dir/CXStoredDiagnostic.cpp.o tools/clang/tools/libclang/CMakeFiles/libclang.dir/CXString.cpp.o tools/clang/tools/libclang/CMakeFiles/libclang.dir/CXType.cpp.o tools/clang/tools/libclang/CMakeFiles/libclang.dir/Indexing.cpp.o tools/clang/tools/libclang/CMakeFiles/libclang.dir/FatalErrorHandler.cpp.o -Wl,-rpath,@loader_path/../lib lib/libclangAST.a lib/libclangBasic.a lib/libclangDriver.a lib/libclangFrontend.a lib/libclangIndex.a lib/libclangLex.a lib/libclangSema.a lib/libclangSerialization.a lib/libclangTooling.a lib/libclangARCMigrate.a lib/libLLVMAArch64CodeGen.a lib/libLLVMAArch64AsmParser.a lib/libLLVMAArch64Desc.a lib/libLLVMAArch64Disassembler.a lib/libLLVMAArch64Info.a lib/libLLVMAArch64Utils.a lib/libLLVMAMDGPUCodeGen.a lib/libLLVMAMDGPUAsmParser.a lib/libLLVMAMDGPUDesc.a lib/libLLVMAMDGPUDisassembler.a lib/libLLVMAMDGPUInfo.a lib/libLLVMAMDGPUUtils.a lib/libLLVMARMCodeGen.a lib/libLLVMARMAsmParser.a lib/libLLVMARMDesc.a lib/libLLVMARMDisassembler.a lib/libLLVMARMInfo.a lib/libLLVMARMUtils.a lib/libLLVMAVRCodeGen.a lib/libLLVMAVRAsmParser.a lib/libLLVMAVRDesc.a lib/libLLVMAVRDisassembler.a lib/libLLVMAVRInfo.a lib/libLLVMBPFCodeGen.a lib/libLLVMBPFAsmParser.a lib/libLLVMBPFDesc.a lib/libLLVMBPFDisassembler.a lib/libLLVMBPFInfo.a lib/libLLVMHexagonCodeGen.a lib/libLLVMHexagonAsmParser.a lib/libLLVMHexagonDesc.a lib/libLLVMHexagonDisassembler.a lib/libLLVMHexagonInfo.a lib/libLLVMLanaiCodeGen.a lib/libLLVMLanaiAsmParser.a lib/libLLVMLanaiDesc.a lib/libLLVMLanaiDisassembler.a lib/libLLVMLanaiInfo.a lib/libLLVMMipsCodeGen.a lib/libLLVMMipsAsmParser.a lib/libLLVMMipsDesc.a lib/libLLVMMipsDisassembler.a lib/libLLVMMipsInfo.a lib/libLLVMMSP430CodeGen.a lib/libLLVMMSP430AsmParser.a lib/libLLVMMSP430Desc.a lib/libLLVMMSP430Disassembler.a lib/libLLVMMSP430Info.a lib/libLLVMNVPTXCodeGen.a lib/libLLVMNVPTXDesc.a lib/libLLVMNVPTXInfo.a lib/libLLVMPowerPCCodeGen.a lib/libLLVMPowerPCAsmParser.a lib/libLLVMPowerPCDesc.a lib/libLLVMPowerPCDisassembler.a lib/libLLVMPowerPCInfo.a lib/libLLVMRISCVCodeGen.a lib/libLLVMRISCVAsmParser.a lib/libLLVMRISCVDesc.a lib/libLLVMRISCVDisassembler.a lib/libLLVMRISCVInfo.a lib/libLLVMRISCVUtils.a lib/libLLVMSparcCodeGen.a lib/libLLVMSparcAsmParser.a lib/libLLVMSparcDesc.a lib/libLLVMSparcDisassembler.a lib/libLLVMSparcInfo.a lib/libLLVMSystemZCodeGen.a lib/libLLVMSystemZAsmParser.a lib/libLLVMSystemZDesc.a lib/libLLVMSystemZDisassembler.a lib/libLLVMSystemZInfo.a lib/libLLVMWebAssemblyCodeGen.a lib/libLLVMWebAssemblyAsmParser.a lib/libLLVMWebAssemblyDesc.a lib/libLLVMWebAssemblyDisassembler.a lib/libLLVMWebAssemblyInfo.a lib/libLLVMX86CodeGen.a lib/libLLVMX86AsmParser.a lib/libLLVMX86Desc.a lib/libLLVMX86Disassembler.a lib/libLLVMX86Info.a lib/libLLVMXCoreCodeGen.a lib/libLLVMXCoreDesc.a lib/libLLVMXCoreDisassembler.a lib/libLLVMXCoreInfo.a lib/libLLVMCore.a lib/libLLVMSupport.a lib/libclangFormat.a lib/libclangToolingInclusions.a lib/libclangToolingCore.a lib/libclangFrontend.a lib/libclangDriver.a lib/libLLVMOption.a lib/libclangParse.a lib/libclangSerialization.a lib/libclangSema.a lib/libclangEdit.a lib/libclangRewrite.a lib/libclangAnalysis.a lib/libclangASTMatchers.a lib/libclangAST.a lib/libclangLex.a lib/libclangBasic.a lib/libLLVMAArch64Desc.a lib/libLLVMAArch64Info.a lib/libLLVMAArch64Utils.a lib/libLLVMMIRParser.a lib/libLLVMAMDGPUDesc.a lib/libLLVMAMDGPUInfo.a lib/libLLVMAMDGPUUtils.a lib/libLLVMARMDesc.a lib/libLLVMARMInfo.a lib/libLLVMARMUtils.a lib/libLLVMHexagonDesc.a lib/libLLVMHexagonInfo.a lib/libLLVMLanaiDesc.a lib/libLLVMLanaiInfo.a lib/libLLVMipo.a lib/libLLVMFrontendOpenMP.a lib/libLLVMVectorize.a lib/libLLVMIRReader.a lib/libLLVMAsmParser.a lib/libLLVMInstrumentation.a lib/libLLVMLinker.a lib/libLLVMSystemZDesc.a lib/libLLVMSystemZInfo.a lib/libLLVMWebAssemblyDesc.a lib/libLLVMWebAssemblyInfo.a lib/libLLVMCFGuard.a lib/libLLVMGlobalISel.a lib/libLLVMAsmPrinter.a lib/libLLVMDebugInfoDWARF.a lib/libLLVMSelectionDAG.a lib/libLLVMCodeGen.a lib/libLLVMScalarOpts.a lib/libLLVMAggressiveInstCombine.a lib/libLLVMInstCombine.a lib/libLLVMBitWriter.a lib/libLLVMTarget.a lib/libLLVMTransformUtils.a lib/libLLVMAnalysis.a lib/libLLVMProfileData.a lib/libLLVMObject.a lib/libLLVMBitReader.a lib/libLLVMCore.a lib/libLLVMRemarks.a lib/libLLVMBitstreamReader.a lib/libLLVMMCParser.a lib/libLLVMTextAPI.a lib/libLLVMMCDisassembler.a lib/libLLVMMC.a lib/libLLVMBinaryFormat.a lib/libLLVMDebugInfoCodeView.a lib/libLLVMDebugInfoMSF.a lib/libLLVMSupport.a -lz -lcurses -lm lib/libLLVMDemangle.a && : Undefined symbols for architecture x86_64: "clang::ento::PackageInfo::dumpToStream(llvm::raw_ostream&) const", referenced from: clang::ento::PackageInfo::dump() const in ARCMigrate.cpp.o clang::ento::PackageInfo::dump() const in CIndex.cpp.o clang::ento::PackageInfo::dump() const in CIndexCXX.cpp.o clang::ento::PackageInfo::dump() const in CIndexCodeCompletion.cpp.o clang::ento::PackageInfo::dump() const in CIndexDiagnostic.cpp.o clang::ento::PackageInfo::dump() const in CIndexHigh.cpp.o clang::ento::PackageInfo::dump() const in CIndexInclusionStack.cpp.o ... "clang::ento::CmdLineOption::dumpToStream(llvm::raw_ostream&) const", referenced from: clang::ento::CmdLineOption::dump() const in ARCMigrate.cpp.o clang::ento::CmdLineOption::dump() const in CIndex.cpp.o clang::ento::CmdLineOption::dump() const in CIndexCXX.cpp.o clang::ento::CmdLineOption::dump() const in CIndexCodeCompletion.cpp.o clang::ento::CmdLineOption::dump() const in CIndexDiagnostic.cpp.o clang::ento::CmdLineOption::dump() const in CIndexHigh.cpp.o clang::ento::CmdLineOption::dump() const in CIndexInclusionStack.cpp.o ... "clang::ento::CheckerInfo::dumpToStream(llvm::raw_ostream&) const", referenced from: clang::ento::CheckerInfo::dump() const in ARCMigrate.cpp.o clang::ento::CheckerInfo::dump() const in CIndex.cpp.o clang::ento::CheckerInfo::dump() const in CIndexCXX.cpp.o clang::ento::CheckerInfo::dump() const in CIndexCodeCompletion.cpp.o clang::ento::CheckerInfo::dump() const in CIndexDiagnostic.cpp.o clang::ento::CheckerInfo::dump() const in CIndexHigh.cpp.o clang::ento::CheckerInfo::dump() const in CIndexInclusionStack.cpp.o ... ld: symbol(s) not found for architecture x86_64 clang-11: error: linker command failed with exit code 1 (use -v to see invocation) [11/1265] : && /Users/buildslave/jenkins/workspace/lldb-cmake/host-compiler/bin/clang++ -Wdocumentation -fPIC -fvisibility-inlines-hidden -Werror=date-time -Werror=unguarded-availability-new -fmodules -fmodules-cache-path=/Users/buildslave/jenkins/workspace/lldb-cmake/lldb-build/module.cache -fcxx-modules -Xclang -fmodules-local-submodule-visibility -Wall -Wextra -Wno-unused-parameter -Wwrite-strings -Wcast-qual -Wmissing-field-initializers -pedantic -Wno-long-long -Wimplicit-fallthrough -Wcovered-switch-default -Wno-noexcept-type -Wnon-virtual-dtor -Wdelete-non-virtual-dtor -Wstring-conversion -fdiagnostics-color -O3 -isysroot /Applications/Xcode.app/Contents/Developer/Platforms/MacOSX.platform/Developer/SDKs/MacOSX10.15.sdk -Wl,-search_paths_first -Wl,-headerpad_max_install_names -rdynamic tools/lld/tools/lld/CMakeFiles/lld.dir/lld.cpp.o -o bin/lld -Wl,-rpath,@loader_path/../lib lib/libLLVMSupport.a lib/liblldCommon.a lib/liblldCOFF.a lib/liblldDriver.a lib/liblldELF.a lib/liblldMachO2.a lib/liblldMinGW.a lib/liblldWasm.a lib/liblldMachO.a lib/liblldReaderWriter.a lib/liblldYAML.a lib/liblldCore.a lib/liblldCOFF.a lib/libLLVMDebugInfoPDB.a lib/libLLVMLibDriver.a lib/libLLVMWindowsManifest.a /usr/lib/libxml2.dylib lib/liblldCommon.a lib/libLLVMOption.a lib/libLLVMAArch64CodeGen.a lib/libLLVMAArch64AsmParser.a lib/libLLVMAArch64Disassembler.a lib/libLLVMAArch64Desc.a lib/libLLVMAArch64Info.a lib/libLLVMAArch64Utils.a lib/libLLVMAMDGPUCodeGen.a lib/libLLVMMIRParser.a lib/libLLVMAMDGPUAsmParser.a lib/libLLVMAMDGPUDisassembler.a lib/libLLVMAMDGPUDesc.a lib/libLLVMAMDGPUInfo.a lib/libLLVMAMDGPUUtils.a lib/libLLVMARMCodeGen.a lib/libLLVMARMAsmParser.a lib/libLLVMARMDisassembler.a lib/libLLVMARMDesc.a lib/libLLVMARMInfo.a lib/libLLVMARMUtils.a lib/libLLVMAVRCodeGen.a lib/libLLVMAVRAsmParser.a lib/libLLVMAVRDesc.a lib/libLLVMAVRDisassembler.a lib/libLLVMAVRInfo.a lib/libLLVMBPFCodeGen.a lib/libLLVMBPFAsmParser.a lib/libLLVMBPFDesc.a lib/libLLVMBPFDisassembler.a lib/libLLVMBPFInfo.a lib/libLLVMHexagonCodeGen.a lib/libLLVMHexagonAsmParser.a lib/libLLVMHexagonDisassembler.a lib/libLLVMHexagonDesc.a lib/libLLVMHexagonInfo.a lib/libLLVMLanaiCodeGen.a lib/libLLVMLanaiAsmParser.a lib/libLLVMLanaiDisassembler.a lib/libLLVMLanaiDesc.a lib/libLLVMLanaiInfo.a lib/libLLVMMipsCodeGen.a lib/libLLVMMipsAsmParser.a lib/libLLVMMipsDesc.a lib/libLLVMMipsDisassembler.a lib/libLLVMMipsInfo.a lib/libLLVMMSP430CodeGen.a lib/libLLVMMSP430AsmParser.a lib/libLLVMMSP430Desc.a lib/libLLVMMSP430Disassembler.a lib/libLLVMMSP430Info.a lib/libLLVMNVPTXCodeGen.a lib/libLLVMNVPTXDesc.a lib/libLLVMNVPTXInfo.a lib/libLLVMPowerPCCodeGen.a lib/libLLVMPowerPCAsmParser.a lib/libLLVMPowerPCDesc.a lib/libLLVMPowerPCDisassembler.a lib/libLLVMPowerPCInfo.a lib/libLLVMRISCVCodeGen.a lib/libLLVMRISCVAsmParser.a lib/libLLVMRISCVDesc.a lib/libLLVMRISCVDisassembler.a lib/libLLVMRISCVInfo.a lib/libLLVMRISCVUtils.a lib/libLLVMSparcCodeGen.a lib/libLLVMSparcAsmParser.a lib/libLLVMSparcDesc.a lib/libLLVMSparcDisassembler.a lib/libLLVMSparcInfo.a lib/libLLVMSystemZCodeGen.a lib/libLLVMSystemZAsmParser.a lib/libLLVMSystemZDisassembler.a lib/libLLVMSystemZDesc.a lib/libLLVMSystemZInfo.a lib/libLLVMWebAssemblyCodeGen.a lib/libLLVMWebAssemblyAsmParser.a lib/libLLVMWebAssemblyDisassembler.a lib/libLLVMWebAssemblyDesc.a lib/libLLVMWebAssemblyInfo.a lib/libLLVMX86CodeGen.a lib/libLLVMCFGuard.a lib/libLLVMGlobalISel.a lib/libLLVMX86AsmParser.a lib/libLLVMX86Desc.a lib/libLLVMX86Disassembler.a lib/libLLVMX86Info.a lib/libLLVMXCoreCodeGen.a lib/libLLVMAsmPrinter.a lib/libLLVMDebugInfoDWARF.a lib/libLLVMSelectionDAG.a lib/libLLVMXCoreDesc.a lib/libLLVMXCoreDisassembler.a lib/libLLVMMCDisassembler.a lib/libLLVMXCoreInfo.a lib/libLLVMLTO.a lib/libLLVMCodeGen.a lib/libLLVMExtensions.a lib/libLLVMObjCARCOpts.a lib/libLLVMPasses.a lib/libLLVMTarget.a lib/libLLVMCoroutines.a lib/libLLVMipo.a lib/libLLVMBitWriter.a lib/libLLVMScalarOpts.a lib/libLLVMVectorize.a lib/libLLVMAggressiveInstCombine.a lib/libLLVMInstCombine.a lib/libLLVMLinker.a lib/libLLVMFrontendOpenMP.a lib/libLLVMIRReader.a lib/libLLVMAsmParser.a lib/libLLVMInstrumentation.a lib/libLLVMTransformUtils.a lib/libLLVMAnalysis.a lib/libLLVMObject.a lib/libLLVMTextAPI.a lib/libLLVMBitReader.a lib/libLLVMMCParser.a lib/libLLVMMC.a lib/libLLVMDebugInfoCodeView.a lib/libLLVMDebugInfoMSF.a lib/libLLVMProfileData.a lib/libLLVMCore.a lib/libLLVMBinaryFormat.a lib/libLLVMRemarks.a lib/libLLVMBitstreamReader.a lib/libLLVMSupport.a -lz -lcurses -lm lib/libLLVMDemangle.a && cd /Users/buildslave/jenkins/workspace/lldb-cmake/lldb-build/tools/lld/tools/lld && /usr/local/Cellar/cmake/3.17.2/bin/cmake -E create_symlink lld /Users/buildslave/jenkins/workspace/lldb-cmake/lldb-build/./bin/lld-link && cd /Users/buildslave/jenkins/workspace/lldb-cmake/lldb-build/tools/lld/tools/lld && /usr/local/Cellar/cmake/3.17.2/bin/cmake -E create_symlink lld /Users/buildslave/jenkins/workspace/lldb-cmake/lldb-build/./bin/ld.lld && cd /Users/buildslave/jenkins/workspace/lldb-cmake/lldb-build/tools/lld/tools/lld && /usr/local/Cellar/cmake/3.17.2/bin/cmake -E create_symlink lld /Users/buildslave/jenkins/workspace/lldb-cmake/lldb-build/./bin/ld64.lld && cd /Users/buildslave/jenkins/workspace/lldb-cmake/lldb-build/tools/lld/tools/lld && /usr/local/Cellar/cmake/3.17.2/bin/cmake -E create_symlink lld /Users/buildslave/jenkins/workspace/lldb-cmake/lldb-build/./bin/wasm-ld [12/1265] /Users/buildslave/jenkins/workspace/lldb-cmake/host-compiler/bin/clang++ -DGTEST_HAS_RTTI=0 -DHAVE_ROUND -DLLDB_CONFIGURATION_RELEASE -DLLDB_USE_OS_LOG -D_DEBUG -D__STDC_CONSTANT_MACROS -D__STDC_FORMAT_MACROS -D__STDC_LIMIT_MACROS -Itools/lldb/utils/TableGen -I/Users/buildslave/jenkins/workspace/lldb-cmake/llvm-project/lldb/utils/TableGen -I/Users/buildslave/jenkins/workspace/lldb-cmake/llvm-project/lldb/include -Itools/lldb/include -I/Applications/Xcode.app/Contents/Developer/Platforms/MacOSX.platform/Developer/SDKs/MacOSX10.15.sdk/usr/include/libxml2 -Iinclude -I/Users/buildslave/jenkins/workspace/lldb-cmake/llvm-project/llvm/include -I/usr/local/Cellar/python/3.7.1/Frameworks/Python.framework/Versions/3.7/include/python3.7m -I/Users/buildslave/jenkins/workspace/lldb-cmake/llvm-project/llvm/../clang/include -Itools/lldb/../clang/include -I/usr/local/include -Wdocumentation -fPIC -fvisibility-inlines-hidden -Werror=date-time -Werror=unguarded-availability-new -fmodules -fmodules-cache-path=/Users/buildslave/jenkins/workspace/lldb-cmake/lldb-build/module.cache -fcxx-modules -Xclang -fmodules-local-submodule-visibility -Wall -Wextra -Wno-unused-parameter -Wwrite-strings -Wcast-qual -Wmissing-field-initializers -pedantic -Wno-long-long -Wimplicit-fallthrough -Wcovered-switch-default -Wno-noexcept-type -Wnon-virtual-dtor -Wdelete-non-virtual-dtor -Wstring-conversion -fdiagnostics-color -Wno-deprecated-declarations -Wno-unknown-pragmas -Wno-strict-aliasing -Wno-deprecated-register -Wno-vla-extension -O3 -isysroot /Applications/Xcode.app/Contents/Developer/Platforms/MacOSX.platform/Developer/SDKs/MacOSX10.15.sdk -fno-exceptions -fno-rtti -UNDEBUG -std=c++14 -MD -MT tools/lldb/utils/TableGen/CMakeFiles/lldb-tblgen.dir/LLDBTableGenUtils.cpp.o -MF tools/lldb/utils/TableGen/CMakeFiles/lldb-tblgen.dir/LLDBTableGenUtils.cpp.o.d -o tools/lldb/utils/TableGen/CMakeFiles/lldb-tblgen.dir/LLDBTableGenUtils.cpp.o -c /Users/buildslave/jenkins/workspace/lldb-cmake/llvm-project/lldb/utils/TableGen/LLDBTableGenUtils.cpp While building module 'LLVM_Utils' imported from /Users/buildslave/jenkins/workspace/lldb-cmake/llvm-project/lldb/utils/TableGen/LLDBTableGenUtils.h:12: In file included from <module-includes>:8: /Users/buildslave/jenkins/workspace/lldb-cmake/llvm-project/llvm/include/llvm/ADT/Bitfields.h:215:8: warning: '\param' command used in a comment that is not attached to a function declaration [-Wdocumentation] /// \param T, the type of the field once in unpacked form, ^~~~~ /Users/buildslave/jenkins/workspace/lldb-cmake/llvm-project/llvm/include/llvm/ADT/Bitfields.h:216:8: warning: '\param' command used in a comment that is not attached to a function declaration [-Wdocumentation] /// \param Offset, the position of the first bit, ^~~~~ /Users/buildslave/jenkins/workspace/lldb-cmake/llvm-project/llvm/include/llvm/ADT/Bitfields.h:217:8: warning: '\param' command used in a comment that is not attached to a function declaration [-Wdocumentation] /// \param Size, the size of the field, ^~~~~ /Users/buildslave/jenkins/workspace/lldb-cmake/llvm-project/llvm/include/llvm/ADT/Bitfields.h:218:8: warning: '\param' command used in a comment that is not attached to a function declaration [-Wdocumentation] /// \param MaxValue, For enums the maximum enum allowed. ^~~~~ 4 warnings generated. ninja: build stopped: subcommand failed. Command failed: Command '['/usr/local/bin/ninja', '-v']' returned non-zero exit status 1 Command: ['/usr/local/bin/ninja', '-v'] [Pipeline] } [Pipeline] // timeout [Pipeline] } [Pipeline] // stage [Pipeline] stage [Pipeline] { (Test) Stage "Test" skipped due to earlier failure(s) [Pipeline] } [Pipeline] // stage [Pipeline] stage [Pipeline] { (Declarative: Post Actions) [Pipeline] scanForIssues [Clang (LLVM based)] Sleeping for 5 seconds due to JENKINS-32191... [Clang (LLVM based)] Parsing console log (workspace: '/Users/buildslave/jenkins/workspace/lldb-cmake') [Clang (LLVM based)] Successfully parsed console log [Clang (LLVM based)] -> found 4 issues (skipped 0 duplicates) [Clang (LLVM based)] Post processing issues on 'green-dragon-10' with source code encoding 'UTF-8' [Clang (LLVM based)] Creating SCM blamer to obtain author and commit information for affected files [Clang (LLVM based)] Creating SCM miner to obtain statistics for affected repository files [Clang (LLVM based)] Resolving file names for all issues in source directory '/Users/buildslave/jenkins/workspace/lldb-cmake' [Clang (LLVM based)] -> resolved paths in source directory (1 found, 0 not found) [Clang (LLVM based)] Resolving module names from module definitions (build.xml, pom.xml, or Manifest.mf files) [Clang (LLVM based)] -> resolved module names for 4 issues [Clang (LLVM based)] Resolving package names (or namespaces) by parsing the affected files [Clang (LLVM based)] -> resolved package names of 1 affected files [Clang (LLVM based)] No filter has been set, publishing all 4 issues [Clang (LLVM based)] Creating fingerprints for all affected code blocks to track issues over different builds [Clang (LLVM based)] -> created fingerprints for 4 issues (skipped 0 issues) [Clang (LLVM based)] Copying affected files to Jenkins' build folder '/Users/Shared/Jenkins/Home/jobs/lldb-cmake/builds/22253/files-with-issues' [Clang (LLVM based)] -> 1 copied, 0 not in workspace, 0 not-found, 0 with I/O error [Pipeline] junit Recording test results Test reports were found but none of them are new. Did leafNodes run? For example, /Users/buildslave/jenkins/workspace/lldb-cmake/test/results.xml is 1 day 12 hr old

Hide Details

Error when executing always post condition: hudson.AbortException: Test reports were found but none of them are new. Did leafNodes run? For example, /Users/buildslave/jenkins/workspace/lldb-cmake/test/results.xml is 1 day 12 hr old

Hide Details

at hudson.tasks.junit.TestResult.parse(TestResult.java:222) at hudson.tasks.junit.TestResult.parse(TestResult.java:178) at hudson.tasks.junit.TestResult.<init>(TestResult.java:143) at hudson.tasks.junit.JUnitParser$ParseResultCallable.invoke(JUnitParser.java:146) at hudson.tasks.junit.JUnitParser$ParseResultCallable.invoke(JUnitParser.java:118) at hudson.FilePath$FileCallableWrapper.call(FilePath.java:3069) at hudson.remoting.UserRequest.perform(UserRequest.java:211) at hudson.remoting.UserRequest.perform(UserRequest.java:54) at hudson.remoting.Request$2.run(Request.java:369) at hudson.remoting.InterceptingExecutorService$1.call(InterceptingExecutorService.java:72) at java.util.concurrent.FutureTask.run(Unknown Source) at java.util.concurrent.ThreadPoolExecutor.runWorker(Unknown Source) at java.util.concurrent.ThreadPoolExecutor$Worker.run(Unknown Source) at java.lang.Thread.run(Unknown Source) Suppressed: hudson.remoting.Channel$CallSiteStackTrace: Remote call to green-dragon-10 at hudson.remoting.Channel.attachCallSiteStackTrace(Channel.java:1788) at hudson.remoting.UserRequest$ExceptionResponse.retrieve(UserRequest.java:356) at hudson.remoting.Channel.call(Channel.java:998) at hudson.FilePath.act(FilePath.java:1069) at hudson.FilePath.act(FilePath.java:1058) at hudson.tasks.junit.JUnitParser.parseResult(JUnitParser.java:114) at hudson.tasks.junit.JUnitResultArchiver.parse(JUnitResultArchiver.java:137) at hudson.tasks.junit.JUnitResultArchiver.parseAndAttach(JUnitResultArchiver.java:167) at hudson.tasks.junit.pipeline.JUnitResultsStepExecution.run(JUnitResultsStepExecution.java:52) at hudson.tasks.junit.pipeline.JUnitResultsStepExecution.run(JUnitResultsStepExecution.java:25) at org.jenkinsci.plugins.workflow.steps.SynchronousNonBlockingStepExecution.lambda$start$0(SynchronousNonBlockingStepExecution.java:47) at java.util.concurrent.Executors$RunnableAdapter.call(Executors.java:511) at java.util.concurrent.FutureTask.run(FutureTask.java:266) at java.util.concurrent.ThreadPoolExecutor.runWorker(ThreadPoolExecutor.java:1149) at java.util.concurrent.ThreadPoolExecutor$Worker.run(ThreadPoolExecutor.java:624) at java.lang.Thread.run(Thread.java:748)

Hide Details

[Pipeline] } [Pipeline] // stage [Pipeline] } [Pipeline] // withEnv [Pipeline] } [Pipeline] // node [Pipeline] End of Pipeline ERROR: script returned exit code 1 Finished: FAILURE