FailedConsole Output

Skipping 590 KB.. Full Log
n = breakpoint 1.1
  thread #2: tid = 0x6e8c13, 0x00007fff79cb20ff libsystem_c.dylib`localeconv_l + 89
  thread #3: tid = 0x6e8c14, 0x00007fff79d6e872 libsystem_kernel.dylib`__psynch_mutexwait + 10
  thread #4: tid = 0x6e8c15, 0x00007fff79d6e872 libsystem_kernel.dylib`__psynch_mutexwait + 10

Hide Details

Hide Details

Expecting sub string: stopped Matched

Hide Details

Expecting sub string: stop reason = breakpoint Matched

Hide Details

runCmd: watchpoint set expression -w write -s 1 -- g_char_ptr + 7 output: Watchpoint created: Watchpoint 1: addr = 0x100400057 size = 1 state = enabled type = w new value: 0x0000000000000000

Hide Details

Hide Details

Expecting sub string: Watchpoint created Matched

Hide Details

Expecting sub string: size = 1 Matched

Hide Details

Expecting sub string: type = w Matched

Hide Details

runCmd: expr unsigned val = g_char_ptr[7]; val output: (unsigned int) $1 = 0

Hide Details

Hide Details

looking at: (unsigned int) $1 = 0

Hide Details

Expecting end string: = 0 Matched

Hide Details

runCmd: watchpoint list -v output: Number of supported hardware watchpoints: 4 Current watchpoints: Watchpoint 1: addr = 0x100400057 size = 1 state = enabled type = w new value: 0x0000000000000000 hw_index = -1 hit_count = 0 ignore_count = 0

Hide Details

Hide Details

Expecting sub string: hit_count = 0 Matched

Hide Details

runCmd: process continue output: Process 34894 resuming Process 34894 stopped * thread #3, stop reason = watchpoint 1 frame #0: 0x0000000100000d92 a.out`do_bad_thing_with_location(index=7, char_ptr="", new_val='c') at main.cpp:36:1 33 unsigned what = new_val; 34 printf("new value written to array(%p) and index(%u) = %u\n", char_ptr, index, what); 35 char_ptr[index] = new_val; -> 36 } ^ 37 38 uint32_t 39 access_pool (bool flag = false) thread #4, stop reason = watchpoint 1 frame #0: 0x0000000100000d92 a.out`do_bad_thing_with_location(index=7, char_ptr="", new_val='c') at main.cpp:36:1 33 unsigned what = new_val; 34 printf("new value written to array(%p) and index(%u) = %u\n", char_ptr, index, what); 35 char_ptr[index] = new_val; -> 36 } ^ 37 38 uint32_t 39 access_pool (bool flag = false)

Hide Details

Hide Details

Hide Details

runCmd: thread list output: Process 34894 stopped thread #1: tid = 0x6e8ab7, 0x00007fff79d6e36a libsystem_kernel.dylib`__ulock_wait + 10, queue = 'com.apple.main-thread' thread #2: tid = 0x6e8c13, 0x00007fff79d6faa6 libsystem_kernel.dylib`__write_nocancel + 10 * thread #3: tid = 0x6e8c14, 0x0000000100000d92 a.out`do_bad_thing_with_location(index=7, char_ptr="", new_val='c') at main.cpp:36:1, stop reason = watchpoint 1 thread #4: tid = 0x6e8c15, 0x0000000100000d92 a.out`do_bad_thing_with_location(index=7, char_ptr="", new_val='c') at main.cpp:36:1, stop reason = watchpoint 1

Hide Details

Hide Details

Expecting sub string: stopped Matched

Hide Details

Expecting sub string: stop reason = watchpoint Matched

Hide Details

Expecting sub string: do_bad_thing_with_location Matched

Hide Details

runCmd: thread list output: Process 34894 stopped thread #1: tid = 0x6e8ab7, 0x00007fff79d6e36a libsystem_kernel.dylib`__ulock_wait + 10, queue = 'com.apple.main-thread' thread #2: tid = 0x6e8c13, 0x00007fff79d6faa6 libsystem_kernel.dylib`__write_nocancel + 10 * thread #3: tid = 0x6e8c14, 0x0000000100000d92 a.out`do_bad_thing_with_location(index=7, char_ptr="", new_val='c') at main.cpp:36:1, stop reason = watchpoint 1 thread #4: tid = 0x6e8c15, 0x0000000100000d92 a.out`do_bad_thing_with_location(index=7, char_ptr="", new_val='c') at main.cpp:36:1, stop reason = watchpoint 1

Hide Details

Hide Details

runCmd: thread select 3 output:

Hide Details

runCmd: thread select 4 output:

Hide Details

runCmd: thread backtrace output: * thread #4, stop reason = watchpoint 1 * frame #0: 0x0000000100000d92 a.out`do_bad_thing_with_location(index=7, char_ptr="", new_val='c') at main.cpp:36:1 frame #1: 0x0000000100000e4e a.out`access_pool(flag=true) at main.cpp:53:9 frame #2: 0x0000000100000f35 a.out`thread_func(thread_index=2) at main.cpp:80:19 frame #3: 0x00000001000027c4 a.out`decltype(__f=0x00000001004002a8, __args=0x00000001004002b0)(unsigned int)>(fp)(std::__1::forward<long>(fp0))) std::__1::__invoke<void (*)(unsigned int), long>(void (*&&)(unsigned int), long&&) at type_traits:3539:1 frame #4: 0x000000010000270e a.out`void std::__1::__thread_execute<std::__1::unique_ptr<std::__1::__thread_struct, std::__1::default_delete<std::__1::__thread_struct> >, void (*)(unsigned int), long, 2ul>(__t=size=3, (null)=__tuple_indices<2> @ 0x000070000223feb8)(unsigned int), long>&, std::__1::__tuple_indices<2ul>) at thread:273:5 frame #5: 0x0000000100001f16 a.out`void* std::__1::__thread_proxy<std::__1::tuple<std::__1::unique_ptr<std::__1::__thread_struct, std::__1::default_delete<std::__1::__thread_struct> >, void (*)(unsigned int), long> >(__vp=0x00000001004002a0) at thread:284:5 frame #6: 0x00007fff79e2533d libsystem_pthread.dylib`_pthread_body + 126 frame #7: 0x00007fff79e282a7 libsystem_pthread.dylib`_pthread_start + 70 frame #8: 0x00007fff79e24425 libsystem_pthread.dylib`thread_start + 13

Hide Details

Hide Details

runCmd: expr unsigned val = g_char_ptr[7]; val output: (unsigned int) $2 = 99

Hide Details

Hide Details

looking at: (unsigned int) $2 = 99

Hide Details

Expecting end string: = 99 Matched

Hide Details

runCmd: watchpoint list -v output: Number of supported hardware watchpoints: 4 Current watchpoints: Watchpoint 1: addr = 0x100400057 size = 1 state = enabled type = w old value: 0x0000000000000063 new value: 0x0000000000000063 hw_index = 0 hit_count = 2 ignore_count = 0

Hide Details

Hide Details

Expecting sub string: hit_count = 2 Matched

Hide Details

runCmd: thread backtrace all output: thread #1, queue = 'com.apple.main-thread' frame #0: 0x00007fff79d6e36a libsystem_kernel.dylib`__ulock_wait + 10 frame #1: 0x00007fff79e2970b libsystem_pthread.dylib`_pthread_join + 356 frame #2: 0x00007fff77353978 libc++.1.dylib`std::__1::thread::join() + 24 frame #3: 0x000000010000127f a.out`main(argc=1, argv=0x00007ffeefbff5b0) at main.cpp:110:16 frame #4: 0x00007fff79c33085 libdyld.dylib`start + 1 thread #2 frame #0: 0x00007fff79d6faa6 libsystem_kernel.dylib`__write_nocancel + 10 frame #1: 0x00007fff79cc1920 libsystem_c.dylib`_swrite + 87 frame #2: 0x00007fff79cba4e3 libsystem_c.dylib`__sflush + 87 frame #3: 0x00007fff79cbcc0f libsystem_c.dylib`__sfvwrite + 798 frame #4: 0x00007fff79cc6a3a libsystem_c.dylib`__vfprintf + 16604 frame #5: 0x00007fff79ceb13b libsystem_c.dylib`__v2printf + 475 frame #6: 0x00007fff79cc2882 libsystem_c.dylib`vfprintf_l + 54 frame #7: 0x00007fff79cc099a libsystem_c.dylib`printf + 174 frame #8: 0x0000000100000d81 a.out`do_bad_thing_with_location(index=7, char_ptr="", new_val='c') at main.cpp:34:5 frame #9: 0x0000000100000e4e a.out`access_pool(flag=true) at main.cpp:53:9 frame #10: 0x0000000100000f35 a.out`thread_func(thread_index=0) at main.cpp:80:19 frame #11: 0x00000001000027c4 a.out`decltype(__f=0x00000001004001f8, __args=0x0000000100400200)(unsigned int)>(fp)(std::__1::forward<long>(fp0))) std::__1::__invoke<void (*)(unsigned int), long>(void (*&&)(unsigned int), long&&) at type_traits:3539:1 frame #12: 0x000000010000270e a.out`void std::__1::__thread_execute<std::__1::unique_ptr<std::__1::__thread_struct, std::__1::default_delete<std::__1::__thread_struct> >, void (*)(unsigned int), long, 2ul>(__t=size=3, (null)=__tuple_indices<2> @ 0x0000700002139eb8)(unsigned int), long>&, std::__1::__tuple_indices<2ul>) at thread:273:5 frame #13: 0x0000000100001f16 a.out`void* std::__1::__thread_proxy<std::__1::tuple<std::__1::unique_ptr<std::__1::__thread_struct, std::__1::default_delete<std::__1::__thread_struct> >, void (*)(unsigned int), long> >(__vp=0x00000001004001f0) at thread:284:5 frame #14: 0x00007fff79e2533d libsystem_pthread.dylib`_pthread_body + 126 frame #15: 0x00007fff79e282a7 libsystem_pthread.dylib`_pthread_start + 70 frame #16: 0x00007fff79e24425 libsystem_pthread.dylib`thread_start + 13 thread #3, stop reason = watchpoint 1 frame #0: 0x0000000100000d92 a.out`do_bad_thing_with_location(index=7, char_ptr="", new_val='c') at main.cpp:36:1 frame #1: 0x0000000100000e4e a.out`access_pool(flag=true) at main.cpp:53:9 frame #2: 0x0000000100000f35 a.out`thread_func(thread_index=1) at main.cpp:80:19 frame #3: 0x00000001000027c4 a.out`decltype(__f=0x0000000100400248, __args=0x0000000100400250)(unsigned int)>(fp)(std::__1::forward<long>(fp0))) std::__1::__invoke<void (*)(unsigned int), long>(void (*&&)(unsigned int), long&&) at type_traits:3539:1 frame #4: 0x000000010000270e a.out`void std::__1::__thread_execute<std::__1::unique_ptr<std::__1::__thread_struct, std::__1::default_delete<std::__1::__thread_struct> >, void (*)(unsigned int), long, 2ul>(__t=size=3, (null)=__tuple_indices<2> @ 0x00007000021bceb8)(unsigned int), long>&, std::__1::__tuple_indices<2ul>) at thread:273:5 frame #5: 0x0000000100001f16 a.out`void* std::__1::__thread_proxy<std::__1::tuple<std::__1::unique_ptr<std::__1::__thread_struct, std::__1::default_delete<std::__1::__thread_struct> >, void (*)(unsigned int), long> >(__vp=0x0000000100400240) at thread:284:5 frame #6: 0x00007fff79e2533d libsystem_pthread.dylib`_pthread_body + 126 frame #7: 0x00007fff79e282a7 libsystem_pthread.dylib`_pthread_start + 70 frame #8: 0x00007fff79e24425 libsystem_pthread.dylib`thread_start + 13 * thread #4, stop reason = watchpoint 1 * frame #0: 0x0000000100000d92 a.out`do_bad_thing_with_location(index=7, char_ptr="", new_val='c') at main.cpp:36:1 frame #1: 0x0000000100000e4e a.out`access_pool(flag=true) at main.cpp:53:9 frame #2: 0x0000000100000f35 a.out`thread_func(thread_index=2) at main.cpp:80:19 frame #3: 0x00000001000027c4 a.out`decltype(__f=0x00000001004002a8, __args=0x00000001004002b0)(unsigned int)>(fp)(std::__1::forward<long>(fp0))) std::__1::__invoke<void (*)(unsigned int), long>(void (*&&)(unsigned int), long&&) at type_traits:3539:1 frame #4: 0x000000010000270e a.out`void std::__1::__thread_execute<std::__1::unique_ptr<std::__1::__thread_struct, std::__1::default_delete<std::__1::__thread_struct> >, void (*)(unsigned int), long, 2ul>(__t=size=3, (null)=__tuple_indices<2> @ 0x000070000223feb8)(unsigned int), long>&, std::__1::__tuple_indices<2ul>) at thread:273:5 frame #5: 0x0000000100001f16 a.out`void* std::__1::__thread_proxy<std::__1::tuple<std::__1::unique_ptr<std::__1::__thread_struct, std::__1::default_delete<std::__1::__thread_struct> >, void (*)(unsigned int), long> >(__vp=0x00000001004002a0) at thread:284:5 frame #6: 0x00007fff79e2533d libsystem_pthread.dylib`_pthread_body + 126 frame #7: 0x00007fff79e282a7 libsystem_pthread.dylib`_pthread_start + 70 frame #8: 0x00007fff79e24425 libsystem_pthread.dylib`thread_start + 13

Hide Details

Hide Details

<bound method SBProcess.Kill of <lldb.SBProcess; proxy of <Swig Object of type 'lldb::SBProcess *' at 0x10e2730c0> >>: success

Hide Details

PASS: LLDB (/Users/buildslave/jenkins/workspace/lldb-cmake/lldb-build/bin/clang-10-x86_64) :: test_watchlocation_using_watchpoint_set_dwarf (TestWatchLocationWithWatchSet.WatchLocationUsingWatchpointSetTestCase) UNSUPPORTED: LLDB (/Users/buildslave/jenkins/workspace/lldb-cmake/lldb-build/bin/clang-10-x86_64) :: test_watchlocation_using_watchpoint_set_dwo (TestWatchLocationWithWatchSet.WatchLocationUsingWatchpointSetTestCase) (test case does not fall in any category of interest for this run) runCmd: settings set symbols.enable-external-lookup false output:

Hide Details

runCmd: settings set plugin.process.gdb-remote.packet-timeout 60 output:

Hide Details

runCmd: settings set symbols.clang-modules-cache-path "/Users/buildslave/jenkins/workspace/lldb-cmake/lldb-build/lldb-test-build.noindex/module-cache-lldb/lldb-api" output:

Hide Details

runCmd: settings set use-color false output:

Hide Details

runCmd: file /Users/buildslave/jenkins/workspace/lldb-cmake/lldb-build/lldb-test-build.noindex/commands/watchpoints/watchpoint_set_command/TestWatchLocationWithWatchSet.test_watchlocation_using_watchpoint_set_gmodules/a.out output: Current executable set to '/Users/buildslave/jenkins/workspace/lldb-cmake/lldb-build/lldb-test-build.noindex/commands/watchpoints/watchpoint_set_command/TestWatchLocationWithWatchSet.test_watchlocation_using_watchpoint_set_gmodules/a.out' (x86_64).

Hide Details

Hide Details

runCmd: breakpoint set -l 105 output: Breakpoint 1: where = a.out`main + 391 at main.cpp:105:5, address = 0x0000000100001207

Hide Details

Hide Details

Expecting pattern: ^Breakpoint (?P<bpno>[0-9]+): (?P<num_locations>[0-9]+) locations\.$ Not matched

Hide Details

Expecting pattern: ^Breakpoint (?P<bpno>[0-9]+): (?P<num_locations>no) locations \(pending\)\. Not matched

Hide Details

Expecting pattern: ^Breakpoint (?P<bpno>[0-9]+): where = (?P<module>.*)`(?P<symbol>[+\-]{0,1}[^+]+)( \+ (?P<offset>[0-9]+)){0,1}( \[inlined\] (?P<inline_symbol>.*)){0,1} at (?P<file>[^:]+):(?P<line_no>[0-9]+)(?P<column>(:[0-9]+)?), address = (?P<address>0x[0-9a-fA-F]+)$ Matched

Hide Details

runCmd: run output: Process 48938 stopped * thread #1, queue = 'com.apple.main-thread', stop reason = breakpoint 1.1 frame #0: 0x0000000100001207 a.out`main(argc=1, argv=0x00007ffeefbff5a0) at main.cpp:105:5 102 int c; 103 } MyAggregateDataType; 104 -> 105 printf ("Before turning all three threads loose...\n"); // Set break point at this line. ^ 106 barrier_wait(); 107 108 // Join all of our threads

Hide Details

Process 48938 launched: '/Users/buildslave/jenkins/workspace/lldb-cmake/lldb-build/lldb-test-build.noindex/commands/watchpoints/watchpoint_set_command/TestWatchLocationWithWatchSet.test_watchlocation_using_watchpoint_set_gmodules/a.out' (x86_64)

Hide Details

Hide Details

runCmd: thread list output: Process 48938 stopped * thread #1: tid = 0x6eee48, 0x0000000100001207 a.out`main(argc=1, argv=0x00007ffeefbff5a0) at main.cpp:105:5, queue = 'com.apple.main-thread', stop reason = breakpoint 1.1 thread #2: tid = 0x6ef01d, 0x00007fff79cb1d52 libsystem_c.dylib`__get_current_monetary_locale + 1 thread #3: tid = 0x6ef01e, 0x00007fff79d6e872 libsystem_kernel.dylib`__psynch_mutexwait + 10 thread #4: tid = 0x6ef01f, 0x00007fff79d6e872 libsystem_kernel.dylib`__psynch_mutexwait + 10

Hide Details

Hide Details

Expecting sub string: stopped Matched

Hide Details

Expecting sub string: stop reason = breakpoint Matched

Hide Details

runCmd: watchpoint set expression -w write -s 1 -- g_char_ptr + 7 runCmd failed! error: expression evaluation of address to watch failed expression evaluated: g_char_ptr + 7

Hide Details

Hide Details

FAIL: LLDB (/Users/buildslave/jenkins/workspace/lldb-cmake/lldb-build/bin/clang-10-x86_64) :: test_watchlocation_using_watchpoint_set_gmodules (TestWatchLocationWithWatchSet.WatchLocationUsingWatchpointSetTestCase) <bound method SBProcess.Kill of <lldb.SBProcess; proxy of <Swig Object of type 'lldb::SBProcess *' at 0x10e3b1840> >>: success

Hide Details

Restore dir to: /Users/buildslave/jenkins/workspace/lldb-cmake/lldb-build/tools/lldb/test ====================================================================== FAIL: test_watchlocation_using_watchpoint_set_gmodules (TestWatchLocationWithWatchSet.WatchLocationUsingWatchpointSetTestCase) Test watching a location with 'watchpoint set expression -w write -s size' option. ---------------------------------------------------------------------- Traceback (most recent call last): File "/Users/buildslave/jenkins/workspace/lldb-cmake/llvm-project/lldb/packages/Python/lldbsuite/test/lldbtest.py", line 1732, in test_method return attrvalue(self) File "/Users/buildslave/jenkins/workspace/lldb-cmake/llvm-project/lldb/packages/Python/lldbsuite/test/decorators.py", line 110, in wrapper func(*args, **kwargs) File "/Users/buildslave/jenkins/workspace/lldb-cmake/llvm-project/lldb/packages/Python/lldbsuite/test/commands/watchpoints/watchpoint_set_command/TestWatchLocationWithWatchSet.py", line 67, in test_watchlocation_using_watchpoint_set 'type = w']) File "/Users/buildslave/jenkins/workspace/lldb-cmake/llvm-project/lldb/packages/Python/lldbsuite/test/lldbtest.py", line 2302, in expect inHistory=inHistory) File "/Users/buildslave/jenkins/workspace/lldb-cmake/llvm-project/lldb/packages/Python/lldbsuite/test/lldbtest.py", line 2061, in runCmd msg if (msg) else CMD_MSG(cmd)) AssertionError: False is not True : Watchpoint created successfully Error output: error: expression evaluation of address to watch failed expression evaluated: g_char_ptr + 7

Hide Details

Config=x86_64-/Users/buildslave/jenkins/workspace/lldb-cmake/lldb-build/bin/clang-10 ---------------------------------------------------------------------- Ran 4 tests in 66.312s

Hide Details

RESULT: FAILED (2 passes, 1 failures, 0 errors, 1 skipped, 0 expected failures, 0 unexpected successes)

Hide Details

******************** PASS: lldb-api :: lang/cpp/class_types/TestClassTypes.py (524 of 1860) PASS: lldb-api :: functionalities/breakpoint/inlined_breakpoints/TestInlinedBreakpoints.py (525 of 1860) PASS: lldb-unit :: UnwindAssembly/x86/./UnwindAssemblyx86Tests/Testx86AssemblyInspectionEngine.TestSimple64bitFrameFunction (526 of 1860) PASS: lldb-shell :: Reproducer/Modules/TestModuleCXX.test (527 of 1860) PASS: lldb-unit :: Utility/./UtilityTests/ArgsTest.BareSingleQuote (528 of 1860) PASS: lldb-api :: types/TestCharTypeExpr.py (529 of 1860) PASS: lldb-unit :: Symbol/./SymbolTests/TestClangASTContext.TestGetBasicTypeFromEnum (530 of 1860) PASS: lldb-shell :: Watchpoint/SetErrorCases.test (531 of 1860) PASS: lldb-api :: lang/cpp/overloaded-functions/TestOverloadedFunctions.py (532 of 1860) PASS: lldb-api :: lang/objc/variadic_methods/TestVariadicMethods.py (533 of 1860) PASS: lldb-shell :: Register/x86-64-ymm-read.test (534 of 1860) PASS: lldb-unit :: Utility/./UtilityTests/AnsiTerminal.Empty (535 of 1860) UNSUPPORTED: lldb-shell :: SymbolFile/PDB/typedefs.test (536 of 1860) PASS: lldb-shell :: Driver/TestCore.test (537 of 1860) UNSUPPORTED: lldb-api :: functionalities/darwin_log/source/debug/TestDarwinLogSourceDebug.py (538 of 1860) PASS: lldb-unit :: Utility/./UtilityTests/StreamTest.PutCStringWithStringRef (539 of 1860) PASS: lldb-api :: functionalities/breakpoint/breakpoint_by_line_and_column/TestBreakpointByLineAndColumn.py (540 of 1860) PASS: lldb-unit :: Utility/./UtilityTests/SerializationRountripTest.SerializeDeserializePodReferences (541 of 1860) PASS: lldb-api :: functionalities/modern-type-lookup/basic/TestBasicModernTypeLookup.py (542 of 1860) PASS: lldb-api :: lang/cpp/limit-debug-info/TestWithLimitDebugInfo.py (543 of 1860) UNSUPPORTED: lldb-api :: functionalities/breakpoint/hardware_breakpoints/hardware_breakpoint_on_multiple_threads/TestHWBreakMultiThread.py (544 of 1860) PASS: lldb-shell :: ObjectFile/PECOFF/basic-info-arm64.yaml (545 of 1860) PASS: lldb-unit :: Utility/./UtilityTests/ProcessInstanceInfoMatch.Name (546 of 1860) PASS: lldb-api :: functionalities/data-formatter/data-formatter-stl/libcxx/queue/TestDataFormatterLibcxxQueue.py (547 of 1860) PASS: lldb-api :: macosx/duplicate-archive-members/TestDuplicateMembers.py (548 of 1860) PASS: lldb-api :: functionalities/breakpoint/breakpoint_language/TestBreakpointLanguage.py (549 of 1860) PASS: lldb-unit :: ObjectFile/ELF/./ObjectFileELFTests/ObjectFileELFTest.GetSymtab_NoSymEntryPointArmThumbAddressClass (550 of 1860) UNSUPPORTED: lldb-shell :: SymbolFile/target-symbols-add-unwind.test (551 of 1860) PASS: lldb-shell :: SymbolFile/DWARF/debug_ranges-missing-section.s (552 of 1860) PASS: lldb-unit :: Utility/./UtilityTests/DataExtractorTest.GetCStrAtEnd (553 of 1860) PASS: lldb-unit :: Symbol/./SymbolTests/LineEntryTest.GetSameLineContiguousAddressRangeNestedInline (554 of 1860) PASS: lldb-shell :: SymbolFile/DWARF/dwarf5-index-is-used.cpp (555 of 1860) PASS: lldb-unit :: SymbolFile/DWARF/./SymbolFileDWARFTests/SymbolFileDWARFTests.TestAbilitiesForDWARF (556 of 1860) UNSUPPORTED: lldb-api :: functionalities/data-formatter/data-formatter-stl/libstdcpp/tuple/TestDataFormatterStdTuple.py (557 of 1860) PASS: lldb-api :: lang/cpp/call-function/TestCallCPPFunction.py (558 of 1860) PASS: lldb-unit :: Utility/./UtilityTests/ScalarTest.ExtractBitfield (559 of 1860) UNSUPPORTED: lldb-shell :: ObjectFile/ELF/minidebuginfo-set-and-hit-breakpoint.test (560 of 1860) PASS: lldb-shell :: Settings/TestFrameFormatColor.test (561 of 1860) PASS: lldb-unit :: Utility/./UtilityTests/StringExtractorTest.GetHexU8_InvalidHex_NoEof (562 of 1860) PASS: lldb-api :: commands/watchpoints/watchpoint_size/TestWatchpointSizes.py (563 of 1860) UNSUPPORTED: lldb-shell :: Register/x86-64-xmm16-write.test (564 of 1860) PASS: lldb-api :: tools/lldb-vscode/breakpoint/TestVSCode_setBreakpoints.py (565 of 1860) PASS: lldb-unit :: Symbol/./SymbolTests/DWARFCallFrameInfoTest.Basic_dwarf3 (566 of 1860) PASS: lldb-api :: lang/objcxx/cxx-bridged-po/TestObjCXXBridgedPO.py (567 of 1860) PASS: lldb-shell :: BuildScript/script-args.test (568 of 1860) PASS: lldb-unit :: Symbol/./SymbolTests/TestClangASTContext.TestRecordHasFields (569 of 1860) PASS: lldb-unit :: Language/CPlusPlus/./LanguageCPlusPlusTests/CPlusPlusLanguage.ExtractContextAndIdentifier (570 of 1860) PASS: lldb-api :: commands/frame/language/TestGuessLanguage.py (571 of 1860) PASS: lldb-api :: functionalities/breakpoint/dummy_target_breakpoints/TestBreakpointsWithNoTargets.py (572 of 1860) PASS: lldb-shell :: SymbolFile/DWARF/dwarf5-atomic.s (573 of 1860) PASS: lldb-unit :: Utility/./UtilityTests/OptionsWithRawTest.EmptyInput (574 of 1860) PASS: lldb-unit :: Process/minidump/./LLDBMinidumpTests/MinidumpParserTest.GetArchitectureWindows (575 of 1860) PASS: lldb-api :: lang/objc/foundation/TestObjCMethodsNSError.py (576 of 1860) PASS: lldb-unit :: Utility/./UtilityTests/RangeTest.Copy (577 of 1860) PASS: lldb-api :: functionalities/float-display/TestFloatDisplay.py (578 of 1860) PASS: lldb-api :: functionalities/postmortem/elf-core/thread_crash/TestLinuxCoreThreads.py (579 of 1860) PASS: lldb-shell :: Commands/command-script-import.test (580 of 1860) PASS: lldb-unit :: Process/minidump/./LLDBMinidumpTests/MinidumpParserTest.InvalidMinidump (581 of 1860) PASS: lldb-unit :: Expression/./ExpressionTests/DiagnosticManagerTest.HasFixits (582 of 1860) PASS: lldb-unit :: ScriptInterpreter/Python/./ScriptInterpreterPythonTests/PythonDataObjectsTest.TestPythonDictionaryManipulation (583 of 1860) PASS: lldb-api :: functionalities/data-formatter/data-formatter-synthtype/TestDataFormatterSynthType.py (584 of 1860) PASS: lldb-api :: functionalities/asan/TestReportData.py (585 of 1860) UNSUPPORTED: lldb-shell :: BuildScript/toolchain-clang-cl.test (586 of 1860) PASS: lldb-api :: functionalities/thread/concurrent_events/TestConcurrentSignalNWatchNBreak.py (587 of 1860) PASS: lldb-unit :: Interpreter/./InterpreterTests/OptionArgParserTest.toChar (588 of 1860) PASS: lldb-unit :: Utility/./UtilityTests/DataExtractorTest.GetCStrAtNullOffset (589 of 1860) PASS: lldb-unit :: Host/./HostTests/MainLoopTest.TerminatesImmediately (590 of 1860) PASS: lldb-shell :: Commands/command-regex-delete.test (591 of 1860) PASS: lldb-unit :: Expression/./ExpressionTests/DiagnosticManagerTest.FixedExpression (592 of 1860) PASS: lldb-api :: lang/cpp/namespace/TestNamespaceLookup.py (593 of 1860) PASS: lldb-unit :: Process/minidump/./LLDBMinidumpTests/MinidumpParserTest.GetMemoryRegionInfoFromMemoryList (594 of 1860) PASS: lldb-shell :: ObjectFile/MachO/subsections.yaml (595 of 1860) PASS: lldb-unit :: Utility/./UtilityTests/BinaryStreamTest.PutSLEB128NineBytes (596 of 1860) PASS: lldb-unit :: Utility/./UtilityTests/StreamTest.PutHex16ByteOrderBig (597 of 1860) PASS: lldb-api :: functionalities/data-formatter/var-in-aggregate-misuse/TestVarInAggregateMisuse.py (598 of 1860) PASS: lldb-unit :: Symbol/./SymbolTests/DWARFCallFrameInfoTest.Basic_eh (599 of 1860) PASS: lldb-api :: commands/frame/diagnose/virtual-method-call/TestDiagnoseDereferenceVirtualMethodCall.py (600 of 1860) PASS: lldb-unit :: Utility/./UtilityTests/StreamTest.PutCharWhitespace (601 of 1860) PASS: lldb-unit :: Utility/./UtilityTests/StringListTest.GetSize (602 of 1860) PASS: lldb-unit :: Utility/./UtilityTests/ConstStringTest.UpdateMangledCounterpart (603 of 1860) PASS: lldb-api :: functionalities/ubsan/user-expression/TestUbsanUserExpression.py (604 of 1860) UNSUPPORTED: lldb-api :: linux/sepdebugsymlink/TestTargetSymbolsSepDebugSymlink.py (605 of 1860) PASS: lldb-api :: functionalities/data-formatter/synthupdate/TestSyntheticFilterRecompute.py (606 of 1860) PASS: lldb-api :: types/TestIntegerType.py (607 of 1860) PASS: lldb-unit :: Process/gdb-remote/./ProcessGdbRemoteTests/GDBRemoteClientBaseTest.SendContinueAndWait (608 of 1860) PASS: lldb-unit :: Utility/./UtilityTests/StringLexerTest.PutBack (609 of 1860) PASS: lldb-shell :: Minidump/Windows/find-module.test (610 of 1860) PASS: lldb-api :: commands/expression/call-overridden-method/TestCallOverriddenMethod.py (611 of 1860) PASS: lldb-shell :: ObjectFile/ELF/netbsd-core-amd64.test (612 of 1860) PASS: lldb-shell :: Reproducer/TestFileRepro.test (613 of 1860) UNSUPPORTED: lldb-api :: lang/objc/objc-dynamic-value/TestObjCDynamicValue.py (614 of 1860) PASS: lldb-shell :: SymbolFile/NativePDB/disassembly.cpp (615 of 1860) PASS: lldb-api :: functionalities/data-formatter/data-formatter-stl/libcxx/list/TestDataFormatterLibcxxList.py (616 of 1860) PASS: lldb-api :: functionalities/data-formatter/data-formatter-categories/TestDataFormatterCategories.py (617 of 1860) PASS: lldb-api :: commands/expression/class_template_specialization_empty_pack/TestClassTemplateSpecializationParametersHandling.py (618 of 1860) PASS: lldb-unit :: Host/./HostTests/ProcessLaunchInfoTest.Constructor (619 of 1860) PASS: lldb-unit :: Utility/./UtilityTests/StringListTest.SplitIntoLines (620 of 1860) PASS: lldb-unit :: Symbol/./SymbolTests/SymbolsTest.LocateExecutableSymbolFileForUnknownExecutableAndMissingSymbolFile (621 of 1860) PASS: lldb-unit :: Utility/./UtilityTests/StringExtractorTest.GetHexU8_Exact (622 of 1860) PASS: lldb-api :: functionalities/thread/concurrent_events/TestConcurrentWatchpointDelayWatchpointOneBreakpoint.py (623 of 1860) PASS: lldb-unit :: Utility/./UtilityTests/StringListTest.InsertStringAtIndexOutOfBounds (624 of 1860) PASS: lldb-api :: functionalities/unwind/sigtramp/TestSigtrampUnwind.py (625 of 1860) UNSUPPORTED: lldb-api :: arm/breakpoint-thumb-codesection/TestBreakpointThumbCodesection.py (626 of 1860) PASS: lldb-unit :: Core/./LLDBCoreTests/RichManglingContextTest.SwitchProvider (627 of 1860) PASS: lldb-unit :: ScriptInterpreter/Python/./ScriptInterpreterPythonTests/PythonDataObjectsTest.TestPythonByteArray (628 of 1860) PASS: lldb-api :: functionalities/breakpoint/global_constructor/TestBreakpointInGlobalConstructor.py (629 of 1860) PASS: lldb-unit :: Utility/./UtilityTests/VMRange.Clear (630 of 1860) PASS: lldb-api :: functionalities/data-formatter/data-formatter-objc/TestDataFormatterObjCNSURL.py (631 of 1860) PASS: lldb-api :: functionalities/memory/find/TestMemoryFind.py (632 of 1860) PASS: lldb-unit :: Host/./HostTests/MainLoopTest.UnmonitoredSignal (633 of 1860) PASS: lldb-api :: commands/expression/context-object-objc/TestContextObjectObjc.py (634 of 1860) PASS: lldb-unit :: ScriptInterpreter/Python/./ScriptInterpreterPythonTests/PythonDataObjectsTest.TestBorrowedReferences (635 of 1860) PASS: lldb-unit :: SymbolFile/NativePDB/./SymbolFileNativePDBTests/PDBFPOProgramToDWARFExpressionTests.UnsupportedRASearch (636 of 1860) PASS: lldb-unit :: Utility/./UtilityTests/RangeTest.EqualInvalid (637 of 1860) PASS: lldb-api :: functionalities/thread/concurrent_events/TestConcurrentManyBreakpoints.py (638 of 1860) PASS: lldb-unit :: Utility/./UtilityTests/FileSpecTest.IsRelative (639 of 1860) PASS: lldb-unit :: Utility/./UtilityTests/StreamTeeTest.AppendStream (640 of 1860) PASS: lldb-unit :: Disassembler/./DisassemblerTests/TestArm64Disassembly.TestArmv81Instruction (641 of 1860) PASS: lldb-api :: lang/objc/objc-struct-return/TestObjCStructReturn.py (642 of 1860) PASS: lldb-unit :: ObjectFile/PECOFF/./ObjectFilePECOFFTests/PECallFrameInfoTest.Chained_eh (643 of 1860) PASS: lldb-api :: api/multiple-targets/TestMultipleTargets.py (644 of 1860) PASS: lldb-api :: functionalities/data-formatter/ostypeformatting/TestFormattersOsType.py (645 of 1860) PASS: lldb-api :: macosx/nslog/TestDarwinNSLogOutput.py (646 of 1860) PASS: lldb-shell :: Breakpoint/debug_addrx.test (647 of 1860) PASS: lldb-unit :: Utility/./UtilityTests/UriParserTest.BracketedHostnamePort (648 of 1860) PASS: lldb-api :: functionalities/data-formatter/data-formatter-objc/TestDataFormatterObjCNSContainer.py (649 of 1860) PASS: lldb-unit :: Process/gdb-remote/./ProcessGdbRemoteTests/GDBRemoteCommunicationClientTest.SendGetTraceConfigPacket (650 of 1860) PASS: lldb-shell :: Breakpoint/debug_rnglist_offset_pair.test (651 of 1860) PASS: lldb-api :: commands/apropos/basic/TestApropos.py (652 of 1860) PASS: lldb-api :: commands/expression/persistent_types/TestNestedPersistentTypes.py (653 of 1860) PASS: lldb-unit :: Utility/./UtilityTests/LogTest.Unregister (654 of 1860) PASS: lldb-unit :: Utility/./UtilityTests/NameMatchesTest.EndsWith (655 of 1860) PASS: lldb-unit :: Utility/./UtilityTests/StreamTest.PutMaxHex64ByteOrderBig (656 of 1860) UNSUPPORTED: lldb-api :: commands/register/register/intel_xtended_registers/mpx_bound_violation/TestBoundViolation.py (657 of 1860) PASS: lldb-unit :: Utility/./UtilityTests/StreamTest.AddressPrefix (658 of 1860) PASS: lldb-shell :: SymbolFile/Breakpad/unwind-via-stack-win.test (659 of 1860) PASS: lldb-unit :: ScriptInterpreter/Python/./ScriptInterpreterPythonTests/PythonDataObjectsTest.TestRun (660 of 1860) PASS: lldb-unit :: SymbolFile/NativePDB/./SymbolFileNativePDBTests/PDBFPOProgramToDWARFExpressionTests.DependencyChain (661 of 1860) PASS: lldb-shell :: SymbolFile/DWARF/anon_class_w_and_wo_export_symbols.ll (662 of 1860) PASS: lldb-api :: functionalities/thread/concurrent_events/TestConcurrentTwoWatchpointThreads.py (663 of 1860) PASS: lldb-unit :: Utility/./UtilityTests/UUIDTest.Validity (664 of 1860) PASS: lldb-unit :: SymbolFile/NativePDB/./SymbolFileNativePDBTests/PDBFPOProgramToDWARFExpressionTests.InvalidOpUnary (665 of 1860) PASS: lldb-unit :: Utility/./UtilityTests/OptionsWithRawTest.ArgsButNoDelimiter (666 of 1860) PASS: lldb-unit :: Utility/./UtilityTests/StringListTest.GetMaxStringLengthIncreasingSize (667 of 1860) UNSUPPORTED: lldb-api :: tools/lldb-server/TestGdbRemoteModuleInfo.py (668 of 1860) PASS: lldb-api :: lang/objc/objc-dyn-sbtype/TestObjCDynamicSBType.py (669 of 1860) PASS: lldb-unit :: Host/./HostTests/ConnectionFileDescriptorTest.TCPGetURIv4 (670 of 1860) UNSUPPORTED: lldb-api :: functionalities/data-formatter/data-formatter-stl/libstdcpp/map/TestDataFormatterStdMap.py (671 of 1860) PASS: lldb-api :: commands/expression/import-std-module/weak_ptr/TestWeakPtr.py (672 of 1860) PASS: lldb-api :: commands/frame/diagnose/bad-reference/TestBadReference.py (673 of 1860) PASS: lldb-api :: lang/cpp/virtual-overload/TestVirtualOverload.py (674 of 1860) PASS: lldb-api :: functionalities/return-value/TestReturnValue.py (675 of 1860) PASS: lldb-unit :: Utility/./UtilityTests/VMRange.CollectionContains (676 of 1860) PASS: lldb-unit :: Signals/./SignalsTests/UnixSignalsTest.VersionChange (677 of 1860) PASS: lldb-api :: functionalities/data-formatter/pyobjsynthprovider/TestPyObjSynthProvider.py (678 of 1860) PASS: lldb-api :: functionalities/data-formatter/data-formatter-stl/libcxx/vbool/TestDataFormatterLibcxxVBool.py (679 of 1860) PASS: lldb-api :: functionalities/data-formatter/data-formatter-stl/libcxx/variant/TestDataFormatterLibcxxVariant.py (680 of 1860) PASS: lldb-unit :: Utility/./UtilityTests/StringListTest.PopBack (681 of 1860) PASS: lldb-api :: commands/expression/import-std-module/shared_ptr/TestSharedPtr.py (682 of 1860) PASS: lldb-unit :: ScriptInterpreter/Python/./ScriptInterpreterPythonTests/PythonDataObjectsTest.TestPythonBoolean (683 of 1860) PASS: lldb-shell :: Commands/command-backtrace.test (684 of 1860) PASS: lldb-unit :: Utility/./UtilityTests/GeneratorTest.Create (685 of 1860) PASS: lldb-unit :: UnwindAssembly/x86/./UnwindAssemblyx86Tests/Testx86AssemblyInspectionEngine.Test64bitFramelessBigStackFrame (686 of 1860) PASS: lldb-api :: commands/expression/import-std-module/stack/TestStack.py (687 of 1860) PASS: lldb-api :: lang/cpp/dynamic-value-same-basename/TestDynamicValueSameBase.py (688 of 1860) PASS: lldb-api :: commands/expression/import-std-module/vector-bool/TestBoolVector.py (689 of 1860) PASS: lldb-unit :: Utility/./UtilityTests/BroadcasterTest.BroadcastEvent (690 of 1860) PASS: lldb-unit :: ScriptInterpreter/Python/./ScriptInterpreterPythonTests/PythonDataObjectsTest.TestInstanceNameResolutionNoDot (691 of 1860) PASS: lldb-api :: lang/cpp/unicode-literals/TestUnicodeLiterals.py (692 of 1860) PASS: lldb-unit :: ObjectFile/Breakpad/./ObjectFileBreakpadTests/StackCFIRecord.parse (693 of 1860) PASS: lldb-unit :: Utility/./UtilityTests/ConstStringTest.CompareConstString (694 of 1860) PASS: lldb-unit :: UnwindAssembly/x86/./UnwindAssemblyx86Tests/Testx86AssemblyInspectionEngine.TestPopEDI (695 of 1860) PASS: lldb-unit :: Utility/./UtilityTests/StringExtractorTest.GetHexBytes_Partial (696 of 1860) PASS: lldb-shell :: ObjectFile/PECOFF/export-dllfunc.yaml (697 of 1860) PASS: lldb-api :: api/check_public_api_headers/TestPublicAPIHeaders.py (698 of 1860) PASS: lldb-unit :: Utility/./UtilityTests/RecordReplayTest.InstrumentedFoo (699 of 1860) PASS: lldb-unit :: Utility/./UtilityTests/FileSpecTest.FileAndDirectoryComponents (700 of 1860) PASS: lldb-api :: tools/lldb-server/TestAppleSimulatorOSType.py (701 of 1860) PASS: lldb-shell :: ObjectFile/ELF/short-build-id.yaml (702 of 1860) PASS: lldb-unit :: Process/gdb-remote/./ProcessGdbRemoteTests/GDBRemoteClientBaseTest.SendPacketAndReceiveResponseWithOutputSupport (703 of 1860) PASS: lldb-unit :: UnwindAssembly/ARM64/./Arm64InstEmulationTests/TestArm64InstEmulation.TestSimpleDarwinFunction (704 of 1860) PASS: lldb-shell :: ObjectFile/ELF/base-address.yaml (705 of 1860) PASS: lldb-shell :: Driver/TestTarget.test (706 of 1860) PASS: lldb-api :: python_api/disassemble-raw-data/TestDisassembleRawData.py (707 of 1860) PASS: lldb-unit :: ScriptInterpreter/Python/./ScriptInterpreterPythonTests/PythonDataObjectsTest.TestPythonBytes (708 of 1860) UNSUPPORTED: lldb-shell :: SymbolFile/PDB/compilands.test (709 of 1860) PASS: lldb-shell :: SymbolFile/DWARF/dwarf5-debug_line.s (710 of 1860) PASS: lldb-api :: functionalities/target-new-solib-notifications/TestModuleLoadedNotifys.py (711 of 1860) PASS: lldb-unit :: Symbol/./SymbolTests/TestClangASTContext.TemplateArguments (712 of 1860) PASS: lldb-unit :: ObjectFile/PECOFF/./ObjectFilePECOFFTests/PECallFrameInfoTest.Frame_reg_eh (713 of 1860) PASS: lldb-unit :: Utility/./UtilityTests/ScalarTest.APIntConstructor (714 of 1860) PASS: lldb-unit :: Process/gdb-remote/./ProcessGdbRemoteTests/GDBRemoteClientBaseTest.SendContinueDelegateStructuredDataReceipt (715 of 1860) PASS: lldb-api :: python_api/watchpoint/condition/TestWatchpointConditionAPI.py (716 of 1860) PASS: lldb-shell :: SymbolFile/DWARF/find-basic-variable.cpp (717 of 1860) PASS: lldb-unit :: Utility/./UtilityTests/ScalarTest.GetValue (718 of 1860) PASS: lldb-unit :: Utility/./UtilityTests/BinaryStreamTest.PutULEB128Zero (719 of 1860) PASS: lldb-api :: lang/objc/objc-super/TestObjCSuper.py (720 of 1860) PASS: lldb-unit :: Utility/./UtilityTests/UriParserTest.MinimalPath (721 of 1860) PASS: lldb-api :: commands/expression/rdar44436068/Test128BitsInteger.py (722 of 1860) PASS: lldb-unit :: Expression/./ExpressionTests/CppModuleConfigurationTest.Xcode (723 of 1860) PASS: lldb-api :: commands/expression/import-std-module/shared_ptr-dbg-info-content/TestSharedPtrDbgInfoContent.py (724 of 1860) PASS: lldb-unit :: Utility/./UtilityTests/FileSpecTest.Match (725 of 1860) PASS: lldb-shell :: SymbolFile/DWARF/debug-names-compressed.cpp (726 of 1860) PASS: lldb-unit :: Symbol/./SymbolTests/PostfixExpression.ParseFPOProgram (727 of 1860) PASS: lldb-unit :: Process/minidump/./LLDBMinidumpTests/MinidumpParserTest.GetMemoryRegionInfo (728 of 1860) UNSUPPORTED: lldb-api :: functionalities/darwin_log/filter/exact_match/message/TestDarwinLogFilterMatchMessage.py (729 of 1860) PASS: lldb-unit :: Host/./HostTests/SocketTest.TCPGetConnectURI (730 of 1860) PASS: lldb-api :: functionalities/abbreviation/TestAbbreviations.py (731 of 1860) PASS: lldb-unit :: Utility/./UtilityTests/ConstStringTest.CompareStringRef (732 of 1860) PASS: lldb-api :: functionalities/breakpoint/require_hw_breakpoints/TestRequireHWBreakpoints.py (733 of 1860) PASS: lldb-api :: python_api/process/read-mem-cstring/TestReadMemCString.py (734 of 1860) PASS: lldb-unit :: SymbolFile/DWARF/./SymbolFileDWARFTests/SymbolFileDWARFTests.TestAbbrevValidAttrNullForm (735 of 1860) PASS: lldb-api :: commands/command/invalid-args/TestInvalidArgsCommand.py (736 of 1860) PASS: lldb-api :: tools/lldb-server/TestGdbRemoteExitCode.py (737 of 1860) XFAIL: lldb-shell :: Register/x86-mm-xmm-read.test (738 of 1860) PASS: lldb-api :: commands/process/launch-with-shellexpand/TestLaunchWithShellExpand.py (739 of 1860) PASS: lldb-api :: commands/expression/import-std-module/no-std-module/TestMissingStdModule.py (740 of 1860) PASS: lldb-shell :: SymbolFile/DWARF/apple-index-is-used.cpp (741 of 1860) PASS: lldb-unit :: Expression/./ExpressionTests/CppModuleConfigurationTest.LinuxLocalLibCpp (742 of 1860) PASS: lldb-unit :: Utility/./UtilityTests/ArchSpecTest.TestParseMachCPUDashSubtypeTripleSimple (743 of 1860) PASS: lldb-shell :: ObjectFile/ELF/section-overlap.yaml (744 of 1860) PASS: lldb-shell :: Expr/TestIRMemoryMap.test (745 of 1860) PASS: lldb-shell :: SymbolFile/NativePDB/tag-types.cpp (746 of 1860) PASS: lldb-unit :: ScriptInterpreter/Python/./ScriptInterpreterPythonTests/PythonDataObjectsTest.TestPythonIntegerToStructuredInteger (747 of 1860) PASS: lldb-unit :: UnwindAssembly/x86/./UnwindAssemblyx86Tests/Testx86AssemblyInspectionEngine.TestPushR12 (748 of 1860) PASS: lldb-unit :: Utility/./UtilityTests/ArgsTest.TestInsertArg (749 of 1860) PASS: lldb-api :: lang/c/shared_lib_stripped_symbols/TestSharedLibStrippedSymbols.py (750 of 1860) PASS: lldb-api :: tools/lldb-server/TestGdbRemoteRegisterState.py (751 of 1860) PASS: lldb-api :: commands/expression/formatters/TestFormatters.py (752 of 1860) PASS: lldb-unit :: Platform/./LLDBPlatformTests/PlatformDarwinTest.TestParseVersionBuildDir (753 of 1860) PASS: lldb-unit :: Utility/./UtilityTests/StreamTest.PutCharNull (754 of 1860) PASS: lldb-api :: lang/cpp/member-and-local-vars-with-same-name/TestMembersAndLocalsWithSameName.py (755 of 1860) PASS: lldb-unit :: Utility/./UtilityTests/RangeTest.Constructor (756 of 1860) UNSUPPORTED: lldb-shell :: SymbolFile/NativePDB/ast-functions-msvc.cpp (757 of 1860) PASS: lldb-api :: lang/objc/self/TestObjCSelf.py (758 of 1860) PASS: lldb-unit :: Utility/./UtilityTests/ConstStringTest.format_provider (759 of 1860) PASS: lldb-api :: commands/frame/diagnose/inheritance/TestDiagnoseInheritance.py (760 of 1860) PASS: lldb-unit :: Utility/./UtilityTests/StringExtractorTest.GetU64BigEndian (761 of 1860) PASS: lldb-unit :: Utility/./UtilityTests/UUIDTest.StringConverion (762 of 1860) PASS: lldb-unit :: Host/./HostTests/SocketTest.DomainListenConnectAccept (763 of 1860) PASS: lldb-unit :: ScriptInterpreter/Python/./ScriptInterpreterPythonTests/PythonDataObjectsTest.TestPythonTupleValues (764 of 1860) PASS: lldb-api :: types/TestLongTypesExpr.py (765 of 1860) PASS: lldb-api :: lang/cpp/template-function/TestTemplateFunctions.py (766 of 1860) PASS: lldb-unit :: Utility/./UtilityTests/StreamTest.PutHex8 (767 of 1860) PASS: lldb-shell :: Driver/TestSingleQuote.test (768 of 1860) PASS: lldb-unit :: UnwindAssembly/x86/./UnwindAssemblyx86Tests/Testx86AssemblyInspectionEngine.TestPushR15 (769 of 1860) PASS: lldb-unit :: Symbol/./SymbolTests/DWARFCallFrameInfoTest.Basic_dwarf4 (770 of 1860) PASS: lldb-shell :: SymbolFile/DWARF/DW_OP_piece-struct.s (771 of 1860) PASS: lldb-api :: python_api/class_members/TestSBTypeClassMembers.py (772 of 1860) PASS: lldb-api :: functionalities/memory/cache/TestMemoryCache.py (773 of 1860) PASS: lldb-api :: python_api/lldbutil/frame/TestFrameUtils.py (774 of 1860) UNSUPPORTED: lldb-api :: benchmarks/startup/TestStartupDelays.py (775 of 1860) PASS: lldb-api :: lang/cpp/char8_t/TestCxxChar8_t.py (776 of 1860) PASS: lldb-api :: commands/expression/ir-interpreter-phi-nodes/TestIRInterpreterPHINodes.py (777 of 1860) PASS: lldb-shell :: SymbolFile/NativePDB/function-types-builtins.cpp (778 of 1860) PASS: lldb-api :: commands/gui/basic/TestGuiBasic.py (779 of 1860) PASS: lldb-shell :: Expr/TestMultilineExpr.test (780 of 1860) PASS: lldb-unit :: UnwindAssembly/x86/./UnwindAssemblyx86Tests/Testx86AssemblyInspectionEngine.Testi386IgnoredRegisters (781 of 1860) PASS: lldb-api :: functionalities/breakpoint/cpp/TestCPPBreakpointLocations.py (782 of 1860) PASS: lldb-api :: commands/expression/import-std-module/conflicts/TestStdModuleWithConflicts.py (783 of 1860) PASS: lldb-unit :: Utility/./UtilityTests/FileSpecTest.PrependPathComponent (784 of 1860) UNSUPPORTED: lldb-api :: functionalities/data-formatter/data-formatter-stl/libstdcpp/iterator/TestDataFormatterStdIterator.py (785 of 1860) PASS: lldb-api :: commands/settings/quoting/TestQuoting.py (786 of 1860) PASS: lldb-api :: commands/version/TestVersion.py (787 of 1860) PASS: lldb-unit :: UnwindAssembly/x86/./UnwindAssemblyx86Tests/Testx86AssemblyInspectionEngine.TestPushRBX (788 of 1860) PASS: lldb-api :: functionalities/data-formatter/data-formatter-objc/nsindexpath/TestDataFormatterNSIndexPath.py (789 of 1860) PASS: lldb-shell :: ObjectFile/ELF/netbsd-exec-8.99.30-amd64.yaml (790 of 1860) UNSUPPORTED: lldb-api :: functionalities/data-formatter/data-formatter-stl/libstdcpp/vbool/TestDataFormatterStdVBool.py (791 of 1860) UNSUPPORTED: lldb-api :: commands/watchpoints/multi_watchpoint_slots/TestWatchpointMultipleSlots.py (792 of 1860) PASS: lldb-api :: commands/breakpoint/command/list/TestBreakpointCommandList.py (793 of 1860) UNSUPPORTED: lldb-api :: tools/lldb-server/libraries-svr4/TestGdbRemoteLibrariesSvr4Support.py (794 of 1860) PASS: lldb-unit :: Utility/./UtilityTests/EventTest.DumpEventDataBytes (795 of 1860) PASS: lldb-unit :: Utility/./UtilityTests/LogChannelTest.Enable (796 of 1860) PASS: lldb-api :: functionalities/multidebugger_commands/TestMultipleDebuggersCommands.py (797 of 1860) PASS: lldb-api :: functionalities/thread/concurrent_events/TestConcurrentNWatchNBreak.py (798 of 1860) PASS: lldb-unit :: Utility/./UtilityTests/DataExtractorTest.GetMaxU64 (799 of 1860) PASS: lldb-api :: commands/command/script/TestCommandScript.py (800 of 1860) PASS: lldb-api :: types/TestFloatTypesExpr.py (801 of 1860) PASS: lldb-unit :: Expression/./ExpressionTests/ClangHostTest.MacOSX (802 of 1860) PASS: lldb-unit :: ScriptInterpreter/Python/./ScriptInterpreterPythonTests/PythonDataObjectsTest.TestExtractingUInt64ThroughStructuredData (803 of 1860) UNSUPPORTED: lldb-api :: commands/register/register/intel_xtended_registers/TestMPXRegisters.py (804 of 1860) UNSUPPORTED: lldb-api :: commands/expression/call-restarts/TestCallThatRestarts.py (805 of 1860) PASS: lldb-unit :: Process/gdb-remote/./ProcessGdbRemoteTests/GDBRemoteCommunicationClientTest.SendStartTracePacket (806 of 1860) PASS: lldb-api :: functionalities/target_var/TestTargetVar.py (807 of 1860) PASS: lldb-shell :: SymbolFile/DWARF/dir-separator-no-comp-dir-relative-name.s (808 of 1860) PASS: lldb-api :: lang/objc/modules-inline-functions/TestModulesInlineFunctions.py (809 of 1860) PASS: lldb-api :: commands/add-dsym/uuid/TestAddDsymCommand.py (810 of 1860) PASS: lldb-unit :: ObjectFile/Breakpad/./ObjectFileBreakpadTests/StackWinRecord.parse (811 of 1860) PASS: lldb-unit :: Utility/./UtilityTests/AnsiTerminal.KnownPrefix (812 of 1860) PASS: lldb-unit :: Utility/./UtilityTests/CompletionRequest.DuplicateFilteringWithComments (813 of 1860) PASS: lldb-unit :: Utility/./UtilityTests/LogChannelTest.EnableOptions (814 of 1860) PASS: lldb-unit :: Utility/./UtilityTests/DataExtractorTest.GetCStrEmpty (815 of 1860) PASS: lldb-shell :: ObjectFile/PECOFF/sections.yaml (816 of 1860) PASS: lldb-unit :: Utility/./UtilityTests/VASprintfTest.NoBufferResize (817 of 1860) PASS: lldb-api :: lang/cpp/class_static/TestStaticVariables.py (818 of 1860) PASS: lldb-api :: python_api/value/TestValueAPI.py (819 of 1860) PASS: lldb-api :: lang/cpp/nested-class-other-compilation-unit/TestNestedClassWithParentInAnotherCU.py (820 of 1860) PASS: lldb-unit :: Utility/./UtilityTests/FileSpecTest.RemoveLastPathComponent (821 of 1860) PASS: lldb-unit :: Utility/./UtilityTests/StringListTest.GetMaxStringLengthDecreasingSize (822 of 1860) PASS: lldb-api :: macosx/queues/TestQueues.py (823 of 1860) PASS: lldb-unit :: Process/gdb-remote/./ProcessGdbRemoteTests/GDBRemoteCommunicationClientTest.GetModulesInfo (824 of 1860) PASS: lldb-api :: functionalities/load_using_paths/TestLoadUsingPaths.py (825 of 1860) PASS: lldb-api :: functionalities/gdb_remote_client/TestArmRegisterDefinition.py (826 of 1860) PASS: lldb-api :: commands/expression/pr35310/TestExprsBug35310.py (827 of 1860) PASS: lldb-api :: commands/frame/select/TestFrameSelect.py (828 of 1860) PASS: lldb-shell :: Reproducer/Functionalities/TestStepping.test (829 of 1860) PASS: lldb-unit :: Language/Highlighting/./HighlighterTests/HighlighterTest.ClangPPDirectives (830 of 1860) PASS: lldb-unit :: Core/./LLDBCoreTests/RichManglingContextTest.IPDRealloc (831 of 1860) PASS: lldb-unit :: Symbol/./SymbolTests/TestClangASTContext.TestUnifyAccessSpecifiers (832 of 1860) PASS: lldb-unit :: UnwindAssembly/x86/./UnwindAssemblyx86Tests/Testx86AssemblyInspectionEngine.TestPopEBP (833 of 1860) PASS: lldb-api :: commands/reproducer/invalid-args/TestInvalidArgsReproducer.py (834 of 1860) PASS: lldb-api :: lang/objc/objc-runtime-ivars/TestRuntimeIvars.py (835 of 1860) PASS: lldb-unit :: Utility/./UtilityTests/StreamTest.ShiftOperatorPtr (836 of 1860) PASS: lldb-shell :: Minidump/disassemble-no-module.yaml (837 of 1860) PASS: lldb-shell :: Host/TestCustomShell.test (838 of 1860) PASS: lldb-unit :: Core/./LLDBCoreTests/MangledTest.EmptyForInvalidName (839 of 1860) PASS: lldb-unit :: Utility/./UtilityTests/RangeTest.DoesAdjoinOrIntersect (840 of 1860) PASS: lldb-api :: lang/objc/objc-foundation-dictionary-empty/TestNSDictionary0.py (841 of 1860) PASS: lldb-unit :: Utility/./UtilityTests/StringListTest.ForRange (842 of 1860) PASS: lldb-shell :: SymbolFile/DWARF/find-variable-file.cpp (843 of 1860) PASS: lldb-api :: tools/lldb-vscode/breakpoint/TestVSCode_setExceptionBreakpoints.py (844 of 1860) PASS: lldb-unit :: Language/Highlighting/./HighlighterTests/HighlighterTest.ClangCursorOutOfBounds (845 of 1860) PASS: lldb-unit :: Utility/./UtilityTests/UriParserTest.BadPort (846 of 1860) PASS: lldb-unit :: UnwindAssembly/x86/./UnwindAssemblyx86Tests/Testx86AssemblyInspectionEngine.Test64bitFramelessSmallStackFrame (847 of 1860) PASS: lldb-api :: source-manager/TestSourceManager.py (848 of 1860) PASS: lldb-api :: python_api/findvalue_duplist/TestSBFrameFindValue.py (849 of 1860) PASS: lldb-unit :: Target/./TargetTests/ModuleCacheTest.GetAndPut (850 of 1860) PASS: lldb-api :: python_api/objc_type/TestObjCType.py (851 of 1860) PASS: lldb-shell :: SymbolFile/DWARF/debug-types-missing-signature.test (852 of 1860) PASS: lldb-unit :: Utility/./UtilityTests/StringListTest.Clear (853 of 1860) UNSUPPORTED: lldb-shell :: SymbolFile/PDB/variables-locations.test (854 of 1860) PASS: lldb-unit :: UnwindAssembly/ARM64/./Arm64InstEmulationTests/TestArm64InstEmulation.TestRegisterDoubleSpills (855 of 1860) PASS: lldb-unit :: Utility/./UtilityTests/RangeTest.NotEqual (856 of 1860) PASS: lldb-api :: tools/lldb-vscode/breakpoint/TestVSCode_setFunctionBreakpoints.py (857 of 1860) PASS: lldb-unit :: debugserver/./debugserverTests/RNBSocket.AnyListen (858 of 1860) PASS: lldb-shell :: ObjectFile/ELF/gnu-debuglink.yaml (859 of 1860) PASS: lldb-unit :: UnwindAssembly/ARM64/./Arm64InstEmulationTests/TestArm64InstEmulation.TestFramelessThreeEpilogueFunction (860 of 1860) PASS: lldb-unit :: ScriptInterpreter/Python/./ScriptInterpreterPythonTests/PythonDataObjectsTest.TestPythonTupleToStructuredList (861 of 1860) PASS: lldb-api :: lang/c/bitfields/TestBitfields.py (862 of 1860) PASS: lldb-api :: sample_test/TestSampleTest.py (863 of 1860) PASS: lldb-unit :: Utility/./UtilityTests/ArgsTest.ReplaceArgumentAtIndexFarOutOfRange (864 of 1860) PASS: lldb-unit :: Process/minidump/./LLDBMinidumpTests/MinidumpParserTest.GetMemoryRegionInfoFromMemory64List (865 of 1860) PASS: lldb-unit :: Process/gdb-remote/./ProcessGdbRemoteTests/GDBRemoteClientBaseTest.SendContinueDelegateInterface (866 of 1860) PASS: lldb-unit :: Expression/./ExpressionTests/DWARFExpression.DW_OP_convert (867 of 1860) PASS: lldb-shell :: Settings/TestModuleCacheSanity.test (868 of 1860) PASS: lldb-unit :: Interpreter/./InterpreterTests/CompletionTest.DirCompletionAbsolute (869 of 1860) UNSUPPORTED: lldb-shell :: Register/x86-ymm-write.test (870 of 1860) UNSUPPORTED: lldb-shell :: Register/x86-64-ymm16-read.test (871 of 1860) PASS: lldb-unit :: Utility/./UtilityTests/RegularExpression.Valid (872 of 1860) PASS: lldb-api :: lang/cpp/trivial_abi/TestTrivialABI.py (873 of 1860) PASS: lldb-unit :: ScriptInterpreter/Python/./ScriptInterpreterPythonTests/PythonDataObjectsTest.TestOwnedReferences (874 of 1860) PASS: lldb-api :: functionalities/gdb_remote_client/TestPlatformClient.py (875 of 1860) PASS: lldb-unit :: Expression/./ExpressionTests/DiagnosticManagerTest.GetStringMultiline (876 of 1860) PASS: lldb-shell :: SymbolFile/DWARF/DW_AT_low_pc-addrx.s (877 of 1860) PASS: lldb-unit :: Expression/./ExpressionTests/ClangHostTest.ComputeClangResourceDirectory (878 of 1860) PASS: lldb-api :: python_api/signals/TestSignalsAPI.py (879 of 1860) PASS: lldb-api :: commands/command/script/import/rdar-12586188/TestRdar12586188.py (880 of 1860) PASS: lldb-api :: lang/c/blocks/TestBlocks.py (881 of 1860) UNSUPPORTED: lldb-shell :: SymbolFile/NativePDB/stack_unwinding01.cpp (882 of 1860) PASS: lldb-api :: commands/expression/import-std-module/list-basic/TestBasicList.py (883 of 1860) PASS: lldb-api :: python_api/sbvalue_const_addrof/TestSBValueConstAddrOf.py (884 of 1860) PASS: lldb-api :: python_api/name_lookup/TestNameLookup.py (885 of 1860) PASS: lldb-unit :: Utility/./UtilityTests/RecordReplayTest.InstrumentedBarPtr (886 of 1860) PASS: lldb-api :: lang/objc/blocks/TestObjCIvarsInBlocks.py (887 of 1860) PASS: lldb-unit :: UnwindAssembly/x86/./UnwindAssemblyx86Tests/Testx86AssemblyInspectionEngine.TestPopR12 (888 of 1860) PASS: lldb-unit :: Utility/./UtilityTests/GeneratorTest.Get (889 of 1860) PASS: lldb-unit :: SymbolFile/NativePDB/./SymbolFileNativePDBTests/PDBFPOProgramToDWARFExpressionTests.MultipleDependentAssignments (890 of 1860) PASS: lldb-api :: types/TestShortType.py (891 of 1860) PASS: lldb-unit :: Utility/./UtilityTests/ConstStringTest.NullAndEmptyStates (892 of 1860) PASS: lldb-api :: lang/objc/modules-cache/TestClangModulesCache.py (893 of 1860) PASS: lldb-api :: commands/expression/call-function/TestCallUserDefinedFunction.py (894 of 1860) PASS: lldb-shell :: Breakpoint/single-file-split-dwarf.test (895 of 1860) PASS: lldb-api :: lang/cpp/modules-import/TestCXXModulesImport.py (896 of 1860) PASS: lldb-unit :: Process/minidump/./LLDBMinidumpTests/MinidumpParserTest.GetThreadContext_x86_32_wow64 (897 of 1860) PASS: lldb-unit :: Utility/./UtilityTests/StreamTest.AddressNoSuffix (898 of 1860) PASS: lldb-api :: functionalities/breakpoint/scripted_bkpt/TestScriptedResolver.py (899 of 1860) PASS: lldb-unit :: Host/./HostTests/NativeProcessProtocolTest.SetBreakpointFailRead (900 of 1860) PASS: lldb-api :: types/TestCharType.py (901 of 1860) PASS: lldb-unit :: Utility/./UtilityTests/StringExtractorTest.GetHexBytesAvail_Partial (902 of 1860) PASS: lldb-api :: lang/objc/radar-9691614/TestObjCMethodReturningBOOL.py (903 of 1860) PASS: lldb-unit :: Language/Highlighting/./HighlighterTests/HighlighterTest.ClangOperators (904 of 1860) PASS: lldb-shell :: ObjectFile/PECOFF/invalid-export-table.yaml (905 of 1860) PASS: lldb-api :: functionalities/thread/concurrent_events/TestConcurrentManyCrash.py (906 of 1860) PASS: lldb-unit :: Language/Highlighting/./HighlighterTests/HighlighterTest.ClangCursorPosInOtherToken (907 of 1860) PASS: lldb-unit :: Utility/./UtilityTests/StringListTest.JoinNonSpace (908 of 1860) PASS: lldb-unit :: Process/gdb-remote/./ProcessGdbRemoteTests/GDBRemoteClientBaseTest.SendContinueAndInterrupt2PacketBug (909 of 1860) PASS: lldb-unit :: Language/CPlusPlus/./LanguageCPlusPlusTests/CPlusPlusLanguage.MethodNameParsing (910 of 1860) PASS: lldb-api :: lang/objc/modules/TestObjCModules.py (911 of 1860) PASS: lldb-unit :: Core/./LLDBCoreTests/UniqueCStringMap.NoDefaultConstructor (912 of 1860) PASS: lldb-unit :: Utility/./UtilityTests/BinaryStreamTest.PutSLEB128Zero (913 of 1860) PASS: lldb-unit :: Utility/./UtilityTests/StringListTest.DefaultConstructor (914 of 1860) PASS: lldb-shell :: Commands/CommandScriptImmediateOutput/CommandScriptImmediateOutputConsole.test (915 of 1860) PASS: lldb-api :: functionalities/breakpoint/address_breakpoints/TestBadAddressBreakpoints.py (916 of 1860) PASS: lldb-unit :: Utility/./UtilityTests/NameMatchesTest.RegularExpression (917 of 1860) PASS: lldb-api :: functionalities/rerun/TestRerun.py (918 of 1860) PASS: lldb-unit :: Utility/./UtilityTests/SerializationRountripTest.SerializeDeserializeCString (919 of 1860) PASS: lldb-api :: python_api/section/TestSectionAPI.py (920 of 1860) PASS: lldb-unit :: Utility/./UtilityTests/IndexToObjectTest.ObjectForIndex (921 of 1860) PASS: lldb-api :: commands/expression/import-std-module/queue/TestQueue.py (922 of 1860) PASS: lldb-unit :: Process/gdb-remote/./ProcessGdbRemoteTests/GDBRemoteClientBaseTest.SendContinueAndInterrupt (923 of 1860) PASS: lldb-unit :: Utility/./UtilityTests/FileSpecTest.EqualSeparator (924 of 1860) PASS: lldb-unit :: Utility/./UtilityTests/StreamTest.AddressRange (925 of 1860) PASS: lldb-shell :: ObjectFile/PECOFF/dep-modules.yaml (926 of 1860) PASS: lldb-unit :: Utility/./UtilityTests/DataExtractorTest.GetCStr (927 of 1860) PASS: lldb-api :: python_api/interpreter/TestCommandInterpreterAPI.py (928 of 1860) UNSUPPORTED: lldb-api :: functionalities/darwin_log/filter/regex/subsystem/TestDarwinLogFilterRegexSubsystem.py (929 of 1860) PASS: lldb-unit :: Utility/./UtilityTests/RangeTest.Slide (930 of 1860) PASS: lldb-api :: commands/expression/rdar42038760/TestScalarURem.py (931 of 1860) PASS: lldb-api :: commands/expression/persistent_variables/TestPersistentVariables.py (932 of 1860) PASS: lldb-api :: macosx/universal/TestUniversal.py (933 of 1860) PASS: lldb-unit :: ScriptInterpreter/Python/./ScriptInterpreterPythonTests/PythonDataObjectsTest.TestPythonCallableInvoke (934 of 1860) PASS: lldb-unit :: UnwindAssembly/x86/./UnwindAssemblyx86Tests/Testx86AssemblyInspectionEngine.TestDisassemblyJunkBytes (935 of 1860) PASS: lldb-api :: macosx/find-dsym/bundle-with-dot-in-filename/TestBundleWithDotInFilename.py (936 of 1860) PASS: lldb-unit :: Utility/./UtilityTests/BinaryStreamTest.PutSLEB128SevenBytes (937 of 1860) PASS: lldb-unit :: Symbol/./SymbolTests/Type.GetTypeScopeAndBasename (938 of 1860) PASS: lldb-api :: functionalities/conditional_break/TestConditionalBreak.py (939 of 1860) PASS: lldb-unit :: Host/./HostTests/SocketAddressTest.GetAddressInfo (940 of 1860) PASS: lldb-unit :: Core/./LLDBCoreTests/RichManglingContextTest.Basic (941 of 1860) PASS: lldb-shell :: SymbolFile/DWARF/clang-ast-from-dwarf-objc-property.m (942 of 1860) PASS: lldb-api :: commands/watchpoints/watchpoint_commands/condition/TestWatchpointConditionCmd.py (943 of 1860) PASS: lldb-api :: lang/cpp/breakpoint-commands/TestCPPBreakpointCommands.py (944 of 1860) PASS: lldb-unit :: Utility/./UtilityTests/UriParserTest.SchemeHostSeparator2 (945 of 1860) PASS: lldb-api :: functionalities/data-formatter/dump_dynamic/TestDumpDynamic.py (946 of 1860) PASS: lldb-unit :: ObjectFile/Breakpad/./ObjectFileBreakpadTests/LineRecord.parse (947 of 1860) PASS: lldb-api :: lang/cpp/symbols/TestSymbols.py (948 of 1860) PASS: lldb-api :: python_api/symbol-context/two-files/TestSymbolContextTwoFiles.py (949 of 1860) PASS: lldb-api :: commands/expression/scoped_enums/TestScopedEnumType.py (950 of 1860) PASS: lldb-api :: functionalities/data-formatter/data-formatter-stl/libcxx/multimap/TestDataFormatterLibccMultiMap.py (951 of 1860) PASS: lldb-unit :: Symbol/./SymbolTests/PostfixExpression.ParseOneExpression (952 of 1860) PASS: lldb-unit :: Language/Highlighting/./HighlighterTests/HighlighterTest.ClangCursorPos (953 of 1860) PASS: lldb-unit :: Utility/./UtilityTests/StringExtractorTest.GetU64LittleEndian (954 of 1860) PASS: lldb-unit :: UnwindAssembly/x86/./UnwindAssemblyx86Tests/Testx86AssemblyInspectionEngine.Test32BitOnlyInstruction (955 of 1860) PASS: lldb-unit :: Utility/./UtilityTests/StringListTest.ForRangeEmpty (956 of 1860) PASS: lldb-unit :: Utility/./UtilityTests/StringListTest.CopyList (957 of 1860) PASS: lldb-unit :: Utility/./UtilityTests/StreamTest.PutHex16ByteOrderLittle (958 of 1860) PASS: lldb-shell :: ObjectFile/ELF/many-sections.s (959 of 1860) PASS: lldb-unit :: UnwindAssembly/ARM64/./Arm64InstEmulationTests/TestArm64InstEmulation.TestMediumDarwinFunction (960 of 1860) PASS: lldb-shell :: ObjectFile/ELF/duplicate-section.yaml (961 of 1860) PASS: lldb-api :: functionalities/data-formatter/data-formatter-enum-format/TestDataFormatterEnumFormat.py (962 of 1860) PASS: lldb-unit :: Utility/./UtilityTests/RangeTest.DoesIntersect (963 of 1860) PASS: lldb-unit :: Utility/./UtilityTests/RangeTest.NotEqualInvalid (964 of 1860) PASS: lldb-unit :: Utility/./UtilityTests/StringListTest.SplitIntoLinesSingleTrailingCR (965 of 1860) PASS: lldb-api :: commands/platform/basic/TestPlatformCommand.py (966 of 1860) PASS: lldb-unit :: ScriptInterpreter/Python/./ScriptInterpreterPythonTests/PythonDataObjectsTest.TestPythonListValueEquality (967 of 1860) PASS: lldb-api :: commands/expression/multiline-navigation/TestMultilineNavigation.py (968 of 1860) PASS: lldb-api :: lang/objc/objc-property/TestObjCProperty.py (969 of 1860) PASS: lldb-api :: functionalities/tail_call_frames/unambiguous_sequence/TestUnambiguousTailCalls.py (970 of 1860) PASS: lldb-shell :: ObjectFile/ELF/minidebuginfo-find-symbols.yaml (971 of 1860) PASS: lldb-shell :: Register/x86-64-read.test (972 of 1860) PASS: lldb-unit :: SymbolFile/NativePDB/./SymbolFileNativePDBTests/PDBFPOProgramToDWARFExpressionTests.UnresolvedRegisterReference (973 of 1860) PASS: lldb-api :: functionalities/gdb_remote_client/TestJLink6Armv7RegisterDefinition.py (974 of 1860) PASS: lldb-unit :: Utility/./UtilityTests/NameMatchesTest.StartsWith (975 of 1860) UNSUPPORTED: lldb-api :: functionalities/data-formatter/data-formatter-stl/libstdcpp/smart_ptr/TestDataFormatterStdSmartPtr.py (976 of 1860) UNSUPPORTED: lldb-api :: commands/expression/completion-crash-incomplete-record/TestCompletionCrashIncompleteRecord.py (977 of 1860) PASS: lldb-api :: commands/quit/TestQuit.py (978 of 1860) PASS: lldb-unit :: Utility/./UtilityTests/RangeTest.SizeTypes (979 of 1860) PASS: lldb-api :: functionalities/recursion/TestValueObjectRecursion.py (980 of 1860) PASS: lldb-api :: functionalities/breakpoint/breakpoint_conditions/TestBreakpointConditions.py (981 of 1860) PASS: lldb-api :: functionalities/data-formatter/data-formatter-objc/TestDataFormatterObjCKVO.py (982 of 1860) PASS: lldb-unit :: Utility/./UtilityTests/BroadcasterTest.EventTypeHasListeners (983 of 1860) PASS: lldb-unit :: Expression/./ExpressionTests/CppModuleConfigurationTest.UnrelatedLibrary (984 of 1860) PASS: lldb-api :: commands/expression/argument_passing_restrictions/TestArgumentPassingRestrictions.py (985 of 1860) PASS: lldb-api :: python_api/lldbutil/TestSwigVersion.py (986 of 1860) PASS: lldb-api :: commands/target/stop-hooks/TestStopHooks.py (987 of 1860) UNSUPPORTED: lldb-shell :: SymbolFile/PDB/function-level-linking.test (988 of 1860) PASS: lldb-unit :: Process/gdb-remote/./ProcessGdbRemoteTests/GDBRemoteCommunicationClientTest.WriteRegisterNoSuffix (989 of 1860) PASS: lldb-api :: functionalities/tail_call_frames/ambiguous_tail_call_seq2/TestAmbiguousTailCallSeq2.py (990 of 1860) PASS: lldb-shell :: SymbolFile/DWARF/find-method.cpp (991 of 1860) PASS: lldb-shell :: Reproducer/TestVersionCheck.test (992 of 1860) UNSUPPORTED: lldb-shell :: ExecControl/StopHook/stop-hook-threads.test (993 of 1860) PASS: lldb-api :: commands/expression/completion/TestExprCompletion.py (994 of 1860) PASS: lldb-unit :: Host/./HostTests/FileSystemTest.EnumerateDirectory (995 of 1860) PASS: lldb-unit :: Process/minidump/./LLDBMinidumpTests/MinidumpParserTest.GetThreadContext_x86_32 (996 of 1860) PASS: lldb-shell :: Expr/TestTypeOfDeclTypeExpr.test (997 of 1860) PASS: lldb-api :: functionalities/value_md5_crash/TestValueMD5Crash.py (998 of 1860) PASS: lldb-unit :: Utility/./UtilityTests/NameMatchesTest.Equals (999 of 1860) PASS: lldb-unit :: SymbolFile/NativePDB/./SymbolFileNativePDBTests/PDBFPOProgramToDWARFExpressionTests.UnresolvedCyclicRegisterAssignmentReference (1000 of 1860) UNSUPPORTED: lldb-shell :: Register/x86-gp-read.test (1001 of 1860) PASS: lldb-api :: functionalities/thread/exit_during_step/TestExitDuringStep.py (1002 of 1860) PASS: lldb-unit :: Utility/./UtilityTests/StringExtractorTest.GetNameColonValueNoSemicolon (1003 of 1860) PASS: lldb-unit :: Utility/./UtilityTests/FileSpecTest.GetPath (1004 of 1860) PASS: lldb-api :: commands/expression/import-std-module/unique_ptr/TestUniquePtr.py (1005 of 1860) PASS: lldb-api :: lang/cpp/stl/TestStdCXXDisassembly.py (1006 of 1860) PASS: lldb-api :: functionalities/gdb_remote_client/TestNoGPacketSupported.py (1007 of 1860) PASS: lldb-shell :: Quit/TestQuitExitCodeNonInt.test (1008 of 1860) PASS: lldb-unit :: Utility/./UtilityTests/RangeDataVector.FindEntryThatContains_Overlap (1009 of 1860) PASS: lldb-unit :: SymbolFile/DWARF/./SymbolFileDWARFTests/SymbolFileDWARFTests.TestAbbrevInvalidNULLTag (1010 of 1860) PASS: lldb-unit :: ScriptInterpreter/Python/./ScriptInterpreterPythonTests/PythonDataObjectsTest.TestObjectAttributes (1011 of 1860) PASS: lldb-api :: functionalities/gdb_remote_client/TestNestedRegDefinitions.py (1012 of 1860) PASS: lldb-unit :: Utility/./UtilityTests/StatusTest.ErrorConstructor (1013 of 1860) PASS: lldb-shell :: Settings/TestStopCommandSourceOnError.test (1014 of 1860) PASS: lldb-unit :: Utility/./UtilityTests/Flags.Reset (1015 of 1860) PASS: lldb-api :: commands/watchpoints/watchpoint_events/TestWatchpointEvents.py (1016 of 1860) PASS: lldb-api :: functionalities/breakpoint/objc/TestObjCBreakpoints.py (1017 of 1860) PASS: lldb-api :: functionalities/inferior-changed/TestInferiorChanged.py (1018 of 1860) PASS: lldb-api :: python_api/sbvalue_persist/TestSBValuePersist.py (1019 of 1860) PASS: lldb-unit :: Utility/./UtilityTests/StringListTest.GetMaxStringLengthEmpty (1020 of 1860) PASS: lldb-api :: python_api/value/empty_class/TestValueAPIEmptyClass.py (1021 of 1860) PASS: lldb-unit :: ScriptInterpreter/Python/./ScriptInterpreterPythonTests/PythonDataObjectsTest.TestTypeNameResolutionNoDot (1022 of 1860) PASS: lldb-unit :: Utility/./UtilityTests/StringListTest.Join (1023 of 1860) PASS: lldb-api :: functionalities/thread/concurrent_events/TestConcurrentSignalDelayWatch.py (1024 of 1860) PASS: lldb-unit :: Utility/./UtilityTests/OptionsWithRawTest.UnterminatedQuote (1025 of 1860) PASS: lldb-unit :: Utility/./UtilityTests/StreamTest.ChangingByteOrder (1026 of 1860) PASS: lldb-api :: python_api/exprpath_synthetic/TestExprPathSynthetic.py (1027 of 1860) PASS: lldb-unit :: Utility/./UtilityTests/StringExtractorTest.GetHexU8_Underflow (1028 of 1860) PASS: lldb-unit :: Language/Highlighting/./HighlighterTests/HighlighterTest.ClangStringLiterals (1029 of 1860) PASS: lldb-api :: macosx/version_zero/TestGetVersionZeroVersion.py (1030 of 1860) PASS: lldb-api :: commands/expression/import-std-module/empty-module/TestEmptyStdModule.py (1031 of 1860) PASS: lldb-shell :: ObjectFile/ELF/section-types.yaml (1032 of 1860) PASS: lldb-unit :: Utility/./UtilityTests/StringListTest.LongestCommonPrefixSingleElement (1033 of 1860) PASS: lldb-unit :: UnwindAssembly/x86/./UnwindAssemblyx86Tests/Testx86AssemblyInspectionEngine.TestPopRBX (1034 of 1860) PASS: lldb-unit :: Utility/./UtilityTests/UriParserTest.MinimalPortPath (1035 of 1860) PASS: lldb-api :: commands/command/script/import/TestImport.py (1036 of 1860) PASS: lldb-api :: commands/expression/issue_11588/Test11588.py (1037 of 1860) PASS: lldb-unit :: Language/Highlighting/./HighlighterTests/HighlighterTest.ClangSquareBrackets (1038 of 1860) PASS: lldb-unit :: Language/Highlighting/./HighlighterTests/HighlighterTest.ClangCommas (1039 of 1860) PASS: lldb-unit :: UnwindAssembly/x86/./UnwindAssemblyx86Tests/Testx86AssemblyInspectionEngine.TestSubESP (1040 of 1860) PASS: lldb-unit :: Utility/./UtilityTests/StringExtractorTest.InitMisc (1041 of 1860) PASS: lldb-api :: lang/cpp/extern_c/TestExternCSymbols.py (1042 of 1860) PASS: lldb-unit :: Utility/./UtilityTests/StreamTeeTest.GetStreamAtIndexOutOfBounds (1043 of 1860) PASS: lldb-unit :: Utility/./UtilityTests/AnsiTerminal.AtEnd (1044 of 1860) PASS: lldb-api :: lang/cpp/virtual/TestVirtual.py (1045 of 1860) PASS: lldb-api :: commands/frame/diagnose/array/TestArray.py (1046 of 1860) PASS: lldb-api :: functionalities/thread/concurrent_events/TestConcurrentCrashWithBreak.py (1047 of 1860) UNSUPPORTED: lldb-shell :: Register/arm-gp-read.test (1048 of 1860) PASS: lldb-api :: functionalities/thread/concurrent_events/TestConcurrentTwoBreakpointsOneWatchpoint.py (1049 of 1860) PASS: lldb-unit :: Utility/./UtilityTests/LogChannelEnabledTest.LogThread (1050 of 1860) PASS: lldb-api :: commands/expression/import-std-module/forward_list-basic/TestBasicForwardList.py (1051 of 1860) PASS: lldb-unit :: Utility/./UtilityTests/StringListTest.LongestCommonPrefixNoPrefix (1052 of 1860) PASS: lldb-api :: commands/watchpoints/multiple_threads/TestWatchpointMultipleThreads.py (1053 of 1860) PASS: lldb-unit :: Target/./TargetTests/PathMappingListTest.AbsoluteTests (1054 of 1860) PASS: lldb-unit :: Utility/./UtilityTests/StringExtractorTest.GetU32LittleEndian (1055 of 1860) PASS: lldb-api :: lang/cpp/breakpoint_in_member_func_w_non_primitive_params/TestBreakpointInMemberFuncWNonPrimitiveParams.py (1056 of 1860) PASS: lldb-api :: lang/cpp/wchar_t/TestCxxWCharT.py (1057 of 1860) PASS: lldb-api :: functionalities/signal/raise/TestRaise.py (1058 of 1860) PASS: lldb-api :: commands/command/delete/TestCommandDelete.py (1059 of 1860) PASS: lldb-unit :: Utility/./UtilityTests/Predicate.WaitForValueNotEqualTo (1060 of 1860) PASS: lldb-unit :: SymbolFile/NativePDB/./SymbolFileNativePDBTests/PDBFPOProgramToDWARFExpressionTests.UnresolvedRegisterAssignmentReference (1061 of 1860) PASS: lldb-unit :: debugserver/./debugserverTests/RNBSocket.LoopBackListenIPv6 (1062 of 1860) PASS: lldb-shell :: SymbolFile/Breakpad/stack-cfi-parsing.test (1063 of 1860) PASS: lldb-api :: functionalities/breakpoint/comp_dir_symlink/TestCompDirSymLink.py (1064 of 1860) UNSUPPORTED: lldb-api :: linux/thread/create_during_instruction_step/TestCreateDuringInstructionStep.py (1065 of 1860) PASS: lldb-unit :: Utility/./UtilityTests/RangeDataVector.FindEntryThatContains (1066 of 1860) PASS: lldb-unit :: UnwindAssembly/x86/./UnwindAssemblyx86Tests/Testx86AssemblyInspectionEngine.TestSubRSP (1067 of 1860) PASS: lldb-api :: python_api/sblaunchinfo/TestSBLaunchInfo.py (1068 of 1860) PASS: lldb-api :: functionalities/data-formatter/data-formatter-advanced/TestDataFormatterAdv.py (1069 of 1860) PASS: lldb-shell :: ExecControl/StopHook/stop-hook.test (1070 of 1860) PASS: lldb-unit :: Utility/./UtilityTests/FileSpecTest.EqualDotsWindows (1071 of 1860) PASS: lldb-api :: lang/objc/foundation/TestObjCMethods.py (1072 of 1860) PASS: lldb-api :: functionalities/thread/crash_during_step/TestCrashDuringStep.py (1073 of 1860) PASS: lldb-api :: python_api/target/TestTargetAPI.py (1074 of 1860) PASS: lldb-api :: commands/expression/call-function/TestCallStopAndContinue.py (1075 of 1860) PASS: lldb-unit :: Language/Highlighting/./HighlighterTests/HighlighterTest.Colons (1076 of 1860) PASS: lldb-shell :: SymbolFile/DWARF/debug_ranges.s (1077 of 1860) PASS: lldb-api :: functionalities/deleted-executable/TestDeletedExecutable.py (1078 of 1860) PASS: lldb-api :: functionalities/data-formatter/setvaluefromcstring/TestSetValueFromCString.py (1079 of 1860) PASS: lldb-shell :: ObjectFile/Breakpad/breakpad-identification.test (1080 of 1860) PASS: lldb-shell :: SymbolFile/DWARF/dwarf5_locations.s (1081 of 1860) PASS: lldb-unit :: Utility/./UtilityTests/EnvironmentTest.EnvpConstruction (1082 of 1860) PASS: lldb-api :: lang/objc/objc-baseclass-sbtype/TestObjCBaseClassSBType.py (1083 of 1860) PASS: lldb-unit :: Language/Highlighting/./HighlighterTests/HighlighterTest.HighlighterSelectionPath (1084 of 1860) PASS: lldb-unit :: Expression/./ExpressionTests/CppModuleConfigurationTest.MissingLibCpp (1085 of 1860) PASS: lldb-unit :: Process/minidump/./LLDBMinidumpTests/MinidumpParserTest.GetArchitecture (1086 of 1860) PASS: lldb-unit :: UnwindAssembly/x86/./UnwindAssemblyx86Tests/Testx86AssemblyInspectionEngine.TestPushRBPWithREX (1087 of 1860) PASS: lldb-unit :: Host/./HostTests/TaskPoolTest.RunTasks (1088 of 1860) UNSUPPORTED: lldb-api :: lang/cpp/function-template-parameter-pack/TestFunctionTemplateParameterPack.py (1089 of 1860) PASS: lldb-api :: functionalities/tail_call_frames/thread_step_out_or_return/TestSteppingOutWithArtificialFrames.py (1090 of 1860) PASS: lldb-unit :: Utility/./UtilityTests/StringLexerTest.GetUnlexed (1091 of 1860) PASS: lldb-unit :: Utility/./UtilityTests/ListenerTest.GetEventImmediate (1092 of 1860) PASS: lldb-api :: commands/process/attach/attach_denied/TestAttachDenied.py (1093 of 1860) PASS: lldb-api :: commands/expression/import-std-module/forward_list-dbg-info-content/TestDbgInfoContentForwardList.py (1094 of 1860) PASS: lldb-unit :: Language/Highlighting/./HighlighterTests/HighlighterTest.HighlighterSelectionType (1095 of 1860) PASS: lldb-unit :: Utility/./UtilityTests/StringListTest.SetSize (1096 of 1860) PASS: lldb-unit :: Utility/./UtilityTests/ArgsTest.TestMultipleArgs (1097 of 1860) PASS: lldb-shell :: Process/TestEnvironment.test (1098 of 1860) PASS: lldb-api :: lang/objc/objc-static-method-stripped/TestObjCStaticMethodStripped.py (1099 of 1860) PASS: lldb-api :: commands/settings/TestSettings.py (1100 of 1860) PASS: lldb-api :: commands/platform/basic/TestPlatformPython.py (1101 of 1860) PASS: lldb-api :: commands/expression/timeout/TestCallWithTimeout.py (1102 of 1860) UNSUPPORTED: lldb-shell :: SymbolFile/DWARF/debug-types-expressions.test (1103 of 1860) PASS: lldb-unit :: Utility/./UtilityTests/StringListTest.Assignment (1104 of 1860) PASS: lldb-api :: commands/expression/two-files/TestObjCTypeQueryFromOtherCompileUnit.py (1105 of 1860) PASS: lldb-api :: functionalities/inferior-crashing/TestInferiorCrashingStep.py (1106 of 1860) PASS: lldb-unit :: Utility/./UtilityTests/ConstStringTest.MangledCounterpart (1107 of 1860) PASS: lldb-unit :: Utility/./UtilityTests/StreamTest.PutBytesAsRawHex8ToLittleEndian (1108 of 1860) PASS: lldb-shell :: Quit/TestQuitExitCode0.test (1109 of 1860) PASS: lldb-unit :: Utility/./UtilityTests/BinaryStreamTest.PutSLEB128MaxValue (1110 of 1860) PASS: lldb-unit :: Utility/./UtilityTests/TimeoutTest.Format (1111 of 1860) PASS: lldb-unit :: Utility/./UtilityTests/OptionsWithRawTest.EmptySuffix (1112 of 1860) PASS: lldb-api :: functionalities/modern-type-lookup/basic-objc/TestBasicObjcModernTypeLookup.py (1113 of 1860) PASS: lldb-unit :: Utility/./UtilityTests/StringListTest.AppendListCStringArrayEmpty (1114 of 1860) PASS: lldb-unit :: Utility/./UtilityTests/StreamTest.PutRawBytesToLittleEndian (1115 of 1860) PASS: lldb-api :: functionalities/unwind/noreturn/module-end/TestNoReturnModuleEnd.py (1116 of 1860) UNSUPPORTED: lldb-api :: functionalities/darwin_log/filter/regex/message/TestDarwinLogFilterRegexMessage.py (1117 of 1860) PASS: lldb-unit :: Utility/./UtilityTests/StringExtractorTest.GetHexU8_Exact_NoEof (1118 of 1860) PASS: lldb-api :: lang/cpp/namespace_definitions/TestNamespaceDefinitions.py (1119 of 1860) PASS: lldb-api :: functionalities/breakpoint/breakpoint_command/TestRegexpBreakCommand.py (1120 of 1860) PASS: lldb-api :: lang/cpp/rvalue-references/TestRvalueReferences.py (1121 of 1860) PASS: lldb-api :: functionalities/thread/concurrent_events/TestConcurrentCrashWithSignal.py (1122 of 1860) XFAIL: lldb-shell :: SymbolFile/DWARF/find-type-in-function.cpp (1123 of 1860) PASS: lldb-shell :: Quit/TestQuitExitCodeHex0.test (1124 of 1860) PASS: lldb-unit :: Utility/./UtilityTests/UriParserTest.SchemeHostSeparator (1125 of 1860) PASS: lldb-unit :: Utility/./UtilityTests/StringListTest.SplitIntoLinesEmpty (1126 of 1860) PASS: lldb-unit :: Utility/./UtilityTests/BinaryStreamTest.PutULEB128SixBytes (1127 of 1860) PASS: lldb-unit :: Utility/./UtilityTests/StringListTest.AppendStringStdString (1128 of 1860) PASS: lldb-api :: lang/c/stepping/TestStepAndBreakpoints.py (1129 of 1860) PASS: lldb-unit :: Expression/./ExpressionTests/DiagnosticManagerTest.PutStringSeverities (1130 of 1860) PASS: lldb-unit :: Utility/./UtilityTests/UriParserTest.Minimal (1131 of 1860) PASS: lldb-api :: functionalities/data-formatter/data-formatter-stl/libcxx/function/TestLibCxxFunction.py (1132 of 1860) PASS: lldb-unit :: Host/./HostTests/NativeProcessProtocolTest.SetBreakpointFailVerify (1133 of 1860) UNSUPPORTED: lldb-api :: functionalities/process_save_core/TestProcessSaveCore.py (1134 of 1860) PASS: lldb-unit :: Language/Highlighting/./HighlighterTests/HighlighterTest.ClangScalarLiterals (1135 of 1860) PASS: lldb-api :: python_api/process/TestProcessAPI.py (1136 of 1860) PASS: lldb-unit :: Utility/./UtilityTests/ScalarTest.Comparison (1137 of 1860) PASS: lldb-api :: lang/objc/objc-ivar-stripped/TestObjCIvarStripped.py (1138 of 1860) PASS: lldb-api :: functionalities/thread/concurrent_events/TestConcurrentWatchpointWithDelayWatchpointThreads.py (1139 of 1860) PASS: lldb-api :: lang/c/enum_types/TestEnumTypes.py (1140 of 1860) PASS: lldb-api :: functionalities/postmortem/elf-core/gcore/TestGCore.py (1141 of 1860) PASS: lldb-api :: functionalities/tsan/global_location/TestTsanGlobalLocation.py (1142 of 1860) PASS: lldb-api :: commands/expression/invalid-args/TestInvalidArgsExpression.py (1143 of 1860) PASS: lldb-api :: functionalities/dynamic_value_child_count/TestDynamicValueChildCount.py (1144 of 1860) PASS: lldb-api :: python_api/frame/get-variables/TestGetVariables.py (1145 of 1860) PASS: lldb-api :: linux/builtin_trap/TestBuiltinTrap.py (1146 of 1860) PASS: lldb-api :: functionalities/breakpoint/breakpoint_hit_count/TestBreakpointHitCount.py (1147 of 1860) PASS: lldb-unit :: Utility/./UtilityTests/TimerTest.CategoryTimesStats (1148 of 1860) PASS: lldb-unit :: Utility/./UtilityTests/StringLexerTest.AdvanceIf (1149 of 1860) UNSUPPORTED: lldb-api :: commands/register/register/intel_xtended_registers/mpx_offset_intersection/TestMPXOffsetIntersection.py (1150 of 1860) PASS: lldb-unit :: Utility/./UtilityTests/OptionsWithRawTest.WhitespaceInput (1151 of 1860) PASS: lldb-shell :: ObjectFile/ELF/minidebuginfo-corrupt-xz.yaml (1152 of 1860) PASS: lldb-api :: functionalities/breakpoint/source_regexp/TestSourceRegexBreakpoints.py (1153 of 1860) PASS: lldb-api :: functionalities/non-overlapping-index-variable-i/TestIndexVariable.py (1154 of 1860) UNSUPPORTED: lldb-api :: tools/lldb-vscode/completions/TestVSCode_completions.py (1155 of 1860) PASS: lldb-api :: driver/batch_mode/TestBatchMode.py (1156 of 1860) PASS: lldb-api :: functionalities/postmortem/netbsd-core/TestNetBSDCore.py (1157 of 1860) PASS: lldb-unit :: Utility/./UtilityTests/OptionsWithRawTest.SingleWordSuffix (1158 of 1860) PASS: lldb-unit :: Utility/./UtilityTests/StringLexerTest.Peek (1159 of 1860) PASS: lldb-api :: functionalities/data-formatter/synthcapping/TestSyntheticCapping.py (1160 of 1860) PASS: lldb-api :: lang/objc/exceptions/TestObjCExceptions.py (1161 of 1860) PASS: lldb-unit :: Utility/./UtilityTests/StringExtractorTest.GetU32BigEndian (1162 of 1860) PASS: lldb-shell :: SymbolFile/Breakpad/symtab.test (1163 of 1860) UNSUPPORTED: lldb-shell :: SymbolFile/PDB/type-quals.test (1164 of 1860) PASS: lldb-shell :: SymbolFile/DWARF/DW_AT_loclists_base.s (1165 of 1860) PASS: lldb-api :: lang/objc/objc-class-method/TestObjCClassMethod.py (1166 of 1860) PASS: lldb-shell :: SymbolFile/DWARF/debug_aranges-empty-section.s (1167 of 1860) PASS: lldb-unit :: Host/./HostTests/SocketTest.UDPGetConnectURI (1168 of 1860) PASS: lldb-api :: lang/objc/objc-builtin-types/TestObjCBuiltinTypes.py (1169 of 1860) PASS: lldb-unit :: Host/./HostTests/FileSystemTest.Resolve (1170 of 1860) PASS: lldb-shell :: Breakpoint/dummy-target.test (1171 of 1860) PASS: lldb-api :: functionalities/breakpoint/breakpoint_locations/TestBreakpointLocations.py (1172 of 1860) PASS: lldb-api :: functionalities/inferior-crashing/recursive-inferior/TestRecursiveInferior.py (1173 of 1860) PASS: lldb-shell :: SymbolFile/Breakpad/line-table-edgecases.test (1174 of 1860) PASS: lldb-api :: macosx/function-starts/TestFunctionStarts.py (1175 of 1860) PASS: lldb-api :: functionalities/thread/backtrace_limit/TestBacktraceLimit.py (1176 of 1860) PASS: lldb-unit :: Utility/./UtilityTests/Flags.Clear (1177 of 1860) PASS: lldb-unit :: Utility/./UtilityTests/CompletionRequest.TryCompleteCurrentArgMode (1178 of 1860) PASS: lldb-unit :: UnwindAssembly/x86/./UnwindAssemblyx86Tests/Testx86AssemblyInspectionEngine.TestPushEAX (1179 of 1860) PASS: lldb-unit :: Utility/./UtilityTests/ReproducerTest.SetReplay (1180 of 1860) PASS: lldb-unit :: ScriptInterpreter/Python/./ScriptInterpreterPythonTests/PythonDataObjectsTest.TestPythonString (1181 of 1860) PASS: lldb-api :: commands/expression/radar_9531204/TestPrintfAfterUp.py (1182 of 1860) PASS: lldb-unit :: Target/./TargetTests/ExecutionContextTest.GetByteOrder (1183 of 1860) PASS: lldb-unit :: Utility/./UtilityTests/RangeTest.Union (1184 of 1860) PASS: lldb-api :: python_api/watchpoint/TestWatchpointIter.py (1185 of 1860) PASS: lldb-unit :: Utility/./UtilityTests/VASprintfTest.BufferResize (1186 of 1860) PASS: lldb-unit :: Utility/./UtilityTests/VMRange.ContainsRange (1187 of 1860) PASS: lldb-api :: functionalities/breakpoint/address_breakpoints/TestAddressBreakpoints.py (1188 of 1860) PASS: lldb-unit :: Editline/./EditlineTests/EditlineTestFixture.EditlineReceivesSingleLineText (1189 of 1860) PASS: lldb-api :: functionalities/lazy-loading/TestLazyLoading.py (1190 of 1860) PASS: lldb-unit :: Utility/./UtilityTests/StringExtractorTest.GetHexBytes_OddPair2 (1191 of 1860) PASS: lldb-unit :: Utility/./UtilityTests/StringExtractorTest.GetHexBytesAvail_FullString (1192 of 1860) PASS: lldb-unit :: Host/./HostTests/NativeProcessProtocolTest.ReadCStringFromMemory (1193 of 1860) PASS: lldb-unit :: Expression/./ExpressionTests/DiagnosticManagerTest.AppendMessageNoDiag (1194 of 1860) PASS: lldb-shell :: Reproducer/TestDump.test (1195 of 1860) PASS: lldb-unit :: Utility/./UtilityTests/StatusTest.Formatv (1196 of 1860) PASS: lldb-shell :: ObjectFile/Breakpad/sections.test (1197 of 1860) PASS: lldb-api :: commands/frame/diagnose/dereference-this/TestDiagnoseDereferenceThis.py (1198 of 1860) PASS: lldb-api :: tools/lldb-vscode/attach/TestVSCode_attach.py (1199 of 1860) PASS: lldb-shell :: Driver/TestFile.test (1200 of 1860) PASS: lldb-api :: functionalities/unwind/noreturn/TestNoreturnUnwind.py (1201 of 1860) PASS: lldb-unit :: Utility/./UtilityTests/StringExtractorTest.InitEmpty (1202 of 1860) PASS: lldb-api :: functionalities/data-formatter/data-formatter-objc/TestDataFormatterObjCExpr.py (1203 of 1860) UNSUPPORTED: lldb-shell :: Register/x86-64-zmm-write.test (1204 of 1860) PASS: lldb-unit :: Utility/./UtilityTests/StringListTest.AppendList (1205 of 1860) PASS: lldb-api :: lang/cpp/char1632_t/TestChar1632T.py (1206 of 1860) PASS: lldb-unit :: Utility/./UtilityTests/BinaryStreamTest.PutULEB128ThreeBytes (1207 of 1860) PASS: lldb-shell :: Settings/TestDisableColor.test (1208 of 1860) PASS: lldb-api :: functionalities/thread/jump/TestThreadJump.py (1209 of 1860) PASS: lldb-api :: functionalities/data-formatter/data-formatter-stl/libcxx/forward_list/TestDataFormatterLibcxxForwardList.py (1210 of 1860) PASS: lldb-unit :: Utility/./UtilityTests/StringExtractorTest.GetHexBytesAvail_OddPair2 (1211 of 1860) PASS: lldb-unit :: Process/gdb-remote/./ProcessGdbRemoteTests/GDBRemoteCommunicationClientTest.GetModulesInfoInvalidResponse (1212 of 1860) PASS: lldb-api :: functionalities/thread/concurrent_events/TestConcurrentTwoWatchpointsOneSignal.py (1213 of 1860) PASS: lldb-unit :: Utility/./UtilityTests/DataExtractorTest.GetCStrUnterminated (1214 of 1860) PASS: lldb-unit :: Utility/./UtilityTests/ScalarTest.Division (1215 of 1860) PASS: lldb-unit :: Utility/./UtilityTests/RangeTest.ContainsAddr (1216 of 1860) PASS: lldb-shell :: SymbolFile/DWARF/find-variable-dwo.cpp (1217 of 1860) PASS: lldb-unit :: Utility/./UtilityTests/StreamTest.PutBytesAsRawHex8ToBigEndian (1218 of 1860) PASS: lldb-unit :: Language/Highlighting/./HighlighterTests/HighlighterTest.ClangUnterminatedString (1219 of 1860) PASS: lldb-shell :: SymbolFile/DWARF/compilercontext.ll (1220 of 1860) PASS: lldb-unit :: Symbol/./SymbolTests/TestClangASTContext.TestBuiltinTypeForEncodingAndBitSize (1221 of 1860) PASS: lldb-unit :: Utility/./UtilityTests/StreamTeeTest.Constructor2Streams (1222 of 1860) PASS: lldb-unit :: ScriptInterpreter/Python/./ScriptInterpreterPythonTests/PythonDataObjectsTest.TestGlobalNameResolutionWithDot (1223 of 1860) PASS: lldb-api :: functionalities/thread/concurrent_events/TestConcurrentWatchBreak.py (1224 of 1860) PASS: lldb-api :: api/listeners/TestListener.py (1225 of 1860) PASS: lldb-shell :: SymbolFile/DWARF/find-basic-function.cpp (1226 of 1860) PASS: lldb-api :: commands/expression/namespace_local_var_same_name_obj_c/TestNamespaceLocalVarSameNameObjC.py (1227 of 1860) PASS: lldb-api :: functionalities/tail_call_frames/sbapi_support/TestTailCallFrameSBAPI.py (1228 of 1860) PASS: lldb-unit :: Utility/./UtilityTests/StringExtractorTest.GetHexBytes_Underflow (1229 of 1860) PASS: lldb-api :: functionalities/data-formatter/data-formatter-proper-plurals/TestFormattersOneIsSingular.py (1230 of 1860) PASS: lldb-shell :: Minidump/Windows/Sigsegv/sigsegv.test (1231 of 1860) PASS: lldb-unit :: Host/./HostTests/FileSystemTest.Readable (1232 of 1860) PASS: lldb-unit :: Host/./HostTests/SocketAddressTest.Set (1233 of 1860) PASS: lldb-shell :: Commands/command-source.test (1234 of 1860) PASS: lldb-unit :: Utility/./UtilityTests/BinaryStreamTest.PutULEB128EightBytes (1235 of 1860) PASS: lldb-unit :: Utility/./UtilityTests/DataExtractorTest.GetMaxS64 (1236 of 1860) PASS: lldb-unit :: Target/./TargetTests/MemoryRegionInfoTest.Formatv (1237 of 1860) PASS: lldb-api :: python_api/hello_world/TestHelloWorld.py (1238 of 1860) PASS: lldb-unit :: Utility/./UtilityTests/RangeTest.Clear (1239 of 1860) PASS: lldb-api :: tools/lldb-server/TestGdbRemoteExpeditedRegisters.py (1240 of 1860) PASS: lldb-unit :: Utility/./UtilityTests/StreamTeeTest.Assignment (1241 of 1860) PASS: lldb-api :: commands/target/dump-symtab-demangle/TestDumpSymtabDemangle.py (1242 of 1860) PASS: lldb-unit :: Utility/./UtilityTests/BinaryStreamTest.PutULEB128MaxValue (1243 of 1860) PASS: lldb-unit :: Expression/./ExpressionTests/DiagnosticManagerTest.GetStringPreserveOrder (1244 of 1860) PASS: lldb-unit :: Expression/./ExpressionTests/CppModuleConfigurationTest.UnknownLibCppFile (1245 of 1860) PASS: lldb-unit :: Utility/./UtilityTests/StringExtractorTest.GetHexBytesAvail_Underflow (1246 of 1860) PASS: lldb-unit :: Utility/./UtilityTests/BinaryStreamTest.PutULEB128TwoBytes (1247 of 1860) PASS: lldb-shell :: Breakpoint/debug_rnglistx_rlex.test (1248 of 1860) PASS: lldb-api :: lang/cpp/llvm-style/TestLLVMStyle.py (1249 of 1860) PASS: lldb-api :: commands/expression/multiline-completion/TestMultilineCompletion.py (1250 of 1860) PASS: lldb-api :: commands/expression/weak_symbols/TestWeakSymbols.py (1251 of 1860) PASS: lldb-unit :: Utility/./UtilityTests/DataExtractorTest.GetBitfield (1252 of 1860) UNSUPPORTED: lldb-api :: functionalities/thread/create_during_step/TestCreateDuringStep.py (1253 of 1860) PASS: lldb-unit :: Language/CPlusPlus/./LanguageCPlusPlusTests/CPlusPlusLanguage.FindAlternateFunctionManglings (1254 of 1860) PASS: lldb-unit :: Utility/./UtilityTests/NameMatchesTest.Ignore (1255 of 1860) UNSUPPORTED: lldb-api :: functionalities/data-formatter/data-formatter-stl/libstdcpp/vector/TestDataFormatterStdVector.py (1256 of 1860) PASS: lldb-api :: tools/lldb-server/TestLldbGdbServer.py (1257 of 1860) PASS: lldb-unit :: Utility/./UtilityTests/VMRange.Reset (1258 of 1860) PASS: lldb-unit :: UnwindAssembly/x86/./UnwindAssemblyx86Tests/Testx86AssemblyInspectionEngine.TestPopR13 (1259 of 1860) PASS: lldb-unit :: SymbolFile/NativePDB/./SymbolFileNativePDBTests/PDBFPOProgramToDWARFExpressionTests.InvalidAssignmentSingle (1260 of 1860) PASS: lldb-api :: functionalities/param_entry_vals/basic_entry_values_x86_64/TestBasicEntryValuesX86_64.py (1261 of 1860) PASS: lldb-api :: commands/disassemble/basic/TestDisassembleBreakpoint.py (1262 of 1860) PASS: lldb-shell :: ObjectFile/PECOFF/basic-info-arm.yaml (1263 of 1860) PASS: lldb-unit :: Expression/./ExpressionTests/CppModuleConfigurationTest.IgnoreLibStdCpp (1264 of 1860) PASS: lldb-api :: lang/cpp/namespace_conflicts/TestNamespaceConflicts.py (1265 of 1860) PASS: lldb-shell :: BuildScript/toolchain-clang.test (1266 of 1860) PASS: lldb-unit :: Process/gdb-remote/./ProcessGdbRemoteTests/GDBRemoteClientBaseTest.SendContinueAndAsyncPacket (1267 of 1860) PASS: lldb-unit :: debugserver/./debugserverTests/RNBSocket.LoopBackListenIPv4 (1268 of 1860) PASS: lldb-unit :: Host/./HostTests/File.GetWaitableHandleFileno (1269 of 1860) PASS: lldb-unit :: Expression/./ExpressionTests/DiagnosticManagerTest.AppendMessageSubsequentDiags (1270 of 1860) PASS: lldb-api :: lang/c/const_variables/TestConstVariables.py (1271 of 1860) PASS: lldb-unit :: Utility/./UtilityTests/StringExtractorTest.GetHexU8_Underflow2 (1272 of 1860) PASS: lldb-unit :: Target/./TargetTests/ExecutionContextTest.GetByteOrderTarget (1273 of 1860) PASS: lldb-api :: functionalities/exec/TestExec.py (1274 of 1860) PASS: lldb-unit :: Utility/./UtilityTests/ArgsTest.ReplaceArgumentAtIndexLonger (1275 of 1860) PASS: lldb-shell :: SymbolFile/Breakpad/line-table-discontinuous-file-ids.test (1276 of 1860) PASS: lldb-api :: sanity/TestModuleCacheSanity.py (1277 of 1860) PASS: lldb-unit :: ScriptInterpreter/Python/./ScriptInterpreterPythonTests/PythonDataObjectsTest.TestModuleNameResolutionNoDot (1278 of 1860) PASS: lldb-unit :: Utility/./UtilityTests/StringListTest.ShiftCString (1279 of 1860) PASS: lldb-api :: python_api/watchpoint/watchlocation/TestTargetWatchAddress.py (1280 of 1860) PASS: lldb-unit :: SymbolFile/NativePDB/./SymbolFileNativePDBTests/PDBFPOProgramToDWARFExpressionTests.InvalidOpBinary (1281 of 1860) PASS: lldb-unit :: Host/./HostTests/HostInfoTest.GetAugmentedArchSpec (1282 of 1860) PASS: lldb-unit :: Expression/./ExpressionTests/DWARFExpression.DW_OP_pick (1283 of 1860) PASS: lldb-api :: commands/expression/completion-in-lambda-and-unnamed-class/TestCompletionInLambdaAndUnnamedClass.py (1284 of 1860) PASS: lldb-api :: commands/expression/import-std-module/basic/TestImportStdModule.py (1285 of 1860) PASS: lldb-api :: lang/cpp/const_this/TestConstThis.py (1286 of 1860) PASS: lldb-api :: lang/objc/foundation/TestObjCMethodsNSArray.py (1287 of 1860) UNSUPPORTED: lldb-shell :: Register/x86-64-gp-write.test (1288 of 1860) XFAIL: lldb-shell :: Unwind/prefer-debug-over-eh-frame.test (1289 of 1860) PASS: lldb-shell :: Breakpoint/implicit_const_form_support.test (1290 of 1860) PASS: lldb-shell :: Driver/TestCommands.test (1291 of 1860) PASS: lldb-api :: functionalities/data-formatter/data-formatter-synth/TestDataFormatterSynth.py (1292 of 1860) PASS: lldb-unit :: Process/gdb-remote/./ProcessGdbRemoteTests/GDBRemoteCommunicationClientTest.SendStopTracePacket (1293 of 1860) PASS: lldb-unit :: Utility/./UtilityTests/ScalarTest.SetValueFromCString (1294 of 1860) PASS: lldb-unit :: Expression/./ExpressionTests/DiagnosticManagerTest.GetStringMultipleDiags (1295 of 1860) PASS: lldb-api :: lang/c/tls_globals/TestTlsGlobals.py (1296 of 1860) PASS: lldb-api :: lang/cpp/offsetof/TestOffsetofCpp.py (1297 of 1860) PASS: lldb-api :: lang/cpp/type_lookup/TestCppTypeLookup.py (1298 of 1860) PASS: lldb-api :: lang/objc/ptr_refs/TestPtrRefsObjC.py (1299 of 1860) PASS: lldb-api :: commands/expression/fixits/TestFixIts.py (1300 of 1860) PASS: lldb-unit :: UnwindAssembly/x86/./UnwindAssemblyx86Tests/Testx86AssemblyInspectionEngine.TestAddRSP (1301 of 1860) PASS: lldb-api :: functionalities/data-formatter/typedef_array/TestTypedefArray.py (1302 of 1860) PASS: lldb-api :: commands/expression/xvalue/TestXValuePrinting.py (1303 of 1860) PASS: lldb-api :: functionalities/data-formatter/data-formatter-stl/libcxx/bitset/TestDataFormatterLibcxxBitset.py (1304 of 1860) PASS: lldb-api :: tools/lldb-server/commandline/TestStubSetSID.py (1305 of 1860) PASS: lldb-unit :: Utility/./UtilityTests/StreamTest.PutSLEB128 (1306 of 1860) PASS: lldb-shell :: SymbolFile/Breakpad/symtab-macho.test (1307 of 1860) PASS: lldb-api :: commands/expression/import_builtin_fileid/TestImportBuiltinFileID.py (1308 of 1860) PASS: lldb-api :: functionalities/gdb_remote_client/TestGDBRemoteClient.py (1309 of 1860) PASS: lldb-api :: commands/help/TestHelp.py (1310 of 1860) PASS: lldb-unit :: Utility/./UtilityTests/StringExtractorTest.DecodeHexU8_Underflow (1311 of 1860) PASS: lldb-api :: lang/objc/objc-static-method/TestObjCStaticMethod.py (1312 of 1860) UNSUPPORTED: lldb-api :: commands/watchpoints/variable_out_of_scope/TestWatchedVarHitWhenInScope.py (1313 of 1860) PASS: lldb-api :: functionalities/memory/read/TestMemoryRead.py (1314 of 1860) UNSUPPORTED: lldb-api :: functionalities/darwin_log/filter/exact_match/activity/TestDarwinLogFilterMatchActivity.py (1315 of 1860) PASS: lldb-unit :: Host/./HostTests/MainLoopTest.DetectsEOF (1316 of 1860) PASS: lldb-api :: lang/c/offsetof/TestOffsetof.py (1317 of 1860) PASS: lldb-unit :: Utility/./UtilityTests/StringListTest.InsertStringAtIndexEnd (1318 of 1860) PASS: lldb-api :: functionalities/gdb_remote_client/TestThreadSelectionBug.py (1319 of 1860) PASS: lldb-unit :: Utility/./UtilityTests/StringListTest.InsertStringAtIndexStdString (1320 of 1860) PASS: lldb-shell :: SymbolFile/NativePDB/break-by-line.cpp (1321 of 1860) PASS: lldb-api :: functionalities/mtc/simple/TestMTCSimple.py (1322 of 1860) PASS: lldb-unit :: Process/gdb-remote/./ProcessGdbRemoteTests/GDBRemoteCommunicationTest.ReadPacket_checksum (1323 of 1860) PASS: lldb-shell :: Driver/TestConvenienceVariables.test (1324 of 1860) PASS: lldb-api :: tools/lldb-server/TestGdbRemoteHostInfo.py (1325 of 1860) PASS: lldb-api :: lang/objc/conflicting-definition/TestConflictingDefinition.py (1326 of 1860) PASS: lldb-unit :: Language/Highlighting/./HighlighterTests/HighlighterTest.DefaultHighlighter (1327 of 1860) PASS: lldb-unit :: Utility/./UtilityTests/ArgsTest.TestSingleArg (1328 of 1860) PASS: lldb-unit :: Expression/./ExpressionTests/DiagnosticManagerTest.PutString (1329 of 1860) PASS: lldb-api :: python_api/module_section/TestModuleAndSection.py (1330 of 1860) PASS: lldb-api :: lang/objc/objc-ivar-offsets/TestObjCIvarOffsets.py (1331 of 1860) PASS: lldb-shell :: Settings/TestDisassemblyFormat.test (1332 of 1860) PASS: lldb-api :: functionalities/data-formatter/varscript_formatting/TestDataFormatterVarScriptFormatting.py (1333 of 1860) PASS: lldb-unit :: Utility/./UtilityTests/ArchSpecTest.OperatorBool (1334 of 1860) PASS: lldb-unit :: ObjectFile/ELF/./ObjectFileELFTests/ObjectFileELFTest.GetSymtab_NoSymEntryPointArmAddressClass (1335 of 1860) PASS: lldb-api :: types/TestLongTypes.py (1336 of 1860) PASS: lldb-api :: functionalities/data-formatter/data-formatter-stl/libcxx/vector/TestDataFormatterLibcxxVector.py (1337 of 1860) PASS: lldb-api :: tools/lldb-vscode/launch/TestVSCode_launch.py (1338 of 1860) PASS: lldb-api :: lang/c/find_struct_type/TestFindStructTypes.py (1339 of 1860) PASS: lldb-unit :: Utility/./UtilityTests/SerializationRountripTest.SerializeDeserializeObjectReference (1340 of 1860) PASS: lldb-api :: lang/objc/foundation/TestObjectDescriptionAPI.py (1341 of 1860) PASS: lldb-api :: lang/objcxx/class-name-clash/TestNameClash.py (1342 of 1860) PASS: lldb-unit :: Host/./HostTests/NativeProcessProtocolTest.ReadCStringFromMemory_MaxSize (1343 of 1860) PASS: lldb-unit :: Utility/./UtilityTests/SerializationRountripTest.SerializeDeserializeObjectPointer (1344 of 1860) PASS: lldb-api :: functionalities/ptr_refs/TestPtrRefs.py (1345 of 1860) UNSUPPORTED: lldb-shell :: SymbolFile/NativePDB/local-variables.cpp (1346 of 1860) PASS: lldb-unit :: Utility/./UtilityTests/StringExtractorTest.GetNameColonValueNoColon (1347 of 1860) PASS: lldb-unit :: Utility/./UtilityTests/StreamTest.ShiftOperatorStrings (1348 of 1860) UNSUPPORTED: lldb-api :: functionalities/thread/concurrent_events/TestConcurrentManySignals.py (1349 of 1860) PASS: lldb-unit :: ScriptInterpreter/Python/./ScriptInterpreterPythonTests/PythonDataObjectsTest.TestPythonTupleInitializerList2 (1350 of 1860) PASS: lldb-api :: functionalities/data-formatter/data-formatter-ptr-to-array/TestPtrToArrayFormatting.py (1351 of 1860) PASS: lldb-unit :: UnwindAssembly/x86/./UnwindAssemblyx86Tests/Testx86AssemblyInspectionEngine.TestPushEDI (1352 of 1860) PASS: lldb-unit :: Utility/./UtilityTests/StreamTest.PutHex32ByteOrderLittle (1353 of 1860) PASS: lldb-api :: python_api/thread/TestThreadAPI.py (1354 of 1860) PASS: lldb-unit :: Utility/./UtilityTests/ReproducerTest.SetCapture (1355 of 1860) PASS: lldb-api :: lang/cpp/template/TestTemplateArgs.py (1356 of 1860) PASS: lldb-unit :: Utility/./UtilityTests/StringListTest.LongestCommonPrefixDuplicateElement (1357 of 1860) PASS: lldb-unit :: Core/./LLDBCoreTests/MangledTest.ResultForValidName (1358 of 1860) PASS: lldb-unit :: Utility/./UtilityTests/StringListTest.CopyListSingle (1359 of 1860) PASS: lldb-api :: lang/c/forward/TestForwardDeclaration.py (1360 of 1860) PASS: lldb-api :: macosx/indirect_symbol/TestIndirectSymbols.py (1361 of 1860) PASS: lldb-unit :: Utility/./UtilityTests/StringListTest.CopyListEmpty (1362 of 1860) PASS: lldb-shell :: SymbolFile/DWARF/find-basic-type.cpp (1363 of 1860) PASS: lldb-shell :: Minidump/breakpad-symbols.test (1364 of 1860) PASS: lldb-shell :: ObjectFile/PECOFF/sections-names.yaml (1365 of 1860) PASS: lldb-shell :: Breakpoint/split-dwarf5-debug-stroffsets.test (1366 of 1860) PASS: lldb-api :: functionalities/data-formatter/data-formatter-stl/libcxx/tuple/TestDataFormatterLibcxxTuple.py (1367 of 1860) PASS: lldb-api :: commands/command/nested_alias/TestNestedAlias.py (1368 of 1860) PASS: lldb-api :: functionalities/load_unload/TestLoadUnload.py (1369 of 1860) UNSUPPORTED: lldb-api :: lang/c/typedef/Testtypedef.py (1370 of 1860) PASS: lldb-unit :: Utility/./UtilityTests/AnsiTerminal.AtStart (1371 of 1860) PASS: lldb-unit :: Process/minidump/./LLDBMinidumpTests/MinidumpParserTest.GetFilteredModuleList (1372 of 1860) PASS: lldb-api :: commands/register/register/register_command/TestRegisters.py (1373 of 1860) PASS: lldb-shell :: ObjectFile/ELF/PT_LOAD-overlap.yaml (1374 of 1860) PASS: lldb-api :: terminal/TestSTTYBeforeAndAfter.py (1375 of 1860) PASS: lldb-shell :: SymbolFile/DWARF/dir-separator-no-comp-dir.s (1376 of 1860) PASS: lldb-api :: commands/expression/po_verbosity/TestPoVerbosity.py (1377 of 1860) PASS: lldb-unit :: Utility/./UtilityTests/StringListTest.AppendStringCString (1378 of 1860) PASS: lldb-api :: lang/objcxx/objcxx-ivar-vector/TestIvarVector.py (1379 of 1860) PASS: lldb-shell :: SymbolFile/DWARF/find-basic-namespace.cpp (1380 of 1860) PASS: lldb-api :: lang/objc/objc-ivar-protocols/TestIvarProtocols.py (1381 of 1860) PASS: lldb-api :: terminal/TestEditline.py (1382 of 1860) PASS: lldb-api :: commands/expression/call-function/TestCallStdStringFunction.py (1383 of 1860) PASS: lldb-api :: functionalities/tail_call_frames/thread_step_out_message/TestArtificialFrameStepOutMessage.py (1384 of 1860) PASS: lldb-unit :: ObjectFile/Breakpad/./ObjectFileBreakpadTests/PublicRecord.parse (1385 of 1860) PASS: lldb-api :: functionalities/data-formatter/vector-types/TestVectorTypesFormatting.py (1386 of 1860) PASS: lldb-shell :: Minidump/Windows/broken-unwind.test (1387 of 1860) PASS: lldb-unit :: ScriptInterpreter/Python/./ScriptInterpreterPythonTests/PythonDataObjectsTest.TestExceptions (1388 of 1860) PASS: lldb-api :: functionalities/multiword-commands/TestMultiWordCommands.py (1389 of 1860) PASS: lldb-shell :: ObjectFile/ELF/build-id-case.yaml (1390 of 1860) PASS: lldb-api :: python_api/lldbutil/process/TestPrintStackTraces.py (1391 of 1860) PASS: lldb-unit :: Utility/./UtilityTests/CompletionRequest.TestCompletionOwnership (1392 of 1860) PASS: lldb-unit :: Utility/./UtilityTests/ArgsTest.EscapeLLDBCommandArgument (1393 of 1860) PASS: lldb-shell :: Reproducer/Functionalities/TestExpressionEvaluation.test (1394 of 1860) PASS: lldb-api :: functionalities/thread/thread_exit/TestThreadExit.py (1395 of 1860) PASS: lldb-shell :: SymbolFile/Breakpad/unwind-via-raSearch.test (1396 of 1860) PASS: lldb-unit :: Utility/./UtilityTests/ArgsTest.ReplaceArgumentAtIndexShort (1397 of 1860) PASS: lldb-unit :: Utility/./UtilityTests/StringLexerTest.NextIf (1398 of 1860) PASS: lldb-api :: api/log/TestAPILog.py (1399 of 1860) PASS: lldb-api :: commands/watchpoints/watchpoint_on_vectors/TestValueOfVectorVariable.py (1400 of 1860) PASS: lldb-api :: functionalities/postmortem/minidump/TestMiniDump.py (1401 of 1860) PASS: lldb-api :: lang/objc/unicode-string/TestUnicodeString.py (1402 of 1860) PASS: lldb-unit :: Process/gdb-remote/./ProcessGdbRemoteTests/GDBRemoteCommunicationServerTest.SendErrorResponse_StringError (1403 of 1860) PASS: lldb-unit :: Utility/./UtilityTests/RangeTest.ContainsEndInclusiveInvalid (1404 of 1860) PASS: lldb-api :: commands/source/info/TestSourceInfo.py (1405 of 1860) PASS: lldb-unit :: Utility/./UtilityTests/OptionsWithRawTest.LeadingSpaceArgs (1406 of 1860) PASS: lldb-unit :: Utility/./UtilityTests/StringListTest.InsertStringAtIndexStart (1407 of 1860) PASS: lldb-unit :: Host/./HostTests/TaskPoolTest.AddTask (1408 of 1860) UNSUPPORTED: lldb-api :: functionalities/data-formatter/data-formatter-stl/libstdcpp/string/TestDataFormatterStdString.py (1409 of 1860) UNSUPPORTED: lldb-api :: functionalities/data-formatter/data-formatter-stl/libstdcpp/unique_ptr/TestDataFormatterStdUniquePtr.py (1410 of 1860) PASS: lldb-unit :: Utility/./UtilityTests/FileSpecTest.AppendPathComponent (1411 of 1860) PASS: lldb-api :: commands/frame/var-scope/TestFrameVariableScope.py (1412 of 1860) PASS: lldb-unit :: Utility/./UtilityTests/AnsiTerminal.Incomplete (1413 of 1860) PASS: lldb-api :: functionalities/thread/concurrent_events/TestConcurrentDelayWatchBreak.py (1414 of 1860) PASS: lldb-shell :: SymbolFile/DWARF/parallel-indexing-stress.s (1415 of 1860) PASS: lldb-unit :: Utility/./UtilityTests/RegularExpression.Match (1416 of 1860) PASS: lldb-unit :: Utility/./UtilityTests/StructuredDataTest.ParseJSONFromFile (1417 of 1860) PASS: lldb-api :: functionalities/data-formatter/data-formatter-caching/TestDataFormatterCaching.py (1418 of 1860) PASS: lldb-api :: functionalities/set-data/TestSetData.py (1419 of 1860) PASS: lldb-unit :: Utility/./UtilityTests/BinaryStreamTest.PutULEB128NineBytes (1420 of 1860) PASS: lldb-api :: functionalities/data-formatter/data-formatter-stl/libcxx/unordered/TestDataFormatterUnordered.py (1421 of 1860) PASS: lldb-unit :: Utility/./UtilityTests/UriParserTest.SchemeHostSeparator3 (1422 of 1860) PASS: lldb-unit :: Utility/./UtilityTests/VMRange.ContainsAddr (1423 of 1860) PASS: lldb-api :: iohandler/unicode/TestUnicode.py (1424 of 1860) PASS: lldb-api :: lang/cpp/function_refs/TestFunctionRefs.py (1425 of 1860) PASS: lldb-shell :: Settings/TestFrameFormatMangling.test (1426 of 1860) PASS: lldb-api :: functionalities/data-formatter/nssetsynth/TestNSSetSynthetic.py (1427 of 1860) UNSUPPORTED: lldb-api :: functionalities/darwin_log/filter/exact_match/activity-chain/TestDarwinLogFilterMatchActivityChain.py (1428 of 1860) PASS: lldb-api :: functionalities/data-formatter/data-formatter-stl/libcxx/atomic/TestLibCxxAtomic.py (1429 of 1860) PASS: lldb-api :: commands/expression/static-initializers/TestStaticInitializers.py (1430 of 1860) PASS: lldb-api :: functionalities/avoids-fd-leak/TestFdLeak.py (1431 of 1860) PASS: lldb-unit :: Language/Highlighting/./HighlighterTests/HighlighterTest.ClangCursorPosBeforeOtherToken (1432 of 1860) PASS: lldb-api :: functionalities/data-formatter/data-formatter-script/TestDataFormatterScript.py (1433 of 1860) PASS: lldb-unit :: Utility/./UtilityTests/ArgsTest.GetQuotedCommandString (1434 of 1860) PASS: lldb-unit :: Expression/./ExpressionTests/CppModuleConfigurationTest.Sysroot (1435 of 1860) PASS: lldb-unit :: ObjectFile/ELF/./ObjectFileELFTests/ObjectFileELFTest.GetModuleSpecifications_EarlySectionHeaders (1436 of 1860) PASS: lldb-api :: functionalities/data-formatter/user-format-vs-summary/TestUserFormatVsSummary.py (1437 of 1860) PASS: lldb-shell :: ObjectFile/ELF/PT_LOAD-overlap-PT_INTERP.yaml (1438 of 1860) PASS: lldb-unit :: UnwindAssembly/x86/./UnwindAssemblyx86Tests/Testx86AssemblyInspectionEngine.TestSimplex86_64Augmented (1439 of 1860) PASS: lldb-shell :: Minidump/dump-all.test (1440 of 1860) PASS: lldb-unit :: Utility/./UtilityTests/StreamTeeTest.CopyConstructor (1441 of 1860) PASS: lldb-api :: functionalities/inferior-assert/TestInferiorAssert.py (1442 of 1860) PASS: lldb-unit :: Utility/./UtilityTests/StringExtractorTest.GetHexBytes_FullString (1443 of 1860) PASS: lldb-unit :: debugserver/./debugserverTests/RNBSocket.LoopBackConnectIPv4 (1444 of 1860) PASS: lldb-unit :: Utility/./UtilityTests/RecordReplayTest.InstrumentedBar (1445 of 1860) PASS: lldb-unit :: Process/minidump/./LLDBMinidumpTests/MinidumpParserTest.GetPidWow64 (1446 of 1860) UNSUPPORTED: lldb-api :: commands/expression/completion-crash1/TestCompletionCrash1.py (1447 of 1860) PASS: lldb-unit :: Host/./HostTests/NativeProcessProtocolTest.ReadMemoryWithoutTrap (1448 of 1860) PASS: lldb-unit :: Host/./HostTests/Host.WaitStatusFormat (1449 of 1860) PASS: lldb-api :: functionalities/breakpoint/breakpoint_command/TestBreakpointCommandsFromPython.py (1450 of 1860) PASS: lldb-unit :: Language/Highlighting/./HighlighterTests/HighlighterTest.ClangCursorPosAfterOtherToken (1451 of 1860) PASS: lldb-unit :: Expression/./ExpressionTests/DiagnosticManagerTest.GetStringNoDiags (1452 of 1860) PASS: lldb-unit :: ScriptInterpreter/Python/./ScriptInterpreterPythonTests/PythonDataObjectsTest.TestCallable (1453 of 1860) PASS: lldb-api :: functionalities/data-formatter/data-formatter-named-summaries/TestDataFormatterNamedSummaries.py (1454 of 1860) PASS: lldb-api :: functionalities/paths/TestPaths.py (1455 of 1860) PASS: lldb-shell :: Minidump/fb-dump.test (1456 of 1860) PASS: lldb-api :: tools/lldb-server/TestGdbRemoteThreadsInStopReply.py (1457 of 1860) PASS: lldb-api :: functionalities/postmortem/elf-core/TestLinuxCore.py (1458 of 1860) PASS: lldb-api :: commands/gui/invalid-args/TestInvalidArgsGui.py (1459 of 1860) UNSUPPORTED: lldb-api :: benchmarks/continue/TestBenchmarkContinue.py (1460 of 1860) PASS: lldb-shell :: BuildScript/modes.test (1461 of 1860) PASS: lldb-api :: lang/objc/objc-new-syntax/TestObjCNewSyntaxDictionary.py (1462 of 1860) PASS: lldb-api :: functionalities/fat_archives/TestFatArchives.py (1463 of 1860) PASS: lldb-unit :: ScriptInterpreter/Python/./ScriptInterpreterPythonTests/PythonDataObjectsTest.TestPythonTupleSize (1464 of 1860) UNSUPPORTED: lldb-api :: benchmarks/stepping/TestSteppingSpeed.py (1465 of 1860) PASS: lldb-api :: api/multithreaded/TestMultithreaded.py (1466 of 1860) PASS: lldb-shell :: Settings/TestEchoCommands.test (1467 of 1860) XFAIL: lldb-shell :: Register/x86-mm-xmm-write.test (1468 of 1860) PASS: lldb-api :: functionalities/postmortem/minidump-new/TestMiniDumpUUID.py (1469 of 1860) PASS: lldb-unit :: Utility/./UtilityTests/ArgsTest.TestAppendArg (1470 of 1860) PASS: lldb-api :: functionalities/data-formatter/data-formatter-objc/TestDataFormatterObjCNSData.py (1471 of 1860) PASS: lldb-api :: python_api/frame/inlines/TestInlinedFrame.py (1472 of 1860) PASS: lldb-unit :: Utility/./UtilityTests/ArchSpecTest.Compatibility (1473 of 1860) PASS: lldb-unit :: Language/Highlighting/./HighlighterTests/HighlighterTest.ClangPreserveNewLine (1474 of 1860) PASS: lldb-api :: functionalities/postmortem/minidump-new/TestMiniDumpNew.py (1475 of 1860) PASS: lldb-unit :: Interpreter/./InterpreterTests/CompletionTest.FileCompletionAbsolute (1476 of 1860) PASS: lldb-shell :: ObjectFile/ELF/PT_LOAD-overlap-PT_TLS.yaml (1477 of 1860) PASS: lldb-shell :: SymbolFile/DWARF/clang-ast-from-dwarf-unamed-and-anon-structs.cpp (1478 of 1860) PASS: lldb-unit :: Host/./HostTests/FileSystemTest.GetPermissions (1479 of 1860) PASS: lldb-api :: commands/expression/ignore-artificial-constructors/TestIgnoreArtificialConstructors.py (1480 of 1860) UNSUPPORTED: lldb-api :: lang/objc/bitfield_ivars/TestBitfieldIvars.py (1481 of 1860) PASS: lldb-api :: functionalities/data-formatter/data-formatter-synthval/TestDataFormatterSynthVal.py (1482 of 1860) PASS: lldb-api :: lang/objc/objc++/TestObjCXX.py (1483 of 1860) PASS: lldb-shell :: ObjectFile/PECOFF/section-types.yaml (1484 of 1860) PASS: lldb-unit :: Utility/./UtilityTests/LogChannelTest.List (1485 of 1860) PASS: lldb-api :: functionalities/tsan/multiple/TestTsanMultiple.py (1486 of 1860) PASS: lldb-unit :: ScriptInterpreter/Python/./ScriptInterpreterPythonTests/PythonDataObjectsTest.TestPythonIntegerToStr (1487 of 1860) PASS: lldb-unit :: UnwindAssembly/x86/./UnwindAssemblyx86Tests/Testx86AssemblyInspectionEngine.TestPopESI (1488 of 1860) PASS: lldb-unit :: Utility/./UtilityTests/OptionsWithRawTest.EmptyArgsOnlySuffix (1489 of 1860) PASS: lldb-unit :: Utility/./UtilityTests/Flags.Test (1490 of 1860) PASS: lldb-api :: lang/cpp/global_operators/TestCppGlobalOperators.py (1491 of 1860) PASS: lldb-shell :: Unwind/eh-frame-dwarf-unwind.test (1492 of 1860) PASS: lldb-shell :: SymbolFile/DWARF/debug_rnglists.s (1493 of 1860) PASS: lldb-api :: types/TestShortTypeExpr.py (1494 of 1860) UNSUPPORTED: lldb-api :: benchmarks/frame_variable/TestFrameVariableResponse.py (1495 of 1860) PASS: lldb-api :: tools/lldb-vscode/stackTrace/TestVSCode_stackTrace.py (1496 of 1860) PASS: lldb-unit :: Utility/./UtilityTests/ArgsTest.TestArgv (1497 of 1860) PASS: lldb-unit :: Utility/./UtilityTests/StreamTest.PutHex32ByteOrderBig (1498 of 1860) PASS: lldb-api :: commands/expression/test/TestExprs.py (1499 of 1860) PASS: lldb-shell :: Reproducer/Functionalities/TestImageList.test (1500 of 1860) PASS: lldb-unit :: UnwindAssembly/x86/./UnwindAssemblyx86Tests/Testx86AssemblyInspectionEngine.TestPopRBP (1501 of 1860) PASS: lldb-shell :: Minidump/Windows/arm-fp-unwind.test (1502 of 1860) PASS: lldb-unit :: Disassembler/./DisassemblerTests/TestArmv7Disassembly.TestCortexFPDisass (1503 of 1860) PASS: lldb-unit :: ObjectFile/Breakpad/./ObjectFileBreakpadTests/FuncRecord.parse (1504 of 1860) PASS: lldb-api :: functionalities/thread/concurrent_events/TestConcurrentTwoBreakpointsOneDelaySignal.py (1505 of 1860) PASS: lldb-unit :: Utility/./UtilityTests/BinaryStreamTest.PutSLEB128ThreeBytes (1506 of 1860) UNSUPPORTED: lldb-api :: functionalities/darwin_log/filter/exact_match/category/TestDarwinLogFilterMatchCategory.py (1507 of 1860) PASS: lldb-api :: functionalities/data-formatter/ptr_ref_typedef/TestPtrRef2Typedef.py (1508 of 1860) PASS: lldb-unit :: SymbolFile/DWARF/./SymbolFileDWARFTests/SymbolFileDWARFTests.TestAbbrevOutOfOrder (1509 of 1860) PASS: lldb-unit :: Utility/./UtilityTests/StringListTest.JoinSingle (1510 of 1860) PASS: lldb-api :: commands/target/create-deps/TestTargetCreateDeps.py (1511 of 1860) PASS: lldb-unit :: Process/minidump/./LLDBMinidumpTests/MinidumpParserTest.MinidumpModuleOrder (1512 of 1860) PASS: lldb-unit :: Language/Highlighting/./HighlighterTests/HighlighterTest.ClangEmptyInput (1513 of 1860) UNSUPPORTED: lldb-shell :: Register/x86-64-xmm16-read.test (1514 of 1860) PASS: lldb-unit :: Utility/./UtilityTests/RecordReplayTest.InstrumentedBarRef (1515 of 1860) PASS: lldb-api :: functionalities/data-formatter/data-formatter-stl/libcxx/initializerlist/TestInitializerList.py (1516 of 1860) PASS: lldb-api :: types/TestRecursiveTypes.py (1517 of 1860) PASS: lldb-unit :: Utility/./UtilityTests/DataExtractorTest.PeekData (1518 of 1860) PASS: lldb-unit :: Utility/./UtilityTests/StreamTest.PutMaxHex64ByteOrderLittle (1519 of 1860) PASS: lldb-unit :: Utility/./UtilityTests/RangeTest.DefaultConstructor (1520 of 1860) PASS: lldb-unit :: Symbol/./SymbolTests/PostfixExpression.ToDWARF (1521 of 1860) PASS: lldb-unit :: Utility/./UtilityTests/LogTest.Register (1522 of 1860) PASS: lldb-unit :: ScriptInterpreter/Python/./ScriptInterpreterPythonTests/PythonDataObjectsTest.TestPythonStringToStr (1523 of 1860) PASS: lldb-api :: functionalities/abbreviation/TestCommonShortSpellings.py (1524 of 1860) PASS: lldb-unit :: Utility/./UtilityTests/ArgsTest.AppendArguments (1525 of 1860) PASS: lldb-api :: python_api/sbstructureddata/TestStructuredDataAPI.py (1526 of 1860) PASS: lldb-unit :: Expression/./ExpressionTests/CppModuleConfigurationTest.MissingUsrInclude (1527 of 1860) PASS: lldb-api :: python_api/process/io/TestProcessIO.py (1528 of 1860) UNSUPPORTED: lldb-api :: functionalities/darwin_log/filter/regex/activity/TestDarwinLogFilterRegexActivity.py (1529 of 1860) PASS: lldb-unit :: UnwindAssembly/x86/./UnwindAssemblyx86Tests/Testx86AssemblyInspectionEngine.TestStackRealign8BitDisp_i386 (1530 of 1860) UNSUPPORTED: lldb-shell :: SymbolFile/PDB/class-layout.test (1531 of 1860) PASS: lldb-api :: functionalities/archives/TestBSDArchives.py (1532 of 1860) PASS: lldb-api :: commands/expression/save_jit_objects/TestSaveJITObjects.py (1533 of 1860) PASS: lldb-api :: tools/lldb-server/inferior-crash/TestGdbRemoteAbort.py (1534 of 1860) PASS: lldb-unit :: Utility/./UtilityTests/Predicate.WaitForValueEqualTo (1535 of 1860) UNSUPPORTED: lldb-api :: arm/breakpoint-it/TestBreakpointIt.py (1536 of 1860) PASS: lldb-api :: functionalities/gdb_remote_client/TestRestartBug.py (1537 of 1860) PASS: lldb-api :: functionalities/data-formatter/data-formatter-disabling/TestDataFormatterDisabling.py (1538 of 1860) PASS: lldb-unit :: Utility/./UtilityTests/RangeTest.ClearWithStarAddress (1539 of 1860) PASS: lldb-unit :: Process/minidump/./LLDBMinidumpTests/RegisterContextMinidump.ConvertMinidumpContext_x86_64 (1540 of 1860) PASS: lldb-api :: functionalities/ubsan/basic/TestUbsanBasic.py (1541 of 1860) PASS: lldb-api :: functionalities/thread/create_after_attach/TestCreateAfterAttach.py (1542 of 1860) PASS: lldb-api :: functionalities/data-formatter/format-propagation/TestFormatPropagation.py (1543 of 1860) UNSUPPORTED: lldb-api :: functionalities/darwin_log/basic/TestDarwinLogBasic.py (1544 of 1860) PASS: lldb-shell :: Quit/TestQuitExitCodeHexA.test (1545 of 1860) PASS: lldb-api :: sample_test/TestSampleInlineTest.py (1546 of 1860) UNSUPPORTED: lldb-api :: functionalities/thread/break_after_join/TestBreakAfterJoin.py (1547 of 1860) PASS: lldb-unit :: UnwindAssembly/x86/./UnwindAssemblyx86Tests/Testx86AssemblyInspectionEngine.TestPopRBPWithREX (1548 of 1860) XFAIL: lldb-shell :: Register/x86-64-write.test (1549 of 1860) PASS: lldb-api :: lang/cpp/accelerator-table/TestCPPAccelerator.py (1550 of 1860) PASS: lldb-unit :: Process/minidump/./LLDBMinidumpTests/MinidumpParserTest.FindMemoryRange (1551 of 1860) PASS: lldb-api :: functionalities/thread/step_until/TestStepUntil.py (1552 of 1860) PASS: lldb-api :: functionalities/inline-stepping/TestInlineStepping.py (1553 of 1860) PASS: lldb-shell :: ObjectFile/PECOFF/basic-info.yaml (1554 of 1860) PASS: lldb-api :: functionalities/thread/exit_during_break/TestExitDuringBreak.py (1555 of 1860) UNSUPPORTED: lldb-shell :: SymbolFile/PDB/pointers.test (1556 of 1860) PASS: lldb-unit :: UnwindAssembly/x86/./UnwindAssemblyx86Tests/Testx86AssemblyInspectionEngine.TestSpillRegToStackViaMOVi386 (1557 of 1860) PASS: lldb-api :: functionalities/data-formatter/data-formatter-stl/libcxx/optional/TestDataFormatterLibcxxOptional.py (1558 of 1860) PASS: lldb-api :: functionalities/thread/concurrent_events/TestConcurrentCrashWithWatchpointBreakpointSignal.py (1559 of 1860) PASS: lldb-api :: lang/c/struct_types/TestStructTypes.py (1560 of 1860) PASS: lldb-api :: functionalities/pre_run_dylibs/TestPreRunDylibs.py (1561 of 1860) PASS: lldb-unit :: Target/./TargetTests/ExecutionContextTest.GetByteOrderProcess (1562 of 1860) PASS: lldb-api :: commands/frame/recognizer/TestFrameRecognizer.py (1563 of 1860) PASS: lldb-api :: commands/expression/persistent_types/TestPersistentTypes.py (1564 of 1860) PASS: lldb-api :: lang/c/vla/TestVLA.py (1565 of 1860) PASS: lldb-unit :: Utility/./UtilityTests/RangeTest.ContainsRange (1566 of 1860) UNSUPPORTED: lldb-api :: benchmarks/expression/TestRepeatedExprs.py (1567 of 1860) PASS: lldb-shell :: SymbolFile/DWARF/debug_loc.s (1568 of 1860) PASS: lldb-api :: lang/objc/hidden-ivars/TestHiddenIvars.py (1569 of 1860) PASS: lldb-shell :: ObjectFile/PECOFF/symbol.yaml (1570 of 1860) PASS: lldb-api :: lang/cpp/thread_local/TestThreadLocal.py (1571 of 1860) PASS: lldb-unit :: Host/./HostTests/SocketTest.TCPGetAddress (1572 of 1860) PASS: lldb-unit :: Utility/./UtilityTests/StreamTest.AddressEmptyPrefix (1573 of 1860) PASS: lldb-unit :: Utility/./UtilityTests/LogChannelEnabledTest.LLDB_LOG_ERROR (1574 of 1860) UNSUPPORTED: lldb-api :: tools/lldb-server/signal-filtering/TestGdbRemote_QPassSignals.py (1575 of 1860) PASS: lldb-unit :: Utility/./UtilityTests/Flags.AnySet (1576 of 1860) PASS: lldb-api :: lang/objcxx/hide-runtime-values/TestObjCXXHideRuntimeValues.py (1577 of 1860) PASS: lldb-api :: functionalities/data-formatter/data-formatter-globals/TestDataFormatterGlobals.py (1578 of 1860) PASS: lldb-api :: lang/objc/foundation/TestObjCMethods2.py (1579 of 1860) PASS: lldb-unit :: SymbolFile/NativePDB/./SymbolFileNativePDBTests/PDBFPOProgramToDWARFExpressionTests.InvalidAssignmentMultiple (1580 of 1860) PASS: lldb-unit :: Utility/./UtilityTests/UriParserTest.BracketedHostname (1581 of 1860) PASS: lldb-unit :: Symbol/./SymbolTests/LineEntryTest.GetSameLineContiguousAddressRangeNoInlines (1582 of 1860) PASS: lldb-api :: functionalities/breakpoint/breakpoint_names/TestBreakpointNames.py (1583 of 1860) PASS: lldb-api :: lang/cpp/class-template-parameter-pack/TestClassTemplateParameterPack.py (1584 of 1860) PASS: lldb-unit :: Utility/./UtilityTests/StateTest.Formatv (1585 of 1860) PASS: lldb-unit :: Signals/./SignalsTests/UnixSignalsTest.Iteration (1586 of 1860) PASS: lldb-shell :: Commands/CommandScriptImmediateOutput/CommandScriptImmediateOutputFile.test (1587 of 1860) UNSUPPORTED: lldb-api :: api/multiple-debuggers/TestMultipleDebuggers.py (1588 of 1860) PASS: lldb-api :: lang/objc/modules-app-update/TestClangModulesAppUpdate.py (1589 of 1860) PASS: lldb-api :: commands/expression/unwind_expression/TestUnwindExpression.py (1590 of 1860) PASS: lldb-api :: functionalities/data-formatter/data-formatter-python-synth/TestDataFormatterPythonSynth.py (1591 of 1860) PASS: lldb-api :: lang/objc/modules-hash-mismatch/TestClangModulesHashMismatch.py (1592 of 1860) PASS: lldb-api :: functionalities/tail_call_frames/disambiguate_paths_to_common_sink/TestDisambiguatePathsToCommonSink.py (1593 of 1860) PASS: lldb-unit :: Symbol/./SymbolTests/LineEntryTest.GetSameLineContiguousAddressRangeOneInline (1594 of 1860) PASS: lldb-api :: tools/lldb-server/commandline/TestStubReverseConnect.py (1595 of 1860) PASS: lldb-api :: functionalities/type_completion/TestTypeCompletion.py (1596 of 1860) UNSUPPORTED: lldb-shell :: Register/x86-ymm-read.test (1597 of 1860) PASS: lldb-api :: lang/cpp/stl/TestSTL.py (1598 of 1860) PASS: lldb-unit :: Signals/./SignalsTests/UnixSignalsTest.GetInfo (1599 of 1860) PASS: lldb-api :: arm/emulation/TestEmulations.py (1600 of 1860) PASS: lldb-shell :: SymbolFile/NativePDB/function-types-classes.cpp (1601 of 1860) UNSUPPORTED: lldb-shell :: SymbolFile/NativePDB/typedefs.cpp (1602 of 1860) PASS: lldb-unit :: Process/gdb-remote/./ProcessGdbRemoteTests/GDBRemoteClientBaseTest.SendContinueAndLateInterrupt (1603 of 1860) PASS: lldb-api :: functionalities/breakpoint/auto_continue/TestBreakpointAutoContinue.py (1604 of 1860) PASS: lldb-api :: functionalities/data-formatter/data-formatter-objc/TestDataFormatterObjCNSError.py (1605 of 1860) UNSUPPORTED: lldb-shell :: Breakpoint/case-insensitive.test (1606 of 1860) UNSUPPORTED: lldb-api :: tools/lldb-server/TestGdbRemoteAuxvSupport.py (1607 of 1860) UNSUPPORTED: lldb-api :: functionalities/darwin_log/source/info/TestDarwinLogSourceInfo.py (1608 of 1860) PASS: lldb-shell :: SymbolFile/NativePDB/ast-types.cpp (1609 of 1860) PASS: lldb-api :: lang/cpp/this/TestCPPThis.py (1610 of 1860) PASS: lldb-unit :: Utility/./UtilityTests/StringExtractorTest.GetHexBytes (1611 of 1860) PASS: lldb-unit :: Target/./TargetTests/PathMappingListTest.RemapRoot (1612 of 1860) PASS: lldb-api :: tools/lldb-server/TestGdbRemote_qThreadStopInfo.py (1613 of 1860) PASS: lldb-api :: functionalities/history/TestHistoryRecall.py (1614 of 1860) PASS: lldb-unit :: Process/minidump/./LLDBMinidumpTests/RegisterContextMinidump.CheckRegisterContextMinidump_ARM (1615 of 1860) PASS: lldb-api :: commands/command/history/TestCommandHistory.py (1616 of 1860) PASS: lldb-api :: commands/frame/diagnose/dereference-argument/TestDiagnoseDereferenceArgument.py (1617 of 1860) PASS: lldb-api :: commands/frame/diagnose/dereference-function-return/TestDiagnoseDereferenceFunctionReturn.py (1618 of 1860) PASS: lldb-shell :: Driver/TestRepl.test (1619 of 1860) PASS: lldb-api :: commands/expression/persist_objc_pointeetype/TestPersistObjCPointeeType.py (1620 of 1860) PASS: lldb-shell :: ObjectFile/ELF/aarch64-relocations.yaml (1621 of 1860) PASS: lldb-unit :: SymbolFile/DWARF/./SymbolFileDWARFTests/SymbolFileDWARFTests.TestAbbrevMissingTerminator (1622 of 1860) UNSUPPORTED: lldb-api :: android/platform/TestDefaultCacheLineSize.py (1623 of 1860) PASS: lldb-unit :: Utility/./UtilityTests/RangeTest.LessThan (1624 of 1860) PASS: lldb-api :: functionalities/thread/concurrent_events/TestConcurrentDelaySignalBreak.py (1625 of 1860) PASS: lldb-api :: functionalities/thread/concurrent_events/TestConcurrentTwoWatchpointsOneBreakpoint.py (1626 of 1860) PASS: lldb-unit :: Language/Highlighting/./HighlighterTests/HighlighterTest.Keywords (1627 of 1860) PASS: lldb-unit :: Utility/./UtilityTests/StringListTest.AppendListCStringArray (1628 of 1860) PASS: lldb-api :: functionalities/thread/num_threads/TestNumThreads.py (1629 of 1860) UNSUPPORTED: lldb-shell :: Register/x86-zmm-read.test (1630 of 1860) PASS: lldb-unit :: Utility/./UtilityTests/StringExtractorTest.GetHexU8_InvalidHex (1631 of 1860) PASS: lldb-api :: commands/expression/top-level/TestTopLevelExprs.py (1632 of 1860) PASS: lldb-api :: lang/objc/objc-optimized/TestObjcOptimized.py (1633 of 1860) UNSUPPORTED: lldb-shell :: SymbolFile/PDB/calling-conventions.test (1634 of 1860) PASS: lldb-api :: lang/cpp/chained-calls/TestCppChainedCalls.py (1635 of 1860) PASS: lldb-shell :: Minidump/memory-region-from-module.yaml (1636 of 1860) PASS: lldb-api :: python_api/rdar-12481949/Test-rdar-12481949.py (1637 of 1860) PASS: lldb-unit :: Utility/./UtilityTests/AnsiTerminal.WhiteSpace (1638 of 1860) PASS: lldb-api :: lang/c/stepping/TestThreadStepping.py (1639 of 1860) PASS: lldb-shell :: Reproducer/TestGDBRemoteRepro.test (1640 of 1860) PASS: lldb-unit :: Symbol/./SymbolTests/TestClangASTContext.TestRemoveFastQualifiers (1641 of 1860) PASS: lldb-api :: functionalities/testid/TestTestId.py (1642 of 1860) PASS: lldb-shell :: SymbolFile/DWARF/find-method-local-struct.cpp (1643 of 1860) PASS: lldb-unit :: SymbolFile/NativePDB/./SymbolFileNativePDBTests/PDBFPOProgramToDWARFExpressionTests.MissingTargetRegister (1644 of 1860) PASS: lldb-api :: lang/cpp/dynamic-value/TestCppValueCast.py (1645 of 1860) PASS: lldb-api :: functionalities/data-formatter/refpointer-recursion/TestDataFormatterRefPtrRecursion.py (1646 of 1860) PASS: lldb-shell :: Reproducer/TestReuseDirectory.test (1647 of 1860) PASS: lldb-unit :: ScriptInterpreter/Python/./ScriptInterpreterPythonTests/PythonDataObjectsTest.TestPythonInteger (1648 of 1860) PASS: lldb-unit :: Utility/./UtilityTests/ArgsTest.DoubleQuotedItem (1649 of 1860) PASS: lldb-api :: functionalities/breakpoint/cpp_exception/TestCPPExceptionBreakpoint.py (1650 of 1860) PASS: lldb-unit :: Utility/./UtilityTests/SerializationRountripTest.SerializeDeserializePodPointers (1651 of 1860) PASS: lldb-api :: commands/frame/diagnose/local-variable/TestLocalVariable.py (1652 of 1860) PASS: lldb-api :: lang/c/anonymous/TestAnonymous.py (1653 of 1860) PASS: lldb-api :: lang/cpp/nsimport/TestCppNsImport.py (1654 of 1860) PASS: lldb-unit :: Process/minidump/./LLDBMinidumpTests/MinidumpParserTest.GetLinuxProcStatus_no_stream (1655 of 1860) PASS: lldb-api :: functionalities/thread/concurrent_events/TestConcurrentTwoBreakpointThreads.py (1656 of 1860) UNSUPPORTED: lldb-shell :: ObjectFile/ELF/minidebuginfo-no-lzma.yaml (1657 of 1860) PASS: lldb-unit :: UnwindAssembly/x86/./UnwindAssemblyx86Tests/Testx86AssemblyInspectionEngine.TestPushImm (1658 of 1860) PASS: lldb-api :: functionalities/object-file/TestImageListMultiArchitecture.py (1659 of 1860) PASS: lldb-api :: commands/frame/var/TestFrameVar.py (1660 of 1860) PASS: lldb-unit :: Utility/./UtilityTests/OptionsWithRawTest.QuotedSuffix (1661 of 1860) PASS: lldb-shell :: SymbolFile/DWARF/debug-types-line-tables.s (1662 of 1860) PASS: lldb-api :: lang/cpp/inlines/TestInlines.py (1663 of 1860) UNSUPPORTED: lldb-api :: lang/objc/rdar-12408181/TestRdar12408181.py (1664 of 1860) UNSUPPORTED: lldb-api :: functionalities/darwin_log/filter/exact_match/subsystem/TestDarwinLogFilterMatchSubsystem.py (1665 of 1860) PASS: lldb-api :: commands/target/basic/TestTargetCommand.py (1666 of 1860) PASS: lldb-api :: functionalities/tsan/cpp_global_location/TestTsanCPPGlobalLocation.py (1667 of 1860) PASS: lldb-api :: commands/expression/char/TestExprsChar.py (1668 of 1860) PASS: lldb-unit :: Utility/./UtilityTests/StringListTest.InsertStringAtIndexMove (1669 of 1860) PASS: lldb-api :: lang/objc/modules-auto-import/TestModulesAutoImport.py (1670 of 1860) PASS: lldb-api :: functionalities/show_location/TestShowLocationDwarf5.py (1671 of 1860) PASS: lldb-api :: commands/watchpoints/watchpoint_disable/TestWatchpointDisable.py (1672 of 1860) PASS: lldb-api :: functionalities/thread/concurrent_events/TestConcurrentBreakpointDelayBreakpointOneSignal.py (1673 of 1860) PASS: lldb-api :: functionalities/data-formatter/data-formatter-stl/libcxx/string/TestDataFormatterLibcxxString.py (1674 of 1860) PASS: lldb-unit :: Language/Highlighting/./HighlighterTests/HighlighterTest.ClangTrailingBackslashMissingNewLine (1675 of 1860) PASS: lldb-unit :: Utility/./UtilityTests/UserIDResolver.GetGroupName (1676 of 1860) PASS: lldb-api :: functionalities/jitloader_gdb/TestJITLoaderGDB.py (1677 of 1860) PASS: lldb-unit :: Utility/./UtilityTests/VMRange.IsValid (1678 of 1860) PASS: lldb-api :: functionalities/thread/concurrent_events/TestConcurrentDelayedCrashWithBreakpointSignal.py (1679 of 1860) PASS: lldb-unit :: Expression/./ExpressionTests/DiagnosticManagerTest.AppendMessageAttachToLastDiag (1680 of 1860) PASS: lldb-unit :: Process/gdb-remote/./ProcessGdbRemoteTests/GDBRemoteCommunicationClientTest.TestPacketSpeedJSON (1681 of 1860) UNSUPPORTED: lldb-shell :: SymbolFile/PDB/udt-layout.test (1682 of 1860) PASS: lldb-unit :: Host/./HostTests/ConnectionFileDescriptorTest.TCPGetURIv6 (1683 of 1860) PASS: lldb-api :: commands/statistics/basic/TestStats.py (1684 of 1860) PASS: lldb-unit :: Symbol/./SymbolTests/SymbolsTest.TerminateLocateExecutableSymbolFileForUnknownExecutableAndUnknownSymbolFile (1685 of 1860) PASS: lldb-unit :: Process/gdb-remote/./ProcessGdbRemoteTests/GDBRemoteCommunicationClientTest.ReadRegister (1686 of 1860) PASS: lldb-api :: functionalities/tsan/thread_leak/TestTsanThreadLeak.py (1687 of 1860) PASS: lldb-unit :: Utility/./UtilityTests/ArgsTest.TestUnknownEscape (1688 of 1860) PASS: lldb-api :: functionalities/postmortem/wow64_minidump/TestWow64MiniDump.py (1689 of 1860) PASS: lldb-unit :: Utility/./UtilityTests/TimerTest.CategoryTimes2 (1690 of 1860) PASS: lldb-unit :: Process/minidump/./LLDBMinidumpTests/MinidumpParserTest.FindMemoryRangeWithFullMemoryMinidump (1691 of 1860) PASS: lldb-unit :: Symbol/./SymbolTests/TestClangASTContext.TestIsClangType (1692 of 1860) PASS: lldb-unit :: Utility/./UtilityTests/StreamTest.PutHex64ByteOrderBig (1693 of 1860) PASS: lldb-unit :: Utility/./UtilityTests/OptionsWithRawTest.EmptySuffixSingleWhitespace (1694 of 1860) PASS: lldb-api :: functionalities/step-avoids-no-debug/TestStepNoDebug.py (1695 of 1860) PASS: lldb-unit :: Utility/./UtilityTests/StreamTest.PutRawBytesToBigEndian (1696 of 1860) PASS: lldb-unit :: Utility/./UtilityTests/StringExtractorTest.DecodeHexU8_InvalidHex (1697 of 1860) UNSUPPORTED: lldb-api :: lang/cpp/static_members/TestCPPStaticMembers.py (1698 of 1860) PASS: lldb-api :: macosx/find-dsym/deep-bundle/TestDeepBundle.py (1699 of 1860) PASS: lldb-unit :: Host/./HostTests/SocketTest.DecodeHostAndPort (1700 of 1860) PASS: lldb-unit :: Process/gdb-remote/./ProcessGdbRemoteTests/GDBRemoteCommunicationClientTest.GetModulesInfo_UUID20 (1701 of 1860) PASS: lldb-api :: lang/cpp/lambdas/TestLambdas.py (1702 of 1860) PASS: lldb-unit :: Process/gdb-remote/./ProcessGdbRemoteTests/GDBRemoteCommunicationServerTest.SendErrorResponse_UnimplementedError (1703 of 1860) PASS: lldb-api :: lang/c/local_types/TestUseClosestType.py (1704 of 1860) PASS: lldb-api :: functionalities/wrong_commands/TestWrongCommands.py (1705 of 1860) PASS: lldb-unit :: Process/gdb-remote/./ProcessGdbRemoteTests/GDBRemoteCommunicationClientTest.SyncThreadState (1706 of 1860) PASS: lldb-unit :: Process/gdb-remote/./ProcessGdbRemoteTests/GDBRemoteCommunicationClientTest.WriteRegister (1707 of 1860) PASS: lldb-shell :: Driver/TestProcessAttach.test (1708 of 1860) PASS: lldb-unit :: Utility/./UtilityTests/ArchSpecTest.MergeFrom (1709 of 1860) PASS: lldb-api :: commands/expression/radar_8638051/Test8638051.py (1710 of 1860) PASS: lldb-api :: commands/expression/import-std-module/deque-dbg-info-content/TestDbgInfoContentDeque.py (1711 of 1860) PASS: lldb-unit :: Host/./HostTests/HostInfoTest.GetHostname (1712 of 1860) PASS: lldb-api :: commands/expression/persistent_ptr_update/TestPersistentPtrUpdate.py (1713 of 1860) PASS: lldb-unit :: UnwindAssembly/x86/./UnwindAssemblyx86Tests/Testx86AssemblyInspectionEngine.TestSpillRegToStackViaMOVx86_64 (1714 of 1860) PASS: lldb-api :: functionalities/data-formatter/boolreference/TestFormattersBoolRefPtr.py (1715 of 1860) PASS: lldb-api :: python_api/sbtype_typeclass/TestSBTypeTypeClass.py (1716 of 1860) PASS: lldb-unit :: Language/Highlighting/./HighlighterTests/HighlighterTest.ClangComments (1717 of 1860) PASS: lldb-unit :: UnwindAssembly/x86/./UnwindAssemblyx86Tests/Testx86AssemblyInspectionEngine.TestPopR14 (1718 of 1860) PASS: lldb-shell :: SymbolFile/DWARF/dwarf5-partial-index.cpp (1719 of 1860) UNSUPPORTED: lldb-api :: functionalities/unwind/ehframe/TestEhFrameUnwind.py (1720 of 1860) PASS: lldb-api :: lang/cpp/global_variables/TestCPPGlobalVariables.py (1721 of 1860) PASS: lldb-unit :: Utility/./UtilityTests/StringLexerTest.Next (1722 of 1860) PASS: lldb-unit :: UnwindAssembly/x86/./UnwindAssemblyx86Tests/Testx86AssemblyInspectionEngine.TestPushR14 (1723 of 1860) PASS: lldb-unit :: Utility/./UtilityTests/ListenerTest.GetEventWait (1724 of 1860) PASS: lldb-shell :: ObjectFile/MachO/lc_version_min.yaml (1725 of 1860) PASS: lldb-unit :: UnwindAssembly/x86/./UnwindAssemblyx86Tests/Testx86AssemblyInspectionEngine.Test32bitFramelessSmallStackFrame (1726 of 1860) UNSUPPORTED: lldb-api :: lang/cpp/printf/TestPrintf.py (1727 of 1860) PASS: lldb-unit :: Host/./HostTests/NativeProcessProtocolTest.SetBreakpoint (1728 of 1860) UNSUPPORTED: lldb-api :: functionalities/longjmp/TestLongjmp.py (1729 of 1860) PASS: lldb-api :: functionalities/gdb_remote_client/TestTargetXMLArch.py (1730 of 1860) PASS: lldb-unit :: UnwindAssembly/x86/./UnwindAssemblyx86Tests/Testx86AssemblyInspectionEngine.TestCALLNextInsn (1731 of 1860) PASS: lldb-unit :: Utility/./UtilityTests/StreamTest.PutBytesAsRawHex8ToMixedEndian (1732 of 1860) PASS: lldb-api :: lang/cpp/bool/TestCPPBool.py (1733 of 1860) PASS: lldb-api :: functionalities/data-formatter/poarray/TestPrintObjectArray.py (1734 of 1860) PASS: lldb-api :: api/command-return-object/TestSBCommandReturnObject.py (1735 of 1860) PASS: lldb-api :: commands/target/create-no-such-arch/TestNoSuchArch.py (1736 of 1860) PASS: lldb-unit :: Utility/./UtilityTests/ConstStringTest.FromMidOfBufferStringRef (1737 of 1860) PASS: lldb-shell :: ObjectFile/MachO/lc_build_version.yaml (1738 of 1860) PASS: lldb-unit :: UnwindAssembly/PPC64/./PPC64InstEmulationTests/TestPPC64InstEmulation.TestMediumFunction (1739 of 1860) PASS: lldb-unit :: Utility/./UtilityTests/TimerTest.CategoryTimesNested (1740 of 1860) PASS: lldb-unit :: Process/minidump/./LLDBMinidumpTests/MinidumpParserTest.MinidumpDuplicateModuleMinAddress (1741 of 1860) PASS: lldb-api :: commands/log/basic/TestLogging.py (1742 of 1860) PASS: lldb-api :: python_api/disassemble-raw-data/TestDisassemble_VST1_64.py (1743 of 1860) PASS: lldb-unit :: Utility/./UtilityTests/LogChannelTest.Disable (1744 of 1860) PASS: lldb-unit :: Utility/./UtilityTests/RegisterValueTest.GetSet8 (1745 of 1860) PASS: lldb-api :: functionalities/postmortem/mach-core/TestMachCore.py (1746 of 1860) PASS: lldb-shell :: ObjectFile/ELF/section-addresses.yaml (1747 of 1860) PASS: lldb-unit :: Utility/./UtilityTests/StreamTest.AddressRangeSize (1748 of 1860) PASS: lldb-api :: commands/expression/dont_allow_jit/TestAllowJIT.py (1749 of 1860) PASS: lldb-shell :: SymbolFile/Breakpad/line-table-missing-file.test (1750 of 1860) PASS: lldb-unit :: SymbolFile/DWARF/./SymbolFileDWARFTests/SymbolFileDWARFTests.TestAbbrevOrder1Start5 (1751 of 1860) PASS: lldb-unit :: Utility/./UtilityTests/Flags.IsClear (1752 of 1860) PASS: lldb-api :: python_api/interpreter/TestRunCommandInterpreterAPI.py (1753 of 1860) UNSUPPORTED: lldb-api :: linux/add-symbols/TestTargetSymbolsAddCommand.py (1754 of 1860) PASS: lldb-api :: commands/expression/anonymous-struct/TestCallUserAnonTypedef.py (1755 of 1860) PASS: lldb-api :: tools/lldb-server/TestGdbRemoteAttach.py (1756 of 1860) PASS: lldb-api :: lang/c/unicode/TestUnicodeSymbols.py (1757 of 1860) PASS: lldb-api :: commands/expression/no-deadlock/TestExprDoesntBlock.py (1758 of 1860) PASS: lldb-unit :: Utility/./UtilityTests/UserIDResolver.GetUserName (1759 of 1860) PASS: lldb-unit :: ScriptInterpreter/Python/./ScriptInterpreterPythonTests/PythonDataObjectsTest.TestPythonTupleInitializerList (1760 of 1860) PASS: lldb-api :: python_api/value_var_update/TestValueVarUpdate.py (1761 of 1860) PASS: lldb-unit :: Symbol/./SymbolTests/Type.CompilerContextPattern (1762 of 1860) PASS: lldb-shell :: Reproducer/Functionalities/TestDataFormatter.test (1763 of 1860) PASS: lldb-unit :: UnwindAssembly/x86/./UnwindAssemblyx86Tests/Testx86AssemblyInspectionEngine.TestPushR13 (1764 of 1860) PASS: lldb-unit :: Utility/./UtilityTests/StringExtractorTest.GetHexU8_Extra (1765 of 1860) PASS: lldb-api :: commands/expression/radar_9673664/TestExprHelpExamples.py (1766 of 1860) PASS: lldb-unit :: Utility/./UtilityTests/CompletionRequest.TryCompleteCurrentArgBad (1767 of 1860) UNSUPPORTED: lldb-api :: commands/expression/completion-crash2/TestCompletionCrash2.py (1768 of 1860) PASS: lldb-unit :: Host/./HostTests/TaskPoolTest.TaskMap (1769 of 1860) PASS: lldb-shell :: SymbolFile/DWARF/win-i386-line-table.s (1770 of 1860) PASS: lldb-unit :: Utility/./UtilityTests/StringExtractorTest.GetHexU8_Underflow2_NoEof (1771 of 1860) PASS: lldb-unit :: Utility/./UtilityTests/StringLexerTest.HasAtLeast (1772 of 1860) PASS: lldb-unit :: Utility/./UtilityTests/UriParserTest.SchemeHostSeparator4 (1773 of 1860) UNSUPPORTED: lldb-api :: functionalities/unwind/standard/TestStandardUnwind.py (1774 of 1860) PASS: lldb-unit :: Utility/./UtilityTests/StreamTest.QuotedCString (1775 of 1860) PASS: lldb-shell :: Breakpoint/jitbp_elf.test (1776 of 1860) PASS: lldb-api :: functionalities/data-formatter/data-formatter-stl/libstdcpp/unique_ptr/invalid/TestDataFormatterInvalidStdUniquePtr.py (1777 of 1860) PASS: lldb-api :: tools/lldb-server/inferior-crash/TestGdbRemoteSegFault.py (1778 of 1860) PASS: lldb-api :: functionalities/step_scripted/TestStepScripted.py (1779 of 1860) PASS: lldb-api :: tools/lldb-server/TestGdbRemoteProcessInfo.py (1780 of 1860) PASS: lldb-unit :: UnwindAssembly/x86/./UnwindAssemblyx86Tests/Testx86AssemblyInspectionEngine.TestPopEBX (1781 of 1860) PASS: lldb-api :: functionalities/data-formatter/summary-string-onfail/Test-rdar-9974002.py (1782 of 1860) PASS: lldb-shell :: SymbolFile/NativePDB/break-by-function.cpp (1783 of 1860) PASS: lldb-unit :: Utility/./UtilityTests/StringExtractorTest.DecodeHexU8_Underflow2 (1784 of 1860) PASS: lldb-unit :: UnwindAssembly/x86/./UnwindAssemblyx86Tests/Testx86AssemblyInspectionEngine.TestLEAVE (1785 of 1860) PASS: lldb-api :: macosx/safe-to-func-call/TestSafeFuncCalls.py (1786 of 1860) PASS: lldb-api :: commands/expression/import-std-module/list-dbg-info-content/TestDbgInfoContentList.py (1787 of 1860) PASS: lldb-api :: functionalities/stats_api/TestStatisticsAPI.py (1788 of 1860) PASS: lldb-unit :: Utility/./UtilityTests/StringListTest.ShiftStdString (1789 of 1860) PASS: lldb-api :: macosx/thread-names/TestInterruptThreadNames.py (1790 of 1860) PASS: lldb-unit :: Process/gdb-remote/./ProcessGdbRemoteTests/GDBRemoteCommunicationClientTest.SendSignalsToIgnore (1791 of 1860) PASS: lldb-unit :: Utility/./UtilityTests/ProcessInstanceInfo.Dump (1792 of 1860) PASS: lldb-unit :: Utility/./UtilityTests/RegularExpression.Invalid (1793 of 1860) PASS: lldb-shell :: SymbolFile/Breakpad/unwind-via-stack-cfi.test (1794 of 1860) PASS: lldb-api :: functionalities/data-formatter/parray/TestPrintArray.py (1795 of 1860) PASS: lldb-api :: commands/watchpoints/watchpoint_commands/command/TestWatchpointCommandLLDB.py (1796 of 1860) PASS: lldb-api :: functionalities/gdb_remote_client/TestGDBRemoteLoad.py (1797 of 1860) PASS: lldb-api :: commands/expression/import-std-module/vector-of-vectors/TestVectorOfVectors.py (1798 of 1860) PASS: lldb-unit :: Utility/./UtilityTests/StreamTest.PutCString (1799 of 1860) PASS: lldb-api :: python_api/formatters/TestFormattersSBAPI.py (1800 of 1860) PASS: lldb-api :: functionalities/data-formatter/data-formatter-smart-array/TestDataFormatterSmartArray.py (1801 of 1860) PASS: lldb-unit :: Utility/./UtilityTests/StringListTest.JoinThree (1802 of 1860) PASS: lldb-unit :: Utility/./UtilityTests/RegularExpression.Empty (1803 of 1860) PASS: lldb-api :: functionalities/thread/concurrent_events/TestConcurrentSignalBreak.py (1804 of 1860) PASS: lldb-unit :: Utility/./UtilityTests/BinaryStreamTest.PutSLEB128TwoBytes (1805 of 1860) PASS: lldb-unit :: Host/./HostTests/NativeProcessProtocolTest.SetBreakpointFailWrite (1806 of 1860) PASS: lldb-shell :: SymbolFile/Breakpad/line-table.test (1807 of 1860) PASS: lldb-unit :: Utility/./UtilityTests/StreamTest.PutRawBytesToMixedEndian (1808 of 1860) UNSUPPORTED: lldb-api :: commands/expression/macros/TestMacros.py (1809 of 1860) PASS: lldb-unit :: Language/Highlighting/./HighlighterTests/HighlighterTest.DefaultHighlighterWithCursor (1810 of 1860) PASS: lldb-unit :: Utility/./UtilityTests/BinaryStreamTest.PutSLEB128One (1811 of 1860) PASS: lldb-api :: functionalities/inferior-crashing/recursive-inferior/TestRecursiveInferiorStep.py (1812 of 1860) PASS: lldb-api :: functionalities/data-formatter/data-formatter-stl/libcxx/list/loop/TestDataFormatterLibcxxListLoop.py (1813 of 1860) PASS: lldb-unit :: Utility/./UtilityTests/BinaryStreamTest.PutULEB128FourBytes (1814 of 1860) PASS: lldb-unit :: Utility/./UtilityTests/TildeExpressionResolver.ResolveFullPath (1815 of 1860) PASS: lldb-api :: functionalities/breakpoint/consecutive_breakpoints/TestConsecutiveBreakpoints.py (1816 of 1860) PASS: lldb-api :: lang/c/strings/TestCStrings.py (1817 of 1860) PASS: lldb-api :: commands/watchpoints/hello_watchpoint/TestMyFirstWatchpoint.py (1818 of 1860) PASS: lldb-unit :: Utility/./UtilityTests/CompletionRequest.DuplicateFiltering (1819 of 1860) UNSUPPORTED: lldb-shell :: SymbolFile/PDB/expressions.test (1820 of 1860) PASS: lldb-shell :: SymbolFile/DWARF/forward-declarations.s (1821 of 1860) PASS: lldb-api :: functionalities/gdb_remote_client/TestRecognizeBreakpoint.py (1822 of 1860) PASS: lldb-shell :: ObjectFile/MachO/symtab.yaml (1823 of 1860) PASS: lldb-api :: lang/objc/modules-update/TestClangModulesUpdate.py (1824 of 1860) PASS: lldb-unit :: Utility/./UtilityTests/StringExtractorTest.GetHexBytesAvail_OddPair (1825 of 1860) UNSUPPORTED: lldb-api :: functionalities/thread/multi_break/TestMultipleBreakpoints.py (1826 of 1860) PASS: lldb-unit :: Utility/./UtilityTests/OptionsWithRawTest.MultiWordSuffix (1827 of 1860) PASS: lldb-shell :: Reproducer/TestCrash.test (1828 of 1860) PASS: lldb-shell :: ObjectFile/Breakpad/sections-trailing-func.test (1829 of 1860) PASS: lldb-api :: commands/process/attach-resume/TestAttachResume.py (1830 of 1860) UNSUPPORTED: lldb-api :: tools/lldb-server/thread-name/TestGdbRemoteThreadName.py (1831 of 1860) UNSUPPORTED: lldb-api :: linux/mix-dwo-and-regular-objects/TestMixedDwarfBinary.py (1832 of 1860) PASS: lldb-unit :: UnwindAssembly/x86/./UnwindAssemblyx86Tests/Testx86AssemblyInspectionEngine.TestStackRealignMSVC_i386 (1833 of 1860) PASS: lldb-shell :: Settings/TestSettingsSet.test (1834 of 1860) PASS: lldb-api :: functionalities/plugins/command_plugin/TestPluginCommands.py (1835 of 1860) PASS: lldb-api :: lang/objc/rdar-10967107/TestRdar10967107.py (1836 of 1860) PASS: lldb-unit :: UnwindAssembly/x86/./UnwindAssemblyx86Tests/Testx86AssemblyInspectionEngine.TestPushECX (1837 of 1860) PASS: lldb-api :: functionalities/breakpoint/breakpoint_set_restart/TestBreakpointSetRestart.py (1838 of 1860) PASS: lldb-api :: functionalities/plugins/python_os_plugin/TestPythonOSPlugin.py (1839 of 1860) PASS: lldb-api :: lang/objc/foundation/TestSymbolTable.py (1840 of 1860) PASS: lldb-api :: functionalities/dead-strip/TestDeadStrip.py (1841 of 1860) PASS: lldb-api :: lang/cpp/exceptions/TestCPPExceptionBreakpoints.py (1842 of 1860) PASS: lldb-api :: lang/cpp/operators/TestCppOperators.py (1843 of 1860) PASS: lldb-api :: python_api/watchpoint/TestWatchpointIgnoreCount.py (1844 of 1860) PASS: lldb-api :: functionalities/data-formatter/data-formatter-stl/libcxx/iterator/TestDataFormatterLibccIterator.py (1845 of 1860) PASS: lldb-api :: lang/objc/global_ptrs/TestGlobalObjects.py (1846 of 1860) PASS: lldb-api :: functionalities/data-formatter/nsarraysynth/TestNSArraySynthetic.py (1847 of 1860) PASS: lldb-api :: lang/objc/orderedset/TestOrderedSet.py (1848 of 1860) PASS: lldb-api :: tools/lldb-server/TestGdbRemote_vCont.py (1849 of 1860) PASS: lldb-api :: commands/expression/import-std-module/unique_ptr-dbg-info-content/TestUniquePtrDbgInfoContent.py (1850 of 1860) PASS: lldb-api :: functionalities/type_lookup/TestTypeLookup.py (1851 of 1860) PASS: lldb-api :: functionalities/data-formatter/data-formatter-stl/libcxx/multiset/TestDataFormatterLibcxxMultiSet.py (1852 of 1860) PASS: lldb-api :: lang/objc/forward-decl/TestForwardDecl.py (1853 of 1860) PASS: lldb-api :: lang/objc/objc-new-syntax/TestObjCNewSyntaxLiteral.py (1854 of 1860) PASS: lldb-api :: functionalities/thread/step_out/TestThreadStepOut.py (1855 of 1860) PASS: lldb-api :: lang/cpp/enum_types/TestCPP11EnumTypes.py (1856 of 1860) PASS: lldb-api :: commands/expression/expr-in-syscall/TestExpressionInSyscall.py (1857 of 1860) PASS: lldb-api :: lang/objc/foundation/TestObjCMethodsString.py (1858 of 1860) PASS: lldb-api :: lang/objc/real-definition/TestRealDefinition.py (1859 of 1860) PASS: lldb-api :: lang/objc/foundation/TestFoundationDisassembly.py (1860 of 1860)

Hide Details

Testing Time: 317.42s ******************** Failing Tests (1): lldb-api :: commands/watchpoints/watchpoint_set_command/TestWatchLocationWithWatchSet.py

Hide Details

Hide Details

Slowest Tests: -------------------------------------------------------------------------- 35.94s: lldb-api :: functionalities/recursion/TestValueObjectRecursion.py 36.82s: lldb-api :: python_api/watchpoint/watchlocation/TestSetWatchlocation.py 37.20s: lldb-api :: lang/objc/real-definition/TestRealDefinition.py 40.09s: lldb-api :: types/TestIntegerTypeExpr.py 43.07s: lldb-api :: lang/objc/foundation/TestObjCMethodsNSError.py 43.13s: lldb-api :: types/TestLongTypes.py 44.41s: lldb-api :: lang/objc/objc-new-syntax/TestObjCNewSyntaxArray.py 45.36s: lldb-api :: lang/objc/objc-new-syntax/TestObjCNewSyntaxDictionary.py 45.77s: lldb-api :: python_api/watchpoint/watchlocation/TestTargetWatchAddress.py 55.41s: lldb-api :: lang/objc/objc-new-syntax/TestObjCNewSyntaxLiteral.py 55.59s: lldb-api :: lang/objc/exceptions/TestObjCExceptions.py 57.32s: lldb-api :: types/TestLongTypesExpr.py 62.99s: lldb-api :: lang/cpp/namespace/TestNamespaceLookup.py 67.00s: lldb-api :: commands/watchpoints/watchpoint_set_command/TestWatchLocationWithWatchSet.py 70.43s: lldb-api :: api/multithreaded/TestMultithreaded.py 77.61s: lldb-api :: lang/cpp/enum_types/TestCPP11EnumTypes.py 79.11s: lldb-api :: lang/objc/foundation/TestObjCMethods.py 89.79s: lldb-api :: lang/objc/hidden-ivars/TestHiddenIvars.py 94.96s: lldb-api :: tools/lldb-server/TestLldbGdbServer.py 147.16s: lldb-api :: lang/objc/foundation/TestFoundationDisassembly.py

Hide Details

Tests Times: -------------------------------------------------------------------------- [ Range ] :: [ Percentage ] :: [ Count ] -------------------------------------------------------------------------- [ 0s, 10s) :: [*********************************** ] :: [1645/1860] [ 10s, 20s) :: [*** ] :: [ 152/1860] [ 20s, 30s) :: [ ] :: [ 39/1860] [ 30s, 40s) :: [ ] :: [ 7/1860] [ 40s, 50s) :: [ ] :: [ 6/1860] [ 50s, 60s) :: [ ] :: [ 3/1860] [ 60s, 70s) :: [ ] :: [ 2/1860] [ 70s, 80s) :: [ ] :: [ 2/1860] [ 80s, 90s) :: [ ] :: [ 1/1860] [ 90s,100s) :: [ ] :: [ 2/1860] [100s,110s) :: [ ] :: [ 0/1860] [110s,120s) :: [ ] :: [ 0/1860] [120s,130s) :: [ ] :: [ 0/1860] [130s,140s) :: [ ] :: [ 0/1860] [140s,150s) :: [ ] :: [ 1/1860] Expected Passes : 1721 Expected Failures : 6 Unsupported Tests : 132 Unexpected Failures: 1 FAILED: tools/lldb/test/CMakeFiles/check-lldb-lit cd /Users/buildslave/jenkins/workspace/lldb-cmake/lldb-build/tools/lldb/test && /usr/local/bin/python /Users/buildslave/jenkins/workspace/lldb-cmake/lldb-build/./bin/llvm-lit -v --time-tests --shuffle --xunit-xml-output=/Users/buildslave/jenkins/workspace/lldb-cmake/test/results.xml -v /Users/buildslave/jenkins/workspace/lldb-cmake/lldb-build/tools/lldb/test ninja: build stopped: subcommand failed. Command failed: Command '['/usr/bin/env', 'TERM=vt100', '/usr/local/bin/ninja', '-v', 'check-lldb']' returned non-zero exit status 1. Command: ['/usr/bin/env', 'TERM=vt100', '/usr/local/bin/ninja', '-v', 'check-lldb'] [Pipeline] } [Pipeline] // timeout [Pipeline] } [Pipeline] // stage [Pipeline] stage [Pipeline] { (Declarative: Post Actions) [Pipeline] scanForIssues No credentials specified [Clang (LLVM based)] Sleeping for 5 seconds due to JENKINS-32191... [Clang (LLVM based)] Parsing console log (workspace: '/Users/buildslave/jenkins/workspace/lldb-cmake') [Clang (LLVM based)] [-ERROR-] Git blame errors: [Clang (LLVM based)] [-ERROR-] - no blame results for request <llvm-project/llvm/include/llvm/Analysis/ScalarEvolution.h - [1696]>.

Hide Details

[Clang (LLVM based)] Post processing issues on 'green-dragon-24' with source code encoding 'UTF-8' [Clang (LLVM based)] Resolving absolute file names for all issues in workspace '/Users/buildslave/jenkins/workspace/lldb-cmake' [Clang (LLVM based)] -> 0 resolved, 0 unresolved, 1 already resolved [Clang (LLVM based)] Copying affected files to Jenkins' build folder '/Users/Shared/Jenkins/Home/jobs/lldb-cmake/builds/4750/files-with-issues' [Clang (LLVM based)] -> 1 copied, 0 not in workspace, 0 not-found, 0 with I/O error [Clang (LLVM based)] Resolving module names from module definitions (build.xml, pom.xml, or Manifest.mf files) [Clang (LLVM based)] -> resolved module names for 1 issues [Clang (LLVM based)] Resolving package names (or namespaces) by parsing the affected files [Clang (LLVM based)] -> resolved package names of 1 affected files [Clang (LLVM based)] No filter has been set, publishing all 1 issues [Clang (LLVM based)] Creating fingerprints for all affected code blocks to track issues over different builds [Clang (LLVM based)] -> created fingerprints for 1 issues [Clang (LLVM based)] Invoking Git blamer to create author and commit information for all affected files [Clang (LLVM based)] GIT_COMMIT env = 'HEAD' [Clang (LLVM based)] Git working tree = '/Users/buildslave/jenkins/workspace/lldb-cmake' [Clang (LLVM based)] Git commit ID = 'ac7c64bedb3d3cd7326983ac889d6b658f8f202b' [Clang (LLVM based)] Job workspace = '/Users/buildslave/jenkins/workspace/lldb-cmake' [Clang (LLVM based)] Created blame requests for 1 files - invoking Git blame on agent for each of the requests [Clang (LLVM based)] -> blamed authors of issues in 1 files
[Pipeline] junit Recording test results [BFA] Scanning build for known causes... [Pipeline] emailext [BFA] Found failure cause(s): [BFA] Ninja target failed from category Compile [BFA] Regression test failed from category Test [BFA] Done. 0s Not sending mail to unregistered user smeenai@fb.com because your SCM claimed this was associated with a user ID ‘smeenai' which your security realm does not recognize; you may need changes in your SCM plugin Not sending mail to unregistered user maskray@google.com because your SCM claimed this was associated with a user ID ‘maskray' which your security realm does not recognize; you may need changes in your SCM plugin Not sending mail to unregistered user smeenai@fb.com because your SCM claimed this was associated with a user ID ‘smeenai' which your security realm does not recognize; you may need changes in your SCM plugin Not sending mail to unregistered user maskray@google.com because your SCM claimed this was associated with a user ID ‘maskray' which your security realm does not recognize; you may need changes in your SCM plugin

Hide Details

Begin Pre-Send Script... Sending email to: mschifer@apple.com Jessica Paquette <jpaquette@apple.com> Azhar Mohammed <azhar@apple.com>
> git rev-parse HEAD^{commit} # timeout=10 [Pipeline] } [Pipeline] // stage [Pipeline] } [Pipeline] // withEnv [Pipeline] } [Pipeline] // node [Pipeline] End of Pipeline ERROR: script returned exit code 1 Finished: FAILURE