FailedConsole Output

Skipping 4,640 KB.. Full Log
iend.cpp.o tools/clang/lib/AST/CMakeFiles/obj.clangAST.dir/DeclGroup.cpp.o tools/clang/lib/AST/CMakeFiles/obj.clangAST.dir/DeclObjC.cpp.o tools/clang/lib/AST/CMakeFiles/obj.clangAST.dir/DeclOpenMP.cpp.o tools/clang/lib/AST/CMakeFiles/obj.clangAST.dir/DeclPrinter.cpp.o tools/clang/lib/AST/CMakeFiles/obj.clangAST.dir/DeclTemplate.cpp.o tools/clang/lib/AST/CMakeFiles/obj.clangAST.dir/ParentMapContext.cpp.o tools/clang/lib/AST/CMakeFiles/obj.clangAST.dir/Expr.cpp.o tools/clang/lib/AST/CMakeFiles/obj.clangAST.dir/ExprClassification.cpp.o tools/clang/lib/AST/CMakeFiles/obj.clangAST.dir/ExprConcepts.cpp.o tools/clang/lib/AST/CMakeFiles/obj.clangAST.dir/ExprConstant.cpp.o tools/clang/lib/AST/CMakeFiles/obj.clangAST.dir/ExprCXX.cpp.o tools/clang/lib/AST/CMakeFiles/obj.clangAST.dir/ExprObjC.cpp.o tools/clang/lib/AST/CMakeFiles/obj.clangAST.dir/ExternalASTMerger.cpp.o tools/clang/lib/AST/CMakeFiles/obj.clangAST.dir/ExternalASTSource.cpp.o tools/clang/lib/AST/CMakeFiles/obj.clangAST.dir/FormatString.cpp.o tools/clang/lib/AST/CMakeFiles/obj.clangAST.dir/InheritViz.cpp.o tools/clang/lib/AST/CMakeFiles/obj.clangAST.dir/Interp/ByteCodeEmitter.cpp.o tools/clang/lib/AST/CMakeFiles/obj.clangAST.dir/Interp/ByteCodeExprGen.cpp.o tools/clang/lib/AST/CMakeFiles/obj.clangAST.dir/Interp/ByteCodeGenError.cpp.o tools/clang/lib/AST/CMakeFiles/obj.clangAST.dir/Interp/ByteCodeStmtGen.cpp.o tools/clang/lib/AST/CMakeFiles/obj.clangAST.dir/Interp/Context.cpp.o tools/clang/lib/AST/CMakeFiles/obj.clangAST.dir/Interp/Descriptor.cpp.o tools/clang/lib/AST/CMakeFiles/obj.clangAST.dir/Interp/Disasm.cpp.o tools/clang/lib/AST/CMakeFiles/obj.clangAST.dir/Interp/EvalEmitter.cpp.o tools/clang/lib/AST/CMakeFiles/obj.clangAST.dir/Interp/Frame.cpp.o tools/clang/lib/AST/CMakeFiles/obj.clangAST.dir/Interp/Function.cpp.o tools/clang/lib/AST/CMakeFiles/obj.clangAST.dir/Interp/Interp.cpp.o tools/clang/lib/AST/CMakeFiles/obj.clangAST.dir/Interp/InterpBlock.cpp.o tools/clang/lib/AST/CMakeFiles/obj.clangAST.dir/Interp/InterpFrame.cpp.o tools/clang/lib/AST/CMakeFiles/obj.clangAST.dir/Interp/InterpStack.cpp.o tools/clang/lib/AST/CMakeFiles/obj.clangAST.dir/Interp/InterpState.cpp.o tools/clang/lib/AST/CMakeFiles/obj.clangAST.dir/Interp/Pointer.cpp.o tools/clang/lib/AST/CMakeFiles/obj.clangAST.dir/Interp/PrimType.cpp.o tools/clang/lib/AST/CMakeFiles/obj.clangAST.dir/Interp/Program.cpp.o tools/clang/lib/AST/CMakeFiles/obj.clangAST.dir/Interp/Record.cpp.o tools/clang/lib/AST/CMakeFiles/obj.clangAST.dir/Interp/Source.cpp.o tools/clang/lib/AST/CMakeFiles/obj.clangAST.dir/Interp/State.cpp.o tools/clang/lib/AST/CMakeFiles/obj.clangAST.dir/ItaniumCXXABI.cpp.o tools/clang/lib/AST/CMakeFiles/obj.clangAST.dir/ItaniumMangle.cpp.o tools/clang/lib/AST/CMakeFiles/obj.clangAST.dir/JSONNodeDumper.cpp.o tools/clang/lib/AST/CMakeFiles/obj.clangAST.dir/Mangle.cpp.o tools/clang/lib/AST/CMakeFiles/obj.clangAST.dir/MicrosoftCXXABI.cpp.o tools/clang/lib/AST/CMakeFiles/obj.clangAST.dir/MicrosoftMangle.cpp.o tools/clang/lib/AST/CMakeFiles/obj.clangAST.dir/NestedNameSpecifier.cpp.o tools/clang/lib/AST/CMakeFiles/obj.clangAST.dir/NSAPI.cpp.o tools/clang/lib/AST/CMakeFiles/obj.clangAST.dir/ODRHash.cpp.o tools/clang/lib/AST/CMakeFiles/obj.clangAST.dir/OpenMPClause.cpp.o tools/clang/lib/AST/CMakeFiles/obj.clangAST.dir/OSLog.cpp.o tools/clang/lib/AST/CMakeFiles/obj.clangAST.dir/ParentMap.cpp.o tools/clang/lib/AST/CMakeFiles/obj.clangAST.dir/PrintfFormatString.cpp.o tools/clang/lib/AST/CMakeFiles/obj.clangAST.dir/QualTypeNames.cpp.o tools/clang/lib/AST/CMakeFiles/obj.clangAST.dir/RawCommentList.cpp.o tools/clang/lib/AST/CMakeFiles/obj.clangAST.dir/RecordLayout.cpp.o tools/clang/lib/AST/CMakeFiles/obj.clangAST.dir/RecordLayoutBuilder.cpp.o tools/clang/lib/AST/CMakeFiles/obj.clangAST.dir/ScanfFormatString.cpp.o tools/clang/lib/AST/CMakeFiles/obj.clangAST.dir/SelectorLocationsKind.cpp.o tools/clang/lib/AST/CMakeFiles/obj.clangAST.dir/Stmt.cpp.o tools/clang/lib/AST/CMakeFiles/obj.clangAST.dir/StmtCXX.cpp.o tools/clang/lib/AST/CMakeFiles/obj.clangAST.dir/StmtIterator.cpp.o tools/clang/lib/AST/CMakeFiles/obj.clangAST.dir/StmtObjC.cpp.o tools/clang/lib/AST/CMakeFiles/obj.clangAST.dir/StmtOpenMP.cpp.o tools/clang/lib/AST/CMakeFiles/obj.clangAST.dir/StmtPrinter.cpp.o tools/clang/lib/AST/CMakeFiles/obj.clangAST.dir/StmtProfile.cpp.o tools/clang/lib/AST/CMakeFiles/obj.clangAST.dir/StmtViz.cpp.o tools/clang/lib/AST/CMakeFiles/obj.clangAST.dir/TemplateBase.cpp.o tools/clang/lib/AST/CMakeFiles/obj.clangAST.dir/TemplateName.cpp.o tools/clang/lib/AST/CMakeFiles/obj.clangAST.dir/TextNodeDumper.cpp.o tools/clang/lib/AST/CMakeFiles/obj.clangAST.dir/Type.cpp.o tools/clang/lib/AST/CMakeFiles/obj.clangAST.dir/TypeLoc.cpp.o tools/clang/lib/AST/CMakeFiles/obj.clangAST.dir/TypePrinter.cpp.o tools/clang/lib/AST/CMakeFiles/obj.clangAST.dir/VTableBuilder.cpp.o tools/clang/lib/AST/CMakeFiles/obj.clangAST.dir/VTTBuilder.cpp.o && :
[2964/4439] : && "/Applications/Xcode.app/Contents/Developer/Toolchains/XcodeDefault.xctoolchain/usr/bin/libtool" -static -no_warning_for_no_symbols -o lib/libclangEdit.a  tools/clang/lib/Edit/CMakeFiles/obj.clangEdit.dir/Commit.cpp.o tools/clang/lib/Edit/CMakeFiles/obj.clangEdit.dir/EditedSource.cpp.o tools/clang/lib/Edit/CMakeFiles/obj.clangEdit.dir/RewriteObjCFoundationAPI.cpp.o && :
[2965/4439] /Users/buildslave/jenkins/workspace/lldb-cmake/host-compiler/bin/clang++  -DGTEST_HAS_RTTI=0 -D_DEBUG -D_GNU_SOURCE -D__STDC_CONSTANT_MACROS -D__STDC_FORMAT_MACROS -D__STDC_LIMIT_MACROS -Itools/clang/lib/Driver -I/Users/buildslave/jenkins/workspace/lldb-cmake/llvm-project/clang/lib/Driver -I/Users/buildslave/jenkins/workspace/lldb-cmake/llvm-project/clang/include -Itools/clang/include -I/Applications/Xcode.app/Contents/Developer/Platforms/MacOSX.platform/Developer/SDKs/MacOSX10.15.sdk/usr/include/libxml2 -Iinclude -I/Users/buildslave/jenkins/workspace/lldb-cmake/llvm-project/llvm/include -Wdocumentation -fPIC -fvisibility-inlines-hidden -Werror=date-time -Werror=unguarded-availability-new -fmodules -fmodules-cache-path=/Users/buildslave/jenkins/workspace/lldb-cmake/lldb-build/module.cache -fcxx-modules -Xclang -fmodules-local-submodule-visibility -Wall -Wextra -Wno-unused-parameter -Wwrite-strings -Wcast-qual -Wmissing-field-initializers -pedantic -Wno-long-long -Wimplicit-fallthrough -Wcovered-switch-default -Wno-noexcept-type -Wnon-virtual-dtor -Wdelete-non-virtual-dtor -Wstring-conversion -fdiagnostics-color -fno-common -Woverloaded-virtual -Wno-nested-anon-types -O3  -isysroot /Applications/Xcode.app/Contents/Developer/Platforms/MacOSX.platform/Developer/SDKs/MacOSX10.15.sdk    -fno-exceptions -fno-rtti -UNDEBUG -std=c++14 -MD -MT tools/clang/lib/Driver/CMakeFiles/obj.clangDriver.dir/ToolChains/FreeBSD.cpp.o -MF tools/clang/lib/Driver/CMakeFiles/obj.clangDriver.dir/ToolChains/FreeBSD.cpp.o.d -o tools/clang/lib/Driver/CMakeFiles/obj.clangDriver.dir/ToolChains/FreeBSD.cpp.o -c /Users/buildslave/jenkins/workspace/lldb-cmake/llvm-project/clang/lib/Driver/ToolChains/FreeBSD.cpp
[2966/4439] /Users/buildslave/jenkins/workspace/lldb-cmake/host-compiler/bin/clang++  -DGTEST_HAS_RTTI=0 -D_DEBUG -D_GNU_SOURCE -D__STDC_CONSTANT_MACROS -D__STDC_FORMAT_MACROS -D__STDC_LIMIT_MACROS -Itools/clang/lib/Driver -I/Users/buildslave/jenkins/workspace/lldb-cmake/llvm-project/clang/lib/Driver -I/Users/buildslave/jenkins/workspace/lldb-cmake/llvm-project/clang/include -Itools/clang/include -I/Applications/Xcode.app/Contents/Developer/Platforms/MacOSX.platform/Developer/SDKs/MacOSX10.15.sdk/usr/include/libxml2 -Iinclude -I/Users/buildslave/jenkins/workspace/lldb-cmake/llvm-project/llvm/include -Wdocumentation -fPIC -fvisibility-inlines-hidden -Werror=date-time -Werror=unguarded-availability-new -fmodules -fmodules-cache-path=/Users/buildslave/jenkins/workspace/lldb-cmake/lldb-build/module.cache -fcxx-modules -Xclang -fmodules-local-submodule-visibility -Wall -Wextra -Wno-unused-parameter -Wwrite-strings -Wcast-qual -Wmissing-field-initializers -pedantic -Wno-long-long -Wimplicit-fallthrough -Wcovered-switch-default -Wno-noexcept-type -Wnon-virtual-dtor -Wdelete-non-virtual-dtor -Wstring-conversion -fdiagnostics-color -fno-common -Woverloaded-virtual -Wno-nested-anon-types -O3  -isysroot /Applications/Xcode.app/Contents/Developer/Platforms/MacOSX.platform/Developer/SDKs/MacOSX10.15.sdk    -fno-exceptions -fno-rtti -UNDEBUG -std=c++14 -MD -MT tools/clang/lib/Driver/CMakeFiles/obj.clangDriver.dir/ToolChains/CommonArgs.cpp.o -MF tools/clang/lib/Driver/CMakeFiles/obj.clangDriver.dir/ToolChains/CommonArgs.cpp.o.d -o tools/clang/lib/Driver/CMakeFiles/obj.clangDriver.dir/ToolChains/CommonArgs.cpp.o -c /Users/buildslave/jenkins/workspace/lldb-cmake/llvm-project/clang/lib/Driver/ToolChains/CommonArgs.cpp
[2967/4439] /Users/buildslave/jenkins/workspace/lldb-cmake/host-compiler/bin/clang++  -DGTEST_HAS_RTTI=0 -D_DEBUG -D_GNU_SOURCE -D__STDC_CONSTANT_MACROS -D__STDC_FORMAT_MACROS -D__STDC_LIMIT_MACROS -Itools/clang/lib/Driver -I/Users/buildslave/jenkins/workspace/lldb-cmake/llvm-project/clang/lib/Driver -I/Users/buildslave/jenkins/workspace/lldb-cmake/llvm-project/clang/include -Itools/clang/include -I/Applications/Xcode.app/Contents/Developer/Platforms/MacOSX.platform/Developer/SDKs/MacOSX10.15.sdk/usr/include/libxml2 -Iinclude -I/Users/buildslave/jenkins/workspace/lldb-cmake/llvm-project/llvm/include -Wdocumentation -fPIC -fvisibility-inlines-hidden -Werror=date-time -Werror=unguarded-availability-new -fmodules -fmodules-cache-path=/Users/buildslave/jenkins/workspace/lldb-cmake/lldb-build/module.cache -fcxx-modules -Xclang -fmodules-local-submodule-visibility -Wall -Wextra -Wno-unused-parameter -Wwrite-strings -Wcast-qual -Wmissing-field-initializers -pedantic -Wno-long-long -Wimplicit-fallthrough -Wcovered-switch-default -Wno-noexcept-type -Wnon-virtual-dtor -Wdelete-non-virtual-dtor -Wstring-conversion -fdiagnostics-color -fno-common -Woverloaded-virtual -Wno-nested-anon-types -O3  -isysroot /Applications/Xcode.app/Contents/Developer/Platforms/MacOSX.platform/Developer/SDKs/MacOSX10.15.sdk    -fno-exceptions -fno-rtti -UNDEBUG -std=c++14 -MD -MT tools/clang/lib/Driver/CMakeFiles/obj.clangDriver.dir/ToolChains/Haiku.cpp.o -MF tools/clang/lib/Driver/CMakeFiles/obj.clangDriver.dir/ToolChains/Haiku.cpp.o.d -o tools/clang/lib/Driver/CMakeFiles/obj.clangDriver.dir/ToolChains/Haiku.cpp.o -c /Users/buildslave/jenkins/workspace/lldb-cmake/llvm-project/clang/lib/Driver/ToolChains/Haiku.cpp
[2968/4439] /Users/buildslave/jenkins/workspace/lldb-cmake/host-compiler/bin/clang++  -DGTEST_HAS_RTTI=0 -D_DEBUG -D_GNU_SOURCE -D__STDC_CONSTANT_MACROS -D__STDC_FORMAT_MACROS -D__STDC_LIMIT_MACROS -Itools/clang/lib/Driver -I/Users/buildslave/jenkins/workspace/lldb-cmake/llvm-project/clang/lib/Driver -I/Users/buildslave/jenkins/workspace/lldb-cmake/llvm-project/clang/include -Itools/clang/include -I/Applications/Xcode.app/Contents/Developer/Platforms/MacOSX.platform/Developer/SDKs/MacOSX10.15.sdk/usr/include/libxml2 -Iinclude -I/Users/buildslave/jenkins/workspace/lldb-cmake/llvm-project/llvm/include -Wdocumentation -fPIC -fvisibility-inlines-hidden -Werror=date-time -Werror=unguarded-availability-new -fmodules -fmodules-cache-path=/Users/buildslave/jenkins/workspace/lldb-cmake/lldb-build/module.cache -fcxx-modules -Xclang -fmodules-local-submodule-visibility -Wall -Wextra -Wno-unused-parameter -Wwrite-strings -Wcast-qual -Wmissing-field-initializers -pedantic -Wno-long-long -Wimplicit-fallthrough -Wcovered-switch-default -Wno-noexcept-type -Wnon-virtual-dtor -Wdelete-non-virtual-dtor -Wstring-conversion -fdiagnostics-color -fno-common -Woverloaded-virtual -Wno-nested-anon-types -O3  -isysroot /Applications/Xcode.app/Contents/Developer/Platforms/MacOSX.platform/Developer/SDKs/MacOSX10.15.sdk    -fno-exceptions -fno-rtti -UNDEBUG -std=c++14 -MD -MT tools/clang/lib/Driver/CMakeFiles/obj.clangDriver.dir/ToolChains/Cuda.cpp.o -MF tools/clang/lib/Driver/CMakeFiles/obj.clangDriver.dir/ToolChains/Cuda.cpp.o.d -o tools/clang/lib/Driver/CMakeFiles/obj.clangDriver.dir/ToolChains/Cuda.cpp.o -c /Users/buildslave/jenkins/workspace/lldb-cmake/llvm-project/clang/lib/Driver/ToolChains/Cuda.cpp
[2969/4439] /Users/buildslave/jenkins/workspace/lldb-cmake/host-compiler/bin/clang++  -DGTEST_HAS_RTTI=0 -D_DEBUG -D_GNU_SOURCE -D__STDC_CONSTANT_MACROS -D__STDC_FORMAT_MACROS -D__STDC_LIMIT_MACROS -Itools/clang/lib/Driver -I/Users/buildslave/jenkins/workspace/lldb-cmake/llvm-project/clang/lib/Driver -I/Users/buildslave/jenkins/workspace/lldb-cmake/llvm-project/clang/include -Itools/clang/include -I/Applications/Xcode.app/Contents/Developer/Platforms/MacOSX.platform/Developer/SDKs/MacOSX10.15.sdk/usr/include/libxml2 -Iinclude -I/Users/buildslave/jenkins/workspace/lldb-cmake/llvm-project/llvm/include -Wdocumentation -fPIC -fvisibility-inlines-hidden -Werror=date-time -Werror=unguarded-availability-new -fmodules -fmodules-cache-path=/Users/buildslave/jenkins/workspace/lldb-cmake/lldb-build/module.cache -fcxx-modules -Xclang -fmodules-local-submodule-visibility -Wall -Wextra -Wno-unused-parameter -Wwrite-strings -Wcast-qual -Wmissing-field-initializers -pedantic -Wno-long-long -Wimplicit-fallthrough -Wcovered-switch-default -Wno-noexcept-type -Wnon-virtual-dtor -Wdelete-non-virtual-dtor -Wstring-conversion -fdiagnostics-color -fno-common -Woverloaded-virtual -Wno-nested-anon-types -O3  -isysroot /Applications/Xcode.app/Contents/Developer/Platforms/MacOSX.platform/Developer/SDKs/MacOSX10.15.sdk    -fno-exceptions -fno-rtti -UNDEBUG -std=c++14 -MD -MT tools/clang/lib/Driver/CMakeFiles/obj.clangDriver.dir/ToolChains/HIP.cpp.o -MF tools/clang/lib/Driver/CMakeFiles/obj.clangDriver.dir/ToolChains/HIP.cpp.o.d -o tools/clang/lib/Driver/CMakeFiles/obj.clangDriver.dir/ToolChains/HIP.cpp.o -c /Users/buildslave/jenkins/workspace/lldb-cmake/llvm-project/clang/lib/Driver/ToolChains/HIP.cpp
[2970/4439] /Users/buildslave/jenkins/workspace/lldb-cmake/host-compiler/bin/clang++  -DGTEST_HAS_RTTI=0 -D_DEBUG -D_GNU_SOURCE -D__STDC_CONSTANT_MACROS -D__STDC_FORMAT_MACROS -D__STDC_LIMIT_MACROS -Itools/clang/lib/Driver -I/Users/buildslave/jenkins/workspace/lldb-cmake/llvm-project/clang/lib/Driver -I/Users/buildslave/jenkins/workspace/lldb-cmake/llvm-project/clang/include -Itools/clang/include -I/Applications/Xcode.app/Contents/Developer/Platforms/MacOSX.platform/Developer/SDKs/MacOSX10.15.sdk/usr/include/libxml2 -Iinclude -I/Users/buildslave/jenkins/workspace/lldb-cmake/llvm-project/llvm/include -Wdocumentation -fPIC -fvisibility-inlines-hidden -Werror=date-time -Werror=unguarded-availability-new -fmodules -fmodules-cache-path=/Users/buildslave/jenkins/workspace/lldb-cmake/lldb-build/module.cache -fcxx-modules -Xclang -fmodules-local-submodule-visibility -Wall -Wextra -Wno-unused-parameter -Wwrite-strings -Wcast-qual -Wmissing-field-initializers -pedantic -Wno-long-long -Wimplicit-fallthrough -Wcovered-switch-default -Wno-noexcept-type -Wnon-virtual-dtor -Wdelete-non-virtual-dtor -Wstring-conversion -fdiagnostics-color -fno-common -Woverloaded-virtual -Wno-nested-anon-types -O3  -isysroot /Applications/Xcode.app/Contents/Developer/Platforms/MacOSX.platform/Developer/SDKs/MacOSX10.15.sdk    -fno-exceptions -fno-rtti -UNDEBUG -std=c++14 -MD -MT tools/clang/lib/Driver/CMakeFiles/obj.clangDriver.dir/ToolChains/Hurd.cpp.o -MF tools/clang/lib/Driver/CMakeFiles/obj.clangDriver.dir/ToolChains/Hurd.cpp.o.d -o tools/clang/lib/Driver/CMakeFiles/obj.clangDriver.dir/ToolChains/Hurd.cpp.o -c /Users/buildslave/jenkins/workspace/lldb-cmake/llvm-project/clang/lib/Driver/ToolChains/Hurd.cpp
[2971/4439] /Users/buildslave/jenkins/workspace/lldb-cmake/host-compiler/bin/clang++  -DGTEST_HAS_RTTI=0 -D_DEBUG -D_GNU_SOURCE -D__STDC_CONSTANT_MACROS -D__STDC_FORMAT_MACROS -D__STDC_LIMIT_MACROS -Itools/clang/lib/Driver -I/Users/buildslave/jenkins/workspace/lldb-cmake/llvm-project/clang/lib/Driver -I/Users/buildslave/jenkins/workspace/lldb-cmake/llvm-project/clang/include -Itools/clang/include -I/Applications/Xcode.app/Contents/Developer/Platforms/MacOSX.platform/Developer/SDKs/MacOSX10.15.sdk/usr/include/libxml2 -Iinclude -I/Users/buildslave/jenkins/workspace/lldb-cmake/llvm-project/llvm/include -Wdocumentation -fPIC -fvisibility-inlines-hidden -Werror=date-time -Werror=unguarded-availability-new -fmodules -fmodules-cache-path=/Users/buildslave/jenkins/workspace/lldb-cmake/lldb-build/module.cache -fcxx-modules -Xclang -fmodules-local-submodule-visibility -Wall -Wextra -Wno-unused-parameter -Wwrite-strings -Wcast-qual -Wmissing-field-initializers -pedantic -Wno-long-long -Wimplicit-fallthrough -Wcovered-switch-default -Wno-noexcept-type -Wnon-virtual-dtor -Wdelete-non-virtual-dtor -Wstring-conversion -fdiagnostics-color -fno-common -Woverloaded-virtual -Wno-nested-anon-types -O3  -isysroot /Applications/Xcode.app/Contents/Developer/Platforms/MacOSX.platform/Developer/SDKs/MacOSX10.15.sdk    -fno-exceptions -fno-rtti -UNDEBUG -std=c++14 -MD -MT tools/clang/lib/Driver/CMakeFiles/obj.clangDriver.dir/ToolChains/MipsLinux.cpp.o -MF tools/clang/lib/Driver/CMakeFiles/obj.clangDriver.dir/ToolChains/MipsLinux.cpp.o.d -o tools/clang/lib/Driver/CMakeFiles/obj.clangDriver.dir/ToolChains/MipsLinux.cpp.o -c /Users/buildslave/jenkins/workspace/lldb-cmake/llvm-project/clang/lib/Driver/ToolChains/MipsLinux.cpp
[2972/4439] /Users/buildslave/jenkins/workspace/lldb-cmake/host-compiler/bin/clang++  -DGTEST_HAS_RTTI=0 -D_DEBUG -D_GNU_SOURCE -D__STDC_CONSTANT_MACROS -D__STDC_FORMAT_MACROS -D__STDC_LIMIT_MACROS -Itools/clang/lib/Driver -I/Users/buildslave/jenkins/workspace/lldb-cmake/llvm-project/clang/lib/Driver -I/Users/buildslave/jenkins/workspace/lldb-cmake/llvm-project/clang/include -Itools/clang/include -I/Applications/Xcode.app/Contents/Developer/Platforms/MacOSX.platform/Developer/SDKs/MacOSX10.15.sdk/usr/include/libxml2 -Iinclude -I/Users/buildslave/jenkins/workspace/lldb-cmake/llvm-project/llvm/include -Wdocumentation -fPIC -fvisibility-inlines-hidden -Werror=date-time -Werror=unguarded-availability-new -fmodules -fmodules-cache-path=/Users/buildslave/jenkins/workspace/lldb-cmake/lldb-build/module.cache -fcxx-modules -Xclang -fmodules-local-submodule-visibility -Wall -Wextra -Wno-unused-parameter -Wwrite-strings -Wcast-qual -Wmissing-field-initializers -pedantic -Wno-long-long -Wimplicit-fallthrough -Wcovered-switch-default -Wno-noexcept-type -Wnon-virtual-dtor -Wdelete-non-virtual-dtor -Wstring-conversion -fdiagnostics-color -fno-common -Woverloaded-virtual -Wno-nested-anon-types -O3  -isysroot /Applications/Xcode.app/Contents/Developer/Platforms/MacOSX.platform/Developer/SDKs/MacOSX10.15.sdk    -fno-exceptions -fno-rtti -UNDEBUG -std=c++14 -MD -MT tools/clang/lib/Driver/CMakeFiles/obj.clangDriver.dir/ToolChains/Hexagon.cpp.o -MF tools/clang/lib/Driver/CMakeFiles/obj.clangDriver.dir/ToolChains/Hexagon.cpp.o.d -o tools/clang/lib/Driver/CMakeFiles/obj.clangDriver.dir/ToolChains/Hexagon.cpp.o -c /Users/buildslave/jenkins/workspace/lldb-cmake/llvm-project/clang/lib/Driver/ToolChains/Hexagon.cpp
[2973/4439] /Users/buildslave/jenkins/workspace/lldb-cmake/host-compiler/bin/clang++  -DGTEST_HAS_RTTI=0 -D_DEBUG -D_GNU_SOURCE -D__STDC_CONSTANT_MACROS -D__STDC_FORMAT_MACROS -D__STDC_LIMIT_MACROS -Itools/clang/lib/Driver -I/Users/buildslave/jenkins/workspace/lldb-cmake/llvm-project/clang/lib/Driver -I/Users/buildslave/jenkins/workspace/lldb-cmake/llvm-project/clang/include -Itools/clang/include -I/Applications/Xcode.app/Contents/Developer/Platforms/MacOSX.platform/Developer/SDKs/MacOSX10.15.sdk/usr/include/libxml2 -Iinclude -I/Users/buildslave/jenkins/workspace/lldb-cmake/llvm-project/llvm/include -Wdocumentation -fPIC -fvisibility-inlines-hidden -Werror=date-time -Werror=unguarded-availability-new -fmodules -fmodules-cache-path=/Users/buildslave/jenkins/workspace/lldb-cmake/lldb-build/module.cache -fcxx-modules -Xclang -fmodules-local-submodule-visibility -Wall -Wextra -Wno-unused-parameter -Wwrite-strings -Wcast-qual -Wmissing-field-initializers -pedantic -Wno-long-long -Wimplicit-fallthrough -Wcovered-switch-default -Wno-noexcept-type -Wnon-virtual-dtor -Wdelete-non-virtual-dtor -Wstring-conversion -fdiagnostics-color -fno-common -Woverloaded-virtual -Wno-nested-anon-types -O3  -isysroot /Applications/Xcode.app/Contents/Developer/Platforms/MacOSX.platform/Developer/SDKs/MacOSX10.15.sdk    -fno-exceptions -fno-rtti -UNDEBUG -std=c++14 -MD -MT tools/clang/lib/Driver/CMakeFiles/obj.clangDriver.dir/ToolChains/Minix.cpp.o -MF tools/clang/lib/Driver/CMakeFiles/obj.clangDriver.dir/ToolChains/Minix.cpp.o.d -o tools/clang/lib/Driver/CMakeFiles/obj.clangDriver.dir/ToolChains/Minix.cpp.o -c /Users/buildslave/jenkins/workspace/lldb-cmake/llvm-project/clang/lib/Driver/ToolChains/Minix.cpp
[2974/4439] /Users/buildslave/jenkins/workspace/lldb-cmake/host-compiler/bin/clang++  -DGTEST_HAS_RTTI=0 -D_DEBUG -D_GNU_SOURCE -D__STDC_CONSTANT_MACROS -D__STDC_FORMAT_MACROS -D__STDC_LIMIT_MACROS -Itools/clang/lib/Driver -I/Users/buildslave/jenkins/workspace/lldb-cmake/llvm-project/clang/lib/Driver -I/Users/buildslave/jenkins/workspace/lldb-cmake/llvm-project/clang/include -Itools/clang/include -I/Applications/Xcode.app/Contents/Developer/Platforms/MacOSX.platform/Developer/SDKs/MacOSX10.15.sdk/usr/include/libxml2 -Iinclude -I/Users/buildslave/jenkins/workspace/lldb-cmake/llvm-project/llvm/include -Wdocumentation -fPIC -fvisibility-inlines-hidden -Werror=date-time -Werror=unguarded-availability-new -fmodules -fmodules-cache-path=/Users/buildslave/jenkins/workspace/lldb-cmake/lldb-build/module.cache -fcxx-modules -Xclang -fmodules-local-submodule-visibility -Wall -Wextra -Wno-unused-parameter -Wwrite-strings -Wcast-qual -Wmissing-field-initializers -pedantic -Wno-long-long -Wimplicit-fallthrough -Wcovered-switch-default -Wno-noexcept-type -Wnon-virtual-dtor -Wdelete-non-virtual-dtor -Wstring-conversion -fdiagnostics-color -fno-common -Woverloaded-virtual -Wno-nested-anon-types -O3  -isysroot /Applications/Xcode.app/Contents/Developer/Platforms/MacOSX.platform/Developer/SDKs/MacOSX10.15.sdk    -fno-exceptions -fno-rtti -UNDEBUG -std=c++14 -MD -MT tools/clang/lib/Driver/CMakeFiles/obj.clangDriver.dir/ToolChains/MinGW.cpp.o -MF tools/clang/lib/Driver/CMakeFiles/obj.clangDriver.dir/ToolChains/MinGW.cpp.o.d -o tools/clang/lib/Driver/CMakeFiles/obj.clangDriver.dir/ToolChains/MinGW.cpp.o -c /Users/buildslave/jenkins/workspace/lldb-cmake/llvm-project/clang/lib/Driver/ToolChains/MinGW.cpp
[2975/4439] /Users/buildslave/jenkins/workspace/lldb-cmake/host-compiler/bin/clang++  -DGTEST_HAS_RTTI=0 -D_DEBUG -D_GNU_SOURCE -D__STDC_CONSTANT_MACROS -D__STDC_FORMAT_MACROS -D__STDC_LIMIT_MACROS -Itools/clang/lib/Driver -I/Users/buildslave/jenkins/workspace/lldb-cmake/llvm-project/clang/lib/Driver -I/Users/buildslave/jenkins/workspace/lldb-cmake/llvm-project/clang/include -Itools/clang/include -I/Applications/Xcode.app/Contents/Developer/Platforms/MacOSX.platform/Developer/SDKs/MacOSX10.15.sdk/usr/include/libxml2 -Iinclude -I/Users/buildslave/jenkins/workspace/lldb-cmake/llvm-project/llvm/include -Wdocumentation -fPIC -fvisibility-inlines-hidden -Werror=date-time -Werror=unguarded-availability-new -fmodules -fmodules-cache-path=/Users/buildslave/jenkins/workspace/lldb-cmake/lldb-build/module.cache -fcxx-modules -Xclang -fmodules-local-submodule-visibility -Wall -Wextra -Wno-unused-parameter -Wwrite-strings -Wcast-qual -Wmissing-field-initializers -pedantic -Wno-long-long -Wimplicit-fallthrough -Wcovered-switch-default -Wno-noexcept-type -Wnon-virtual-dtor -Wdelete-non-virtual-dtor -Wstring-conversion -fdiagnostics-color -fno-common -Woverloaded-virtual -Wno-nested-anon-types -O3  -isysroot /Applications/Xcode.app/Contents/Developer/Platforms/MacOSX.platform/Developer/SDKs/MacOSX10.15.sdk    -fno-exceptions -fno-rtti -UNDEBUG -std=c++14 -MD -MT tools/clang/lib/Driver/CMakeFiles/obj.clangDriver.dir/ToolChains/MSP430.cpp.o -MF tools/clang/lib/Driver/CMakeFiles/obj.clangDriver.dir/ToolChains/MSP430.cpp.o.d -o tools/clang/lib/Driver/CMakeFiles/obj.clangDriver.dir/ToolChains/MSP430.cpp.o -c /Users/buildslave/jenkins/workspace/lldb-cmake/llvm-project/clang/lib/Driver/ToolChains/MSP430.cpp
[2976/4439] /Users/buildslave/jenkins/workspace/lldb-cmake/host-compiler/bin/clang++  -DGTEST_HAS_RTTI=0 -D_DEBUG -D_GNU_SOURCE -D__STDC_CONSTANT_MACROS -D__STDC_FORMAT_MACROS -D__STDC_LIMIT_MACROS -Itools/clang/lib/Driver -I/Users/buildslave/jenkins/workspace/lldb-cmake/llvm-project/clang/lib/Driver -I/Users/buildslave/jenkins/workspace/lldb-cmake/llvm-project/clang/include -Itools/clang/include -I/Applications/Xcode.app/Contents/Developer/Platforms/MacOSX.platform/Developer/SDKs/MacOSX10.15.sdk/usr/include/libxml2 -Iinclude -I/Users/buildslave/jenkins/workspace/lldb-cmake/llvm-project/llvm/include -Wdocumentation -fPIC -fvisibility-inlines-hidden -Werror=date-time -Werror=unguarded-availability-new -fmodules -fmodules-cache-path=/Users/buildslave/jenkins/workspace/lldb-cmake/lldb-build/module.cache -fcxx-modules -Xclang -fmodules-local-submodule-visibility -Wall -Wextra -Wno-unused-parameter -Wwrite-strings -Wcast-qual -Wmissing-field-initializers -pedantic -Wno-long-long -Wimplicit-fallthrough -Wcovered-switch-default -Wno-noexcept-type -Wnon-virtual-dtor -Wdelete-non-virtual-dtor -Wstring-conversion -fdiagnostics-color -fno-common -Woverloaded-virtual -Wno-nested-anon-types -O3  -isysroot /Applications/Xcode.app/Contents/Developer/Platforms/MacOSX.platform/Developer/SDKs/MacOSX10.15.sdk    -fno-exceptions -fno-rtti -UNDEBUG -std=c++14 -MD -MT tools/clang/lib/Driver/CMakeFiles/obj.clangDriver.dir/ToolChains/Myriad.cpp.o -MF tools/clang/lib/Driver/CMakeFiles/obj.clangDriver.dir/ToolChains/Myriad.cpp.o.d -o tools/clang/lib/Driver/CMakeFiles/obj.clangDriver.dir/ToolChains/Myriad.cpp.o -c /Users/buildslave/jenkins/workspace/lldb-cmake/llvm-project/clang/lib/Driver/ToolChains/Myriad.cpp
[2977/4439] /Users/buildslave/jenkins/workspace/lldb-cmake/host-compiler/bin/clang++  -DGTEST_HAS_RTTI=0 -D_DEBUG -D_GNU_SOURCE -D__STDC_CONSTANT_MACROS -D__STDC_FORMAT_MACROS -D__STDC_LIMIT_MACROS -Itools/clang/lib/Driver -I/Users/buildslave/jenkins/workspace/lldb-cmake/llvm-project/clang/lib/Driver -I/Users/buildslave/jenkins/workspace/lldb-cmake/llvm-project/clang/include -Itools/clang/include -I/Applications/Xcode.app/Contents/Developer/Platforms/MacOSX.platform/Developer/SDKs/MacOSX10.15.sdk/usr/include/libxml2 -Iinclude -I/Users/buildslave/jenkins/workspace/lldb-cmake/llvm-project/llvm/include -Wdocumentation -fPIC -fvisibility-inlines-hidden -Werror=date-time -Werror=unguarded-availability-new -fmodules -fmodules-cache-path=/Users/buildslave/jenkins/workspace/lldb-cmake/lldb-build/module.cache -fcxx-modules -Xclang -fmodules-local-submodule-visibility -Wall -Wextra -Wno-unused-parameter -Wwrite-strings -Wcast-qual -Wmissing-field-initializers -pedantic -Wno-long-long -Wimplicit-fallthrough -Wcovered-switch-default -Wno-noexcept-type -Wnon-virtual-dtor -Wdelete-non-virtual-dtor -Wstring-conversion -fdiagnostics-color -fno-common -Woverloaded-virtual -Wno-nested-anon-types -O3  -isysroot /Applications/Xcode.app/Contents/Developer/Platforms/MacOSX.platform/Developer/SDKs/MacOSX10.15.sdk    -fno-exceptions -fno-rtti -UNDEBUG -std=c++14 -MD -MT tools/clang/lib/Driver/CMakeFiles/obj.clangDriver.dir/Driver.cpp.o -MF tools/clang/lib/Driver/CMakeFiles/obj.clangDriver.dir/Driver.cpp.o.d -o tools/clang/lib/Driver/CMakeFiles/obj.clangDriver.dir/Driver.cpp.o -c /Users/buildslave/jenkins/workspace/lldb-cmake/llvm-project/clang/lib/Driver/Driver.cpp
[2978/4439] /Users/buildslave/jenkins/workspace/lldb-cmake/host-compiler/bin/clang++  -DGTEST_HAS_RTTI=0 -D_DEBUG -D_GNU_SOURCE -D__STDC_CONSTANT_MACROS -D__STDC_FORMAT_MACROS -D__STDC_LIMIT_MACROS -Itools/clang/lib/Driver -I/Users/buildslave/jenkins/workspace/lldb-cmake/llvm-project/clang/lib/Driver -I/Users/buildslave/jenkins/workspace/lldb-cmake/llvm-project/clang/include -Itools/clang/include -I/Applications/Xcode.app/Contents/Developer/Platforms/MacOSX.platform/Developer/SDKs/MacOSX10.15.sdk/usr/include/libxml2 -Iinclude -I/Users/buildslave/jenkins/workspace/lldb-cmake/llvm-project/llvm/include -Wdocumentation -fPIC -fvisibility-inlines-hidden -Werror=date-time -Werror=unguarded-availability-new -fmodules -fmodules-cache-path=/Users/buildslave/jenkins/workspace/lldb-cmake/lldb-build/module.cache -fcxx-modules -Xclang -fmodules-local-submodule-visibility -Wall -Wextra -Wno-unused-parameter -Wwrite-strings -Wcast-qual -Wmissing-field-initializers -pedantic -Wno-long-long -Wimplicit-fallthrough -Wcovered-switch-default -Wno-noexcept-type -Wnon-virtual-dtor -Wdelete-non-virtual-dtor -Wstring-conversion -fdiagnostics-color -fno-common -Woverloaded-virtual -Wno-nested-anon-types -O3  -isysroot /Applications/Xcode.app/Contents/Developer/Platforms/MacOSX.platform/Developer/SDKs/MacOSX10.15.sdk    -fno-exceptions -fno-rtti -UNDEBUG -std=c++14 -MD -MT tools/clang/lib/Driver/CMakeFiles/obj.clangDriver.dir/ToolChains/MSVC.cpp.o -MF tools/clang/lib/Driver/CMakeFiles/obj.clangDriver.dir/ToolChains/MSVC.cpp.o.d -o tools/clang/lib/Driver/CMakeFiles/obj.clangDriver.dir/ToolChains/MSVC.cpp.o -c /Users/buildslave/jenkins/workspace/lldb-cmake/llvm-project/clang/lib/Driver/ToolChains/MSVC.cpp
[2979/4439] /Users/buildslave/jenkins/workspace/lldb-cmake/host-compiler/bin/clang++  -DGTEST_HAS_RTTI=0 -D_DEBUG -D_GNU_SOURCE -D__STDC_CONSTANT_MACROS -D__STDC_FORMAT_MACROS -D__STDC_LIMIT_MACROS -Itools/clang/lib/Driver -I/Users/buildslave/jenkins/workspace/lldb-cmake/llvm-project/clang/lib/Driver -I/Users/buildslave/jenkins/workspace/lldb-cmake/llvm-project/clang/include -Itools/clang/include -I/Applications/Xcode.app/Contents/Developer/Platforms/MacOSX.platform/Developer/SDKs/MacOSX10.15.sdk/usr/include/libxml2 -Iinclude -I/Users/buildslave/jenkins/workspace/lldb-cmake/llvm-project/llvm/include -Wdocumentation -fPIC -fvisibility-inlines-hidden -Werror=date-time -Werror=unguarded-availability-new -fmodules -fmodules-cache-path=/Users/buildslave/jenkins/workspace/lldb-cmake/lldb-build/module.cache -fcxx-modules -Xclang -fmodules-local-submodule-visibility -Wall -Wextra -Wno-unused-parameter -Wwrite-strings -Wcast-qual -Wmissing-field-initializers -pedantic -Wno-long-long -Wimplicit-fallthrough -Wcovered-switch-default -Wno-noexcept-type -Wnon-virtual-dtor -Wdelete-non-virtual-dtor -Wstring-conversion -fdiagnostics-color -fno-common -Woverloaded-virtual -Wno-nested-anon-types -O3  -isysroot /Applications/Xcode.app/Contents/Developer/Platforms/MacOSX.platform/Developer/SDKs/MacOSX10.15.sdk    -fno-exceptions -fno-rtti -UNDEBUG -std=c++14 -MD -MT tools/clang/lib/Driver/CMakeFiles/obj.clangDriver.dir/ToolChains/NetBSD.cpp.o -MF tools/clang/lib/Driver/CMakeFiles/obj.clangDriver.dir/ToolChains/NetBSD.cpp.o.d -o tools/clang/lib/Driver/CMakeFiles/obj.clangDriver.dir/ToolChains/NetBSD.cpp.o -c /Users/buildslave/jenkins/workspace/lldb-cmake/llvm-project/clang/lib/Driver/ToolChains/NetBSD.cpp
[2980/4439] /Users/buildslave/jenkins/workspace/lldb-cmake/host-compiler/bin/clang++  -DGTEST_HAS_RTTI=0 -D_DEBUG -D_GNU_SOURCE -D__STDC_CONSTANT_MACROS -D__STDC_FORMAT_MACROS -D__STDC_LIMIT_MACROS -Itools/clang/lib/Driver -I/Users/buildslave/jenkins/workspace/lldb-cmake/llvm-project/clang/lib/Driver -I/Users/buildslave/jenkins/workspace/lldb-cmake/llvm-project/clang/include -Itools/clang/include -I/Applications/Xcode.app/Contents/Developer/Platforms/MacOSX.platform/Developer/SDKs/MacOSX10.15.sdk/usr/include/libxml2 -Iinclude -I/Users/buildslave/jenkins/workspace/lldb-cmake/llvm-project/llvm/include -Wdocumentation -fPIC -fvisibility-inlines-hidden -Werror=date-time -Werror=unguarded-availability-new -fmodules -fmodules-cache-path=/Users/buildslave/jenkins/workspace/lldb-cmake/lldb-build/module.cache -fcxx-modules -Xclang -fmodules-local-submodule-visibility -Wall -Wextra -Wno-unused-parameter -Wwrite-strings -Wcast-qual -Wmissing-field-initializers -pedantic -Wno-long-long -Wimplicit-fallthrough -Wcovered-switch-default -Wno-noexcept-type -Wnon-virtual-dtor -Wdelete-non-virtual-dtor -Wstring-conversion -fdiagnostics-color -fno-common -Woverloaded-virtual -Wno-nested-anon-types -O3  -isysroot /Applications/Xcode.app/Contents/Developer/Platforms/MacOSX.platform/Developer/SDKs/MacOSX10.15.sdk    -fno-exceptions -fno-rtti -UNDEBUG -std=c++14 -MD -MT tools/clang/lib/Driver/CMakeFiles/obj.clangDriver.dir/ToolChains/Fuchsia.cpp.o -MF tools/clang/lib/Driver/CMakeFiles/obj.clangDriver.dir/ToolChains/Fuchsia.cpp.o.d -o tools/clang/lib/Driver/CMakeFiles/obj.clangDriver.dir/ToolChains/Fuchsia.cpp.o -c /Users/buildslave/jenkins/workspace/lldb-cmake/llvm-project/clang/lib/Driver/ToolChains/Fuchsia.cpp
[2981/4439] /Users/buildslave/jenkins/workspace/lldb-cmake/host-compiler/bin/clang++  -DGTEST_HAS_RTTI=0 -D_DEBUG -D_GNU_SOURCE -D__STDC_CONSTANT_MACROS -D__STDC_FORMAT_MACROS -D__STDC_LIMIT_MACROS -Itools/clang/lib/Driver -I/Users/buildslave/jenkins/workspace/lldb-cmake/llvm-project/clang/lib/Driver -I/Users/buildslave/jenkins/workspace/lldb-cmake/llvm-project/clang/include -Itools/clang/include -I/Applications/Xcode.app/Contents/Developer/Platforms/MacOSX.platform/Developer/SDKs/MacOSX10.15.sdk/usr/include/libxml2 -Iinclude -I/Users/buildslave/jenkins/workspace/lldb-cmake/llvm-project/llvm/include -Wdocumentation -fPIC -fvisibility-inlines-hidden -Werror=date-time -Werror=unguarded-availability-new -fmodules -fmodules-cache-path=/Users/buildslave/jenkins/workspace/lldb-cmake/lldb-build/module.cache -fcxx-modules -Xclang -fmodules-local-submodule-visibility -Wall -Wextra -Wno-unused-parameter -Wwrite-strings -Wcast-qual -Wmissing-field-initializers -pedantic -Wno-long-long -Wimplicit-fallthrough -Wcovered-switch-default -Wno-noexcept-type -Wnon-virtual-dtor -Wdelete-non-virtual-dtor -Wstring-conversion -fdiagnostics-color -fno-common -Woverloaded-virtual -Wno-nested-anon-types -O3  -isysroot /Applications/Xcode.app/Contents/Developer/Platforms/MacOSX.platform/Developer/SDKs/MacOSX10.15.sdk    -fno-exceptions -fno-rtti -UNDEBUG -std=c++14 -MD -MT tools/clang/lib/Driver/CMakeFiles/obj.clangDriver.dir/ToolChains/Linux.cpp.o -MF tools/clang/lib/Driver/CMakeFiles/obj.clangDriver.dir/ToolChains/Linux.cpp.o.d -o tools/clang/lib/Driver/CMakeFiles/obj.clangDriver.dir/ToolChains/Linux.cpp.o -c /Users/buildslave/jenkins/workspace/lldb-cmake/llvm-project/clang/lib/Driver/ToolChains/Linux.cpp
[2982/4439] /Users/buildslave/jenkins/workspace/lldb-cmake/host-compiler/bin/clang++  -DGTEST_HAS_RTTI=0 -D_DEBUG -D_GNU_SOURCE -D__STDC_CONSTANT_MACROS -D__STDC_FORMAT_MACROS -D__STDC_LIMIT_MACROS -Itools/clang/lib/Driver -I/Users/buildslave/jenkins/workspace/lldb-cmake/llvm-project/clang/lib/Driver -I/Users/buildslave/jenkins/workspace/lldb-cmake/llvm-project/clang/include -Itools/clang/include -I/Applications/Xcode.app/Contents/Developer/Platforms/MacOSX.platform/Developer/SDKs/MacOSX10.15.sdk/usr/include/libxml2 -Iinclude -I/Users/buildslave/jenkins/workspace/lldb-cmake/llvm-project/llvm/include -Wdocumentation -fPIC -fvisibility-inlines-hidden -Werror=date-time -Werror=unguarded-availability-new -fmodules -fmodules-cache-path=/Users/buildslave/jenkins/workspace/lldb-cmake/lldb-build/module.cache -fcxx-modules -Xclang -fmodules-local-submodule-visibility -Wall -Wextra -Wno-unused-parameter -Wwrite-strings -Wcast-qual -Wmissing-field-initializers -pedantic -Wno-long-long -Wimplicit-fallthrough -Wcovered-switch-default -Wno-noexcept-type -Wnon-virtual-dtor -Wdelete-non-virtual-dtor -Wstring-conversion -fdiagnostics-color -fno-common -Woverloaded-virtual -Wno-nested-anon-types -O3  -isysroot /Applications/Xcode.app/Contents/Developer/Platforms/MacOSX.platform/Developer/SDKs/MacOSX10.15.sdk    -fno-exceptions -fno-rtti -UNDEBUG -std=c++14 -MD -MT tools/clang/lib/Driver/CMakeFiles/obj.clangDriver.dir/ToolChains/NaCl.cpp.o -MF tools/clang/lib/Driver/CMakeFiles/obj.clangDriver.dir/ToolChains/NaCl.cpp.o.d -o tools/clang/lib/Driver/CMakeFiles/obj.clangDriver.dir/ToolChains/NaCl.cpp.o -c /Users/buildslave/jenkins/workspace/lldb-cmake/llvm-project/clang/lib/Driver/ToolChains/NaCl.cpp
[2983/4439] /Users/buildslave/jenkins/workspace/lldb-cmake/host-compiler/bin/clang++  -DGTEST_HAS_RTTI=0 -D_DEBUG -D_GNU_SOURCE -D__STDC_CONSTANT_MACROS -D__STDC_FORMAT_MACROS -D__STDC_LIMIT_MACROS -Itools/clang/lib/Driver -I/Users/buildslave/jenkins/workspace/lldb-cmake/llvm-project/clang/lib/Driver -I/Users/buildslave/jenkins/workspace/lldb-cmake/llvm-project/clang/include -Itools/clang/include -I/Applications/Xcode.app/Contents/Developer/Platforms/MacOSX.platform/Developer/SDKs/MacOSX10.15.sdk/usr/include/libxml2 -Iinclude -I/Users/buildslave/jenkins/workspace/lldb-cmake/llvm-project/llvm/include -Wdocumentation -fPIC -fvisibility-inlines-hidden -Werror=date-time -Werror=unguarded-availability-new -fmodules -fmodules-cache-path=/Users/buildslave/jenkins/workspace/lldb-cmake/lldb-build/module.cache -fcxx-modules -Xclang -fmodules-local-submodule-visibility -Wall -Wextra -Wno-unused-parameter -Wwrite-strings -Wcast-qual -Wmissing-field-initializers -pedantic -Wno-long-long -Wimplicit-fallthrough -Wcovered-switch-default -Wno-noexcept-type -Wnon-virtual-dtor -Wdelete-non-virtual-dtor -Wstring-conversion -fdiagnostics-color -fno-common -Woverloaded-virtual -Wno-nested-anon-types -O3  -isysroot /Applications/Xcode.app/Contents/Developer/Platforms/MacOSX.platform/Developer/SDKs/MacOSX10.15.sdk    -fno-exceptions -fno-rtti -UNDEBUG -std=c++14 -MD -MT tools/clang/lib/Driver/CMakeFiles/obj.clangDriver.dir/ToolChains/OpenBSD.cpp.o -MF tools/clang/lib/Driver/CMakeFiles/obj.clangDriver.dir/ToolChains/OpenBSD.cpp.o.d -o tools/clang/lib/Driver/CMakeFiles/obj.clangDriver.dir/ToolChains/OpenBSD.cpp.o -c /Users/buildslave/jenkins/workspace/lldb-cmake/llvm-project/clang/lib/Driver/ToolChains/OpenBSD.cpp
[2984/4439] /Users/buildslave/jenkins/workspace/lldb-cmake/host-compiler/bin/clang++  -DGTEST_HAS_RTTI=0 -D_DEBUG -D_GNU_SOURCE -D__STDC_CONSTANT_MACROS -D__STDC_FORMAT_MACROS -D__STDC_LIMIT_MACROS -Itools/clang/lib/Driver -I/Users/buildslave/jenkins/workspace/lldb-cmake/llvm-project/clang/lib/Driver -I/Users/buildslave/jenkins/workspace/lldb-cmake/llvm-project/clang/include -Itools/clang/include -I/Applications/Xcode.app/Contents/Developer/Platforms/MacOSX.platform/Developer/SDKs/MacOSX10.15.sdk/usr/include/libxml2 -Iinclude -I/Users/buildslave/jenkins/workspace/lldb-cmake/llvm-project/llvm/include -Wdocumentation -fPIC -fvisibility-inlines-hidden -Werror=date-time -Werror=unguarded-availability-new -fmodules -fmodules-cache-path=/Users/buildslave/jenkins/workspace/lldb-cmake/lldb-build/module.cache -fcxx-modules -Xclang -fmodules-local-submodule-visibility -Wall -Wextra -Wno-unused-parameter -Wwrite-strings -Wcast-qual -Wmissing-field-initializers -pedantic -Wno-long-long -Wimplicit-fallthrough -Wcovered-switch-default -Wno-noexcept-type -Wnon-virtual-dtor -Wdelete-non-virtual-dtor -Wstring-conversion -fdiagnostics-color -fno-common -Woverloaded-virtual -Wno-nested-anon-types -O3  -isysroot /Applications/Xcode.app/Contents/Developer/Platforms/MacOSX.platform/Developer/SDKs/MacOSX10.15.sdk    -fno-exceptions -fno-rtti -UNDEBUG -std=c++14 -MD -MT tools/clang/lib/Driver/CMakeFiles/obj.clangDriver.dir/ToolChains/TCE.cpp.o -MF tools/clang/lib/Driver/CMakeFiles/obj.clangDriver.dir/ToolChains/TCE.cpp.o.d -o tools/clang/lib/Driver/CMakeFiles/obj.clangDriver.dir/ToolChains/TCE.cpp.o -c /Users/buildslave/jenkins/workspace/lldb-cmake/llvm-project/clang/lib/Driver/ToolChains/TCE.cpp
[2985/4439] /Users/buildslave/jenkins/workspace/lldb-cmake/host-compiler/bin/clang++  -DGTEST_HAS_RTTI=0 -D_DEBUG -D_GNU_SOURCE -D__STDC_CONSTANT_MACROS -D__STDC_FORMAT_MACROS -D__STDC_LIMIT_MACROS -Itools/clang/lib/Driver -I/Users/buildslave/jenkins/workspace/lldb-cmake/llvm-project/clang/lib/Driver -I/Users/buildslave/jenkins/workspace/lldb-cmake/llvm-project/clang/include -Itools/clang/include -I/Applications/Xcode.app/Contents/Developer/Platforms/MacOSX.platform/Developer/SDKs/MacOSX10.15.sdk/usr/include/libxml2 -Iinclude -I/Users/buildslave/jenkins/workspace/lldb-cmake/llvm-project/llvm/include -Wdocumentation -fPIC -fvisibility-inlines-hidden -Werror=date-time -Werror=unguarded-availability-new -fmodules -fmodules-cache-path=/Users/buildslave/jenkins/workspace/lldb-cmake/lldb-build/module.cache -fcxx-modules -Xclang -fmodules-local-submodule-visibility -Wall -Wextra -Wno-unused-parameter -Wwrite-strings -Wcast-qual -Wmissing-field-initializers -pedantic -Wno-long-long -Wimplicit-fallthrough -Wcovered-switch-default -Wno-noexcept-type -Wnon-virtual-dtor -Wdelete-non-virtual-dtor -Wstring-conversion -fdiagnostics-color -fno-common -Woverloaded-virtual -Wno-nested-anon-types -O3  -isysroot /Applications/Xcode.app/Contents/Developer/Platforms/MacOSX.platform/Developer/SDKs/MacOSX10.15.sdk    -fno-exceptions -fno-rtti -UNDEBUG -std=c++14 -MD -MT tools/clang/lib/Driver/CMakeFiles/obj.clangDriver.dir/ToolChains/XCore.cpp.o -MF tools/clang/lib/Driver/CMakeFiles/obj.clangDriver.dir/ToolChains/XCore.cpp.o.d -o tools/clang/lib/Driver/CMakeFiles/obj.clangDriver.dir/ToolChains/XCore.cpp.o -c /Users/buildslave/jenkins/workspace/lldb-cmake/llvm-project/clang/lib/Driver/ToolChains/XCore.cpp
[2986/4439] /Users/buildslave/jenkins/workspace/lldb-cmake/host-compiler/bin/clang++  -DGTEST_HAS_RTTI=0 -D_DEBUG -D_GNU_SOURCE -D__STDC_CONSTANT_MACROS -D__STDC_FORMAT_MACROS -D__STDC_LIMIT_MACROS -Itools/clang/lib/Driver -I/Users/buildslave/jenkins/workspace/lldb-cmake/llvm-project/clang/lib/Driver -I/Users/buildslave/jenkins/workspace/lldb-cmake/llvm-project/clang/include -Itools/clang/include -I/Applications/Xcode.app/Contents/Developer/Platforms/MacOSX.platform/Developer/SDKs/MacOSX10.15.sdk/usr/include/libxml2 -Iinclude -I/Users/buildslave/jenkins/workspace/lldb-cmake/llvm-project/llvm/include -Wdocumentation -fPIC -fvisibility-inlines-hidden -Werror=date-time -Werror=unguarded-availability-new -fmodules -fmodules-cache-path=/Users/buildslave/jenkins/workspace/lldb-cmake/lldb-build/module.cache -fcxx-modules -Xclang -fmodules-local-submodule-visibility -Wall -Wextra -Wno-unused-parameter -Wwrite-strings -Wcast-qual -Wmissing-field-initializers -pedantic -Wno-long-long -Wimplicit-fallthrough -Wcovered-switch-default -Wno-noexcept-type -Wnon-virtual-dtor -Wdelete-non-virtual-dtor -Wstring-conversion -fdiagnostics-color -fno-common -Woverloaded-virtual -Wno-nested-anon-types -O3  -isysroot /Applications/Xcode.app/Contents/Developer/Platforms/MacOSX.platform/Developer/SDKs/MacOSX10.15.sdk    -fno-exceptions -fno-rtti -UNDEBUG -std=c++14 -MD -MT tools/clang/lib/Driver/CMakeFiles/obj.clangDriver.dir/ToolChains/VEToolchain.cpp.o -MF tools/clang/lib/Driver/CMakeFiles/obj.clangDriver.dir/ToolChains/VEToolchain.cpp.o.d -o tools/clang/lib/Driver/CMakeFiles/obj.clangDriver.dir/ToolChains/VEToolchain.cpp.o -c /Users/buildslave/jenkins/workspace/lldb-cmake/llvm-project/clang/lib/Driver/ToolChains/VEToolchain.cpp
[2987/4439] /Users/buildslave/jenkins/workspace/lldb-cmake/host-compiler/bin/clang++  -DGTEST_HAS_RTTI=0 -D_DEBUG -D_GNU_SOURCE -D__STDC_CONSTANT_MACROS -D__STDC_FORMAT_MACROS -D__STDC_LIMIT_MACROS -Itools/clang/lib/Driver -I/Users/buildslave/jenkins/workspace/lldb-cmake/llvm-project/clang/lib/Driver -I/Users/buildslave/jenkins/workspace/lldb-cmake/llvm-project/clang/include -Itools/clang/include -I/Applications/Xcode.app/Contents/Developer/Platforms/MacOSX.platform/Developer/SDKs/MacOSX10.15.sdk/usr/include/libxml2 -Iinclude -I/Users/buildslave/jenkins/workspace/lldb-cmake/llvm-project/llvm/include -Wdocumentation -fPIC -fvisibility-inlines-hidden -Werror=date-time -Werror=unguarded-availability-new -fmodules -fmodules-cache-path=/Users/buildslave/jenkins/workspace/lldb-cmake/lldb-build/module.cache -fcxx-modules -Xclang -fmodules-local-submodule-visibility -Wall -Wextra -Wno-unused-parameter -Wwrite-strings -Wcast-qual -Wmissing-field-initializers -pedantic -Wno-long-long -Wimplicit-fallthrough -Wcovered-switch-default -Wno-noexcept-type -Wnon-virtual-dtor -Wdelete-non-virtual-dtor -Wstring-conversion -fdiagnostics-color -fno-common -Woverloaded-virtual -Wno-nested-anon-types -O3  -isysroot /Applications/Xcode.app/Contents/Developer/Platforms/MacOSX.platform/Developer/SDKs/MacOSX10.15.sdk    -fno-exceptions -fno-rtti -UNDEBUG -std=c++14 -MD -MT tools/clang/lib/Driver/CMakeFiles/obj.clangDriver.dir/ToolChains/PPCLinux.cpp.o -MF tools/clang/lib/Driver/CMakeFiles/obj.clangDriver.dir/ToolChains/PPCLinux.cpp.o.d -o tools/clang/lib/Driver/CMakeFiles/obj.clangDriver.dir/ToolChains/PPCLinux.cpp.o -c /Users/buildslave/jenkins/workspace/lldb-cmake/llvm-project/clang/lib/Driver/ToolChains/PPCLinux.cpp
[2988/4439] /Users/buildslave/jenkins/workspace/lldb-cmake/host-compiler/bin/clang++  -DGTEST_HAS_RTTI=0 -D_DEBUG -D_GNU_SOURCE -D__STDC_CONSTANT_MACROS -D__STDC_FORMAT_MACROS -D__STDC_LIMIT_MACROS -Itools/clang/lib/Driver -I/Users/buildslave/jenkins/workspace/lldb-cmake/llvm-project/clang/lib/Driver -I/Users/buildslave/jenkins/workspace/lldb-cmake/llvm-project/clang/include -Itools/clang/include -I/Applications/Xcode.app/Contents/Developer/Platforms/MacOSX.platform/Developer/SDKs/MacOSX10.15.sdk/usr/include/libxml2 -Iinclude -I/Users/buildslave/jenkins/workspace/lldb-cmake/llvm-project/llvm/include -Wdocumentation -fPIC -fvisibility-inlines-hidden -Werror=date-time -Werror=unguarded-availability-new -fmodules -fmodules-cache-path=/Users/buildslave/jenkins/workspace/lldb-cmake/lldb-build/module.cache -fcxx-modules -Xclang -fmodules-local-submodule-visibility -Wall -Wextra -Wno-unused-parameter -Wwrite-strings -Wcast-qual -Wmissing-field-initializers -pedantic -Wno-long-long -Wimplicit-fallthrough -Wcovered-switch-default -Wno-noexcept-type -Wnon-virtual-dtor -Wdelete-non-virtual-dtor -Wstring-conversion -fdiagnostics-color -fno-common -Woverloaded-virtual -Wno-nested-anon-types -O3  -isysroot /Applications/Xcode.app/Contents/Developer/Platforms/MacOSX.platform/Developer/SDKs/MacOSX10.15.sdk    -fno-exceptions -fno-rtti -UNDEBUG -std=c++14 -MD -MT tools/clang/lib/Driver/CMakeFiles/obj.clangDriver.dir/ToolChains/Solaris.cpp.o -MF tools/clang/lib/Driver/CMakeFiles/obj.clangDriver.dir/ToolChains/Solaris.cpp.o.d -o tools/clang/lib/Driver/CMakeFiles/obj.clangDriver.dir/ToolChains/Solaris.cpp.o -c /Users/buildslave/jenkins/workspace/lldb-cmake/llvm-project/clang/lib/Driver/ToolChains/Solaris.cpp
[2989/4439] /Users/buildslave/jenkins/workspace/lldb-cmake/host-compiler/bin/clang++  -DGTEST_HAS_RTTI=0 -D_DEBUG -D_GNU_SOURCE -D__STDC_CONSTANT_MACROS -D__STDC_FORMAT_MACROS -D__STDC_LIMIT_MACROS -Itools/clang/lib/Driver -I/Users/buildslave/jenkins/workspace/lldb-cmake/llvm-project/clang/lib/Driver -I/Users/buildslave/jenkins/workspace/lldb-cmake/llvm-project/clang/include -Itools/clang/include -I/Applications/Xcode.app/Contents/Developer/Platforms/MacOSX.platform/Developer/SDKs/MacOSX10.15.sdk/usr/include/libxml2 -Iinclude -I/Users/buildslave/jenkins/workspace/lldb-cmake/llvm-project/llvm/include -Wdocumentation -fPIC -fvisibility-inlines-hidden -Werror=date-time -Werror=unguarded-availability-new -fmodules -fmodules-cache-path=/Users/buildslave/jenkins/workspace/lldb-cmake/lldb-build/module.cache -fcxx-modules -Xclang -fmodules-local-submodule-visibility -Wall -Wextra -Wno-unused-parameter -Wwrite-strings -Wcast-qual -Wmissing-field-initializers -pedantic -Wno-long-long -Wimplicit-fallthrough -Wcovered-switch-default -Wno-noexcept-type -Wnon-virtual-dtor -Wdelete-non-virtual-dtor -Wstring-conversion -fdiagnostics-color -fno-common -Woverloaded-virtual -Wno-nested-anon-types -O3  -isysroot /Applications/Xcode.app/Contents/Developer/Platforms/MacOSX.platform/Developer/SDKs/MacOSX10.15.sdk    -fno-exceptions -fno-rtti -UNDEBUG -std=c++14 -MD -MT tools/clang/lib/Driver/CMakeFiles/obj.clangDriver.dir/ToolChains/RISCVToolchain.cpp.o -MF tools/clang/lib/Driver/CMakeFiles/obj.clangDriver.dir/ToolChains/RISCVToolchain.cpp.o.d -o tools/clang/lib/Driver/CMakeFiles/obj.clangDriver.dir/ToolChains/RISCVToolchain.cpp.o -c /Users/buildslave/jenkins/workspace/lldb-cmake/llvm-project/clang/lib/Driver/ToolChains/RISCVToolchain.cpp
[2990/4439] /Users/buildslave/jenkins/workspace/lldb-cmake/host-compiler/bin/clang++  -DGTEST_HAS_RTTI=0 -D_DEBUG -D_GNU_SOURCE -D__STDC_CONSTANT_MACROS -D__STDC_FORMAT_MACROS -D__STDC_LIMIT_MACROS -Itools/clang/lib/Driver -I/Users/buildslave/jenkins/workspace/lldb-cmake/llvm-project/clang/lib/Driver -I/Users/buildslave/jenkins/workspace/lldb-cmake/llvm-project/clang/include -Itools/clang/include -I/Applications/Xcode.app/Contents/Developer/Platforms/MacOSX.platform/Developer/SDKs/MacOSX10.15.sdk/usr/include/libxml2 -Iinclude -I/Users/buildslave/jenkins/workspace/lldb-cmake/llvm-project/llvm/include -Wdocumentation -fPIC -fvisibility-inlines-hidden -Werror=date-time -Werror=unguarded-availability-new -fmodules -fmodules-cache-path=/Users/buildslave/jenkins/workspace/lldb-cmake/lldb-build/module.cache -fcxx-modules -Xclang -fmodules-local-submodule-visibility -Wall -Wextra -Wno-unused-parameter -Wwrite-strings -Wcast-qual -Wmissing-field-initializers -pedantic -Wno-long-long -Wimplicit-fallthrough -Wcovered-switch-default -Wno-noexcept-type -Wnon-virtual-dtor -Wdelete-non-virtual-dtor -Wstring-conversion -fdiagnostics-color -fno-common -Woverloaded-virtual -Wno-nested-anon-types -O3  -isysroot /Applications/Xcode.app/Contents/Developer/Platforms/MacOSX.platform/Developer/SDKs/MacOSX10.15.sdk    -fno-exceptions -fno-rtti -UNDEBUG -std=c++14 -MD -MT tools/clang/lib/Driver/CMakeFiles/obj.clangDriver.dir/ToolChains/PS4CPU.cpp.o -MF tools/clang/lib/Driver/CMakeFiles/obj.clangDriver.dir/ToolChains/PS4CPU.cpp.o.d -o tools/clang/lib/Driver/CMakeFiles/obj.clangDriver.dir/ToolChains/PS4CPU.cpp.o -c /Users/buildslave/jenkins/workspace/lldb-cmake/llvm-project/clang/lib/Driver/ToolChains/PS4CPU.cpp
[2991/4439] /Users/buildslave/jenkins/workspace/lldb-cmake/host-compiler/bin/clang++  -DGTEST_HAS_RTTI=0 -D_DEBUG -D_GNU_SOURCE -D__STDC_CONSTANT_MACROS -D__STDC_FORMAT_MACROS -D__STDC_LIMIT_MACROS -Itools/clang/lib/Driver -I/Users/buildslave/jenkins/workspace/lldb-cmake/llvm-project/clang/lib/Driver -I/Users/buildslave/jenkins/workspace/lldb-cmake/llvm-project/clang/include -Itools/clang/include -I/Applications/Xcode.app/Contents/Developer/Platforms/MacOSX.platform/Developer/SDKs/MacOSX10.15.sdk/usr/include/libxml2 -Iinclude -I/Users/buildslave/jenkins/workspace/lldb-cmake/llvm-project/llvm/include -Wdocumentation -fPIC -fvisibility-inlines-hidden -Werror=date-time -Werror=unguarded-availability-new -fmodules -fmodules-cache-path=/Users/buildslave/jenkins/workspace/lldb-cmake/lldb-build/module.cache -fcxx-modules -Xclang -fmodules-local-submodule-visibility -Wall -Wextra -Wno-unused-parameter -Wwrite-strings -Wcast-qual -Wmissing-field-initializers -pedantic -Wno-long-long -Wimplicit-fallthrough -Wcovered-switch-default -Wno-noexcept-type -Wnon-virtual-dtor -Wdelete-non-virtual-dtor -Wstring-conversion -fdiagnostics-color -fno-common -Woverloaded-virtual -Wno-nested-anon-types -O3  -isysroot /Applications/Xcode.app/Contents/Developer/Platforms/MacOSX.platform/Developer/SDKs/MacOSX10.15.sdk    -fno-exceptions -fno-rtti -UNDEBUG -std=c++14 -MD -MT tools/clang/lib/Driver/CMakeFiles/obj.clangDriver.dir/ToolChains/WebAssembly.cpp.o -MF tools/clang/lib/Driver/CMakeFiles/obj.clangDriver.dir/ToolChains/WebAssembly.cpp.o.d -o tools/clang/lib/Driver/CMakeFiles/obj.clangDriver.dir/ToolChains/WebAssembly.cpp.o -c /Users/buildslave/jenkins/workspace/lldb-cmake/llvm-project/clang/lib/Driver/ToolChains/WebAssembly.cpp
[2992/4439] /Users/buildslave/jenkins/workspace/lldb-cmake/host-compiler/bin/clang++  -DGTEST_HAS_RTTI=0 -D_DEBUG -D_GNU_SOURCE -D__STDC_CONSTANT_MACROS -D__STDC_FORMAT_MACROS -D__STDC_LIMIT_MACROS -Itools/clang/lib/Driver -I/Users/buildslave/jenkins/workspace/lldb-cmake/llvm-project/clang/lib/Driver -I/Users/buildslave/jenkins/workspace/lldb-cmake/llvm-project/clang/include -Itools/clang/include -I/Applications/Xcode.app/Contents/Developer/Platforms/MacOSX.platform/Developer/SDKs/MacOSX10.15.sdk/usr/include/libxml2 -Iinclude -I/Users/buildslave/jenkins/workspace/lldb-cmake/llvm-project/llvm/include -Wdocumentation -fPIC -fvisibility-inlines-hidden -Werror=date-time -Werror=unguarded-availability-new -fmodules -fmodules-cache-path=/Users/buildslave/jenkins/workspace/lldb-cmake/lldb-build/module.cache -fcxx-modules -Xclang -fmodules-local-submodule-visibility -Wall -Wextra -Wno-unused-parameter -Wwrite-strings -Wcast-qual -Wmissing-field-initializers -pedantic -Wno-long-long -Wimplicit-fallthrough -Wcovered-switch-default -Wno-noexcept-type -Wnon-virtual-dtor -Wdelete-non-virtual-dtor -Wstring-conversion -fdiagnostics-color -fno-common -Woverloaded-virtual -Wno-nested-anon-types -O3  -isysroot /Applications/Xcode.app/Contents/Developer/Platforms/MacOSX.platform/Developer/SDKs/MacOSX10.15.sdk    -fno-exceptions -fno-rtti -UNDEBUG -std=c++14 -MD -MT tools/clang/lib/Driver/CMakeFiles/obj.clangDriver.dir/ToolChains/InterfaceStubs.cpp.o -MF tools/clang/lib/Driver/CMakeFiles/obj.clangDriver.dir/ToolChains/InterfaceStubs.cpp.o.d -o tools/clang/lib/Driver/CMakeFiles/obj.clangDriver.dir/ToolChains/InterfaceStubs.cpp.o -c /Users/buildslave/jenkins/workspace/lldb-cmake/llvm-project/clang/lib/Driver/ToolChains/InterfaceStubs.cpp
[2993/4439] /Users/buildslave/jenkins/workspace/lldb-cmake/host-compiler/bin/clang++  -DGTEST_HAS_RTTI=0 -D_DEBUG -D_GNU_SOURCE -D__STDC_CONSTANT_MACROS -D__STDC_FORMAT_MACROS -D__STDC_LIMIT_MACROS -Itools/clang/lib/Driver -I/Users/buildslave/jenkins/workspace/lldb-cmake/llvm-project/clang/lib/Driver -I/Users/buildslave/jenkins/workspace/lldb-cmake/llvm-project/clang/include -Itools/clang/include -I/Applications/Xcode.app/Contents/Developer/Platforms/MacOSX.platform/Developer/SDKs/MacOSX10.15.sdk/usr/include/libxml2 -Iinclude -I/Users/buildslave/jenkins/workspace/lldb-cmake/llvm-project/llvm/include -Wdocumentation -fPIC -fvisibility-inlines-hidden -Werror=date-time -Werror=unguarded-availability-new -fmodules -fmodules-cache-path=/Users/buildslave/jenkins/workspace/lldb-cmake/lldb-build/module.cache -fcxx-modules -Xclang -fmodules-local-submodule-visibility -Wall -Wextra -Wno-unused-parameter -Wwrite-strings -Wcast-qual -Wmissing-field-initializers -pedantic -Wno-long-long -Wimplicit-fallthrough -Wcovered-switch-default -Wno-noexcept-type -Wnon-virtual-dtor -Wdelete-non-virtual-dtor -Wstring-conversion -fdiagnostics-color -fno-common -Woverloaded-virtual -Wno-nested-anon-types -O3  -isysroot /Applications/Xcode.app/Contents/Developer/Platforms/MacOSX.platform/Developer/SDKs/MacOSX10.15.sdk    -fno-exceptions -fno-rtti -UNDEBUG -std=c++14 -MD -MT tools/clang/lib/Driver/CMakeFiles/obj.clangDriver.dir/Types.cpp.o -MF tools/clang/lib/Driver/CMakeFiles/obj.clangDriver.dir/Types.cpp.o.d -o tools/clang/lib/Driver/CMakeFiles/obj.clangDriver.dir/Types.cpp.o -c /Users/buildslave/jenkins/workspace/lldb-cmake/llvm-project/clang/lib/Driver/Types.cpp
[2994/4439] /Users/buildslave/jenkins/workspace/lldb-cmake/host-compiler/bin/clang++  -DGTEST_HAS_RTTI=0 -D_DEBUG -D_GNU_SOURCE -D__STDC_CONSTANT_MACROS -D__STDC_FORMAT_MACROS -D__STDC_LIMIT_MACROS -Itools/clang/lib/DirectoryWatcher -I/Users/buildslave/jenkins/workspace/lldb-cmake/llvm-project/clang/lib/DirectoryWatcher -I/Users/buildslave/jenkins/workspace/lldb-cmake/llvm-project/clang/include -Itools/clang/include -I/Applications/Xcode.app/Contents/Developer/Platforms/MacOSX.platform/Developer/SDKs/MacOSX10.15.sdk/usr/include/libxml2 -Iinclude -I/Users/buildslave/jenkins/workspace/lldb-cmake/llvm-project/llvm/include -Wdocumentation -fPIC -fvisibility-inlines-hidden -Werror=date-time -Werror=unguarded-availability-new -fmodules -fmodules-cache-path=/Users/buildslave/jenkins/workspace/lldb-cmake/lldb-build/module.cache -fcxx-modules -Xclang -fmodules-local-submodule-visibility -Wall -Wextra -Wno-unused-parameter -Wwrite-strings -Wcast-qual -Wmissing-field-initializers -pedantic -Wno-long-long -Wimplicit-fallthrough -Wcovered-switch-default -Wno-noexcept-type -Wnon-virtual-dtor -Wdelete-non-virtual-dtor -Wstring-conversion -fdiagnostics-color -fno-common -Woverloaded-virtual -Wno-nested-anon-types -O3  -isysroot /Applications/Xcode.app/Contents/Developer/Platforms/MacOSX.platform/Developer/SDKs/MacOSX10.15.sdk    -fno-exceptions -fno-rtti -UNDEBUG -std=c++14 -MD -MT tools/clang/lib/DirectoryWatcher/CMakeFiles/obj.clangDirectoryWatcher.dir/DirectoryScanner.cpp.o -MF tools/clang/lib/DirectoryWatcher/CMakeFiles/obj.clangDirectoryWatcher.dir/DirectoryScanner.cpp.o.d -o tools/clang/lib/DirectoryWatcher/CMakeFiles/obj.clangDirectoryWatcher.dir/DirectoryScanner.cpp.o -c /Users/buildslave/jenkins/workspace/lldb-cmake/llvm-project/clang/lib/DirectoryWatcher/DirectoryScanner.cpp
[2995/4439] /Users/buildslave/jenkins/workspace/lldb-cmake/host-compiler/bin/clang++  -DGTEST_HAS_RTTI=0 -D_DEBUG -D_GNU_SOURCE -D__STDC_CONSTANT_MACROS -D__STDC_FORMAT_MACROS -D__STDC_LIMIT_MACROS -Itools/clang/lib/Driver -I/Users/buildslave/jenkins/workspace/lldb-cmake/llvm-project/clang/lib/Driver -I/Users/buildslave/jenkins/workspace/lldb-cmake/llvm-project/clang/include -Itools/clang/include -I/Applications/Xcode.app/Contents/Developer/Platforms/MacOSX.platform/Developer/SDKs/MacOSX10.15.sdk/usr/include/libxml2 -Iinclude -I/Users/buildslave/jenkins/workspace/lldb-cmake/llvm-project/llvm/include -Wdocumentation -fPIC -fvisibility-inlines-hidden -Werror=date-time -Werror=unguarded-availability-new -fmodules -fmodules-cache-path=/Users/buildslave/jenkins/workspace/lldb-cmake/lldb-build/module.cache -fcxx-modules -Xclang -fmodules-local-submodule-visibility -Wall -Wextra -Wno-unused-parameter -Wwrite-strings -Wcast-qual -Wmissing-field-initializers -pedantic -Wno-long-long -Wimplicit-fallthrough -Wcovered-switch-default -Wno-noexcept-type -Wnon-virtual-dtor -Wdelete-non-virtual-dtor -Wstring-conversion -fdiagnostics-color -fno-common -Woverloaded-virtual -Wno-nested-anon-types -O3  -isysroot /Applications/Xcode.app/Contents/Developer/Platforms/MacOSX.platform/Developer/SDKs/MacOSX10.15.sdk    -fno-exceptions -fno-rtti -UNDEBUG -std=c++14 -MD -MT tools/clang/lib/Driver/CMakeFiles/obj.clangDriver.dir/ToolChains/Gnu.cpp.o -MF tools/clang/lib/Driver/CMakeFiles/obj.clangDriver.dir/ToolChains/Gnu.cpp.o.d -o tools/clang/lib/Driver/CMakeFiles/obj.clangDriver.dir/ToolChains/Gnu.cpp.o -c /Users/buildslave/jenkins/workspace/lldb-cmake/llvm-project/clang/lib/Driver/ToolChains/Gnu.cpp
[2996/4439] /Users/buildslave/jenkins/workspace/lldb-cmake/host-compiler/bin/clang++  -DGTEST_HAS_RTTI=0 -D_DEBUG -D_GNU_SOURCE -D__STDC_CONSTANT_MACROS -D__STDC_FORMAT_MACROS -D__STDC_LIMIT_MACROS -Itools/clang/lib/Tooling/Inclusions -I/Users/buildslave/jenkins/workspace/lldb-cmake/llvm-project/clang/lib/Tooling/Inclusions -I/Users/buildslave/jenkins/workspace/lldb-cmake/llvm-project/clang/include -Itools/clang/include -I/Applications/Xcode.app/Contents/Developer/Platforms/MacOSX.platform/Developer/SDKs/MacOSX10.15.sdk/usr/include/libxml2 -Iinclude -I/Users/buildslave/jenkins/workspace/lldb-cmake/llvm-project/llvm/include -Wdocumentation -fPIC -fvisibility-inlines-hidden -Werror=date-time -Werror=unguarded-availability-new -fmodules -fmodules-cache-path=/Users/buildslave/jenkins/workspace/lldb-cmake/lldb-build/module.cache -fcxx-modules -Xclang -fmodules-local-submodule-visibility -Wall -Wextra -Wno-unused-parameter -Wwrite-strings -Wcast-qual -Wmissing-field-initializers -pedantic -Wno-long-long -Wimplicit-fallthrough -Wcovered-switch-default -Wno-noexcept-type -Wnon-virtual-dtor -Wdelete-non-virtual-dtor -Wstring-conversion -fdiagnostics-color -fno-common -Woverloaded-virtual -Wno-nested-anon-types -O3  -isysroot /Applications/Xcode.app/Contents/Developer/Platforms/MacOSX.platform/Developer/SDKs/MacOSX10.15.sdk    -fno-exceptions -fno-rtti -UNDEBUG -std=c++14 -MD -MT tools/clang/lib/Tooling/Inclusions/CMakeFiles/obj.clangToolingInclusions.dir/IncludeStyle.cpp.o -MF tools/clang/lib/Tooling/Inclusions/CMakeFiles/obj.clangToolingInclusions.dir/IncludeStyle.cpp.o.d -o tools/clang/lib/Tooling/Inclusions/CMakeFiles/obj.clangToolingInclusions.dir/IncludeStyle.cpp.o -c /Users/buildslave/jenkins/workspace/lldb-cmake/llvm-project/clang/lib/Tooling/Inclusions/IncludeStyle.cpp
[2997/4439] /Users/buildslave/jenkins/workspace/lldb-cmake/host-compiler/bin/clang++  -DGTEST_HAS_RTTI=0 -D_DEBUG -D_GNU_SOURCE -D__STDC_CONSTANT_MACROS -D__STDC_FORMAT_MACROS -D__STDC_LIMIT_MACROS -Itools/clang/lib/Driver -I/Users/buildslave/jenkins/workspace/lldb-cmake/llvm-project/clang/lib/Driver -I/Users/buildslave/jenkins/workspace/lldb-cmake/llvm-project/clang/include -Itools/clang/include -I/Applications/Xcode.app/Contents/Developer/Platforms/MacOSX.platform/Developer/SDKs/MacOSX10.15.sdk/usr/include/libxml2 -Iinclude -I/Users/buildslave/jenkins/workspace/lldb-cmake/llvm-project/llvm/include -Wdocumentation -fPIC -fvisibility-inlines-hidden -Werror=date-time -Werror=unguarded-availability-new -fmodules -fmodules-cache-path=/Users/buildslave/jenkins/workspace/lldb-cmake/lldb-build/module.cache -fcxx-modules -Xclang -fmodules-local-submodule-visibility -Wall -Wextra -Wno-unused-parameter -Wwrite-strings -Wcast-qual -Wmissing-field-initializers -pedantic -Wno-long-long -Wimplicit-fallthrough -Wcovered-switch-default -Wno-noexcept-type -Wnon-virtual-dtor -Wdelete-non-virtual-dtor -Wstring-conversion -fdiagnostics-color -fno-common -Woverloaded-virtual -Wno-nested-anon-types -O3  -isysroot /Applications/Xcode.app/Contents/Developer/Platforms/MacOSX.platform/Developer/SDKs/MacOSX10.15.sdk    -fno-exceptions -fno-rtti -UNDEBUG -std=c++14 -MD -MT tools/clang/lib/Driver/CMakeFiles/obj.clangDriver.dir/XRayArgs.cpp.o -MF tools/clang/lib/Driver/CMakeFiles/obj.clangDriver.dir/XRayArgs.cpp.o.d -o tools/clang/lib/Driver/CMakeFiles/obj.clangDriver.dir/XRayArgs.cpp.o -c /Users/buildslave/jenkins/workspace/lldb-cmake/llvm-project/clang/lib/Driver/XRayArgs.cpp
[2998/4439] /Users/buildslave/jenkins/workspace/lldb-cmake/host-compiler/bin/clang++  -DGTEST_HAS_RTTI=0 -D_DEBUG -D_GNU_SOURCE -D__STDC_CONSTANT_MACROS -D__STDC_FORMAT_MACROS -D__STDC_LIMIT_MACROS -Itools/clang/lib/Tooling/Core -I/Users/buildslave/jenkins/workspace/lldb-cmake/llvm-project/clang/lib/Tooling/Core -I/Users/buildslave/jenkins/workspace/lldb-cmake/llvm-project/clang/include -Itools/clang/include -I/Applications/Xcode.app/Contents/Developer/Platforms/MacOSX.platform/Developer/SDKs/MacOSX10.15.sdk/usr/include/libxml2 -Iinclude -I/Users/buildslave/jenkins/workspace/lldb-cmake/llvm-project/llvm/include -Wdocumentation -fPIC -fvisibility-inlines-hidden -Werror=date-time -Werror=unguarded-availability-new -fmodules -fmodules-cache-path=/Users/buildslave/jenkins/workspace/lldb-cmake/lldb-build/module.cache -fcxx-modules -Xclang -fmodules-local-submodule-visibility -Wall -Wextra -Wno-unused-parameter -Wwrite-strings -Wcast-qual -Wmissing-field-initializers -pedantic -Wno-long-long -Wimplicit-fallthrough -Wcovered-switch-default -Wno-noexcept-type -Wnon-virtual-dtor -Wdelete-non-virtual-dtor -Wstring-conversion -fdiagnostics-color -fno-common -Woverloaded-virtual -Wno-nested-anon-types -O3  -isysroot /Applications/Xcode.app/Contents/Developer/Platforms/MacOSX.platform/Developer/SDKs/MacOSX10.15.sdk    -fno-exceptions -fno-rtti -UNDEBUG -std=c++14 -MD -MT tools/clang/lib/Tooling/Core/CMakeFiles/obj.clangToolingCore.dir/Diagnostic.cpp.o -MF tools/clang/lib/Tooling/Core/CMakeFiles/obj.clangToolingCore.dir/Diagnostic.cpp.o.d -o tools/clang/lib/Tooling/Core/CMakeFiles/obj.clangToolingCore.dir/Diagnostic.cpp.o -c /Users/buildslave/jenkins/workspace/lldb-cmake/llvm-project/clang/lib/Tooling/Core/Diagnostic.cpp
[2999/4439] /Users/buildslave/jenkins/workspace/lldb-cmake/host-compiler/bin/clang++  -DGTEST_HAS_RTTI=0 -D_DEBUG -D_GNU_SOURCE -D__STDC_CONSTANT_MACROS -D__STDC_FORMAT_MACROS -D__STDC_LIMIT_MACROS -Itools/clang/lib/Driver -I/Users/buildslave/jenkins/workspace/lldb-cmake/llvm-project/clang/lib/Driver -I/Users/buildslave/jenkins/workspace/lldb-cmake/llvm-project/clang/include -Itools/clang/include -I/Applications/Xcode.app/Contents/Developer/Platforms/MacOSX.platform/Developer/SDKs/MacOSX10.15.sdk/usr/include/libxml2 -Iinclude -I/Users/buildslave/jenkins/workspace/lldb-cmake/llvm-project/llvm/include -Wdocumentation -fPIC -fvisibility-inlines-hidden -Werror=date-time -Werror=unguarded-availability-new -fmodules -fmodules-cache-path=/Users/buildslave/jenkins/workspace/lldb-cmake/lldb-build/module.cache -fcxx-modules -Xclang -fmodules-local-submodule-visibility -Wall -Wextra -Wno-unused-parameter -Wwrite-strings -Wcast-qual -Wmissing-field-initializers -pedantic -Wno-long-long -Wimplicit-fallthrough -Wcovered-switch-default -Wno-noexcept-type -Wnon-virtual-dtor -Wdelete-non-virtual-dtor -Wstring-conversion -fdiagnostics-color -fno-common -Woverloaded-virtual -Wno-nested-anon-types -O3  -isysroot /Applications/Xcode.app/Contents/Developer/Platforms/MacOSX.platform/Developer/SDKs/MacOSX10.15.sdk    -fno-exceptions -fno-rtti -UNDEBUG -std=c++14 -MD -MT tools/clang/lib/Driver/CMakeFiles/obj.clangDriver.dir/ToolChains/Darwin.cpp.o -MF tools/clang/lib/Driver/CMakeFiles/obj.clangDriver.dir/ToolChains/Darwin.cpp.o.d -o tools/clang/lib/Driver/CMakeFiles/obj.clangDriver.dir/ToolChains/Darwin.cpp.o -c /Users/buildslave/jenkins/workspace/lldb-cmake/llvm-project/clang/lib/Driver/ToolChains/Darwin.cpp
[3000/4439] /Users/buildslave/jenkins/workspace/lldb-cmake/host-compiler/bin/clang++  -DGTEST_HAS_RTTI=0 -D_DEBUG -D_GNU_SOURCE -D__STDC_CONSTANT_MACROS -D__STDC_FORMAT_MACROS -D__STDC_LIMIT_MACROS -Itools/clang/lib/Format -I/Users/buildslave/jenkins/workspace/lldb-cmake/llvm-project/clang/lib/Format -I/Users/buildslave/jenkins/workspace/lldb-cmake/llvm-project/clang/include -Itools/clang/include -I/Applications/Xcode.app/Contents/Developer/Platforms/MacOSX.platform/Developer/SDKs/MacOSX10.15.sdk/usr/include/libxml2 -Iinclude -I/Users/buildslave/jenkins/workspace/lldb-cmake/llvm-project/llvm/include -Wdocumentation -fPIC -fvisibility-inlines-hidden -Werror=date-time -Werror=unguarded-availability-new -fmodules -fmodules-cache-path=/Users/buildslave/jenkins/workspace/lldb-cmake/lldb-build/module.cache -fcxx-modules -Xclang -fmodules-local-submodule-visibility -Wall -Wextra -Wno-unused-parameter -Wwrite-strings -Wcast-qual -Wmissing-field-initializers -pedantic -Wno-long-long -Wimplicit-fallthrough -Wcovered-switch-default -Wno-noexcept-type -Wnon-virtual-dtor -Wdelete-non-virtual-dtor -Wstring-conversion -fdiagnostics-color -fno-common -Woverloaded-virtual -Wno-nested-anon-types -O3  -isysroot /Applications/Xcode.app/Contents/Developer/Platforms/MacOSX.platform/Developer/SDKs/MacOSX10.15.sdk    -fno-exceptions -fno-rtti -UNDEBUG -std=c++14 -MD -MT tools/clang/lib/Format/CMakeFiles/obj.clangFormat.dir/AffectedRangeManager.cpp.o -MF tools/clang/lib/Format/CMakeFiles/obj.clangFormat.dir/AffectedRangeManager.cpp.o.d -o tools/clang/lib/Format/CMakeFiles/obj.clangFormat.dir/AffectedRangeManager.cpp.o -c /Users/buildslave/jenkins/workspace/lldb-cmake/llvm-project/clang/lib/Format/AffectedRangeManager.cpp
[3001/4439] /Users/buildslave/jenkins/workspace/lldb-cmake/host-compiler/bin/clang++  -DGTEST_HAS_RTTI=0 -D_DEBUG -D_GNU_SOURCE -D__STDC_CONSTANT_MACROS -D__STDC_FORMAT_MACROS -D__STDC_LIMIT_MACROS -Itools/clang/lib/DirectoryWatcher -I/Users/buildslave/jenkins/workspace/lldb-cmake/llvm-project/clang/lib/DirectoryWatcher -I/Users/buildslave/jenkins/workspace/lldb-cmake/llvm-project/clang/include -Itools/clang/include -I/Applications/Xcode.app/Contents/Developer/Platforms/MacOSX.platform/Developer/SDKs/MacOSX10.15.sdk/usr/include/libxml2 -Iinclude -I/Users/buildslave/jenkins/workspace/lldb-cmake/llvm-project/llvm/include -Wdocumentation -fPIC -fvisibility-inlines-hidden -Werror=date-time -Werror=unguarded-availability-new -fmodules -fmodules-cache-path=/Users/buildslave/jenkins/workspace/lldb-cmake/lldb-build/module.cache -fcxx-modules -Xclang -fmodules-local-submodule-visibility -Wall -Wextra -Wno-unused-parameter -Wwrite-strings -Wcast-qual -Wmissing-field-initializers -pedantic -Wno-long-long -Wimplicit-fallthrough -Wcovered-switch-default -Wno-noexcept-type -Wnon-virtual-dtor -Wdelete-non-virtual-dtor -Wstring-conversion -fdiagnostics-color -fno-common -Woverloaded-virtual -Wno-nested-anon-types -O3  -isysroot /Applications/Xcode.app/Contents/Developer/Platforms/MacOSX.platform/Developer/SDKs/MacOSX10.15.sdk    -fno-exceptions -fno-rtti -UNDEBUG -std=c++14 -MD -MT tools/clang/lib/DirectoryWatcher/CMakeFiles/obj.clangDirectoryWatcher.dir/mac/DirectoryWatcher-mac.cpp.o -MF tools/clang/lib/DirectoryWatcher/CMakeFiles/obj.clangDirectoryWatcher.dir/mac/DirectoryWatcher-mac.cpp.o.d -o tools/clang/lib/DirectoryWatcher/CMakeFiles/obj.clangDirectoryWatcher.dir/mac/DirectoryWatcher-mac.cpp.o -c /Users/buildslave/jenkins/workspace/lldb-cmake/llvm-project/clang/lib/DirectoryWatcher/mac/DirectoryWatcher-mac.cpp
[3002/4439] : && "/Applications/Xcode.app/Contents/Developer/Toolchains/XcodeDefault.xctoolchain/usr/bin/libtool" -static -no_warning_for_no_symbols -o lib/libclangDirectoryWatcher.a  tools/clang/lib/DirectoryWatcher/CMakeFiles/obj.clangDirectoryWatcher.dir/DirectoryScanner.cpp.o tools/clang/lib/DirectoryWatcher/CMakeFiles/obj.clangDirectoryWatcher.dir/mac/DirectoryWatcher-mac.cpp.o && :
[3003/4439] /Users/buildslave/jenkins/workspace/lldb-cmake/host-compiler/bin/clang++  -DGTEST_HAS_RTTI=0 -D_DEBUG -D_GNU_SOURCE -D__STDC_CONSTANT_MACROS -D__STDC_FORMAT_MACROS -D__STDC_LIMIT_MACROS -Itools/clang/lib/Format -I/Users/buildslave/jenkins/workspace/lldb-cmake/llvm-project/clang/lib/Format -I/Users/buildslave/jenkins/workspace/lldb-cmake/llvm-project/clang/include -Itools/clang/include -I/Applications/Xcode.app/Contents/Developer/Platforms/MacOSX.platform/Developer/SDKs/MacOSX10.15.sdk/usr/include/libxml2 -Iinclude -I/Users/buildslave/jenkins/workspace/lldb-cmake/llvm-project/llvm/include -Wdocumentation -fPIC -fvisibility-inlines-hidden -Werror=date-time -Werror=unguarded-availability-new -fmodules -fmodules-cache-path=/Users/buildslave/jenkins/workspace/lldb-cmake/lldb-build/module.cache -fcxx-modules -Xclang -fmodules-local-submodule-visibility -Wall -Wextra -Wno-unused-parameter -Wwrite-strings -Wcast-qual -Wmissing-field-initializers -pedantic -Wno-long-long -Wimplicit-fallthrough -Wcovered-switch-default -Wno-noexcept-type -Wnon-virtual-dtor -Wdelete-non-virtual-dtor -Wstring-conversion -fdiagnostics-color -fno-common -Woverloaded-virtual -Wno-nested-anon-types -O3  -isysroot /Applications/Xcode.app/Contents/Developer/Platforms/MacOSX.platform/Developer/SDKs/MacOSX10.15.sdk    -fno-exceptions -fno-rtti -UNDEBUG -std=c++14 -MD -MT tools/clang/lib/Format/CMakeFiles/obj.clangFormat.dir/FormatToken.cpp.o -MF tools/clang/lib/Format/CMakeFiles/obj.clangFormat.dir/FormatToken.cpp.o.d -o tools/clang/lib/Format/CMakeFiles/obj.clangFormat.dir/FormatToken.cpp.o -c /Users/buildslave/jenkins/workspace/lldb-cmake/llvm-project/clang/lib/Format/FormatToken.cpp
[3004/4439] /Users/buildslave/jenkins/workspace/lldb-cmake/host-compiler/bin/clang++  -DGTEST_HAS_RTTI=0 -D_DEBUG -D_GNU_SOURCE -D__STDC_CONSTANT_MACROS -D__STDC_FORMAT_MACROS -D__STDC_LIMIT_MACROS -Itools/clang/lib/Format -I/Users/buildslave/jenkins/workspace/lldb-cmake/llvm-project/clang/lib/Format -I/Users/buildslave/jenkins/workspace/lldb-cmake/llvm-project/clang/include -Itools/clang/include -I/Applications/Xcode.app/Contents/Developer/Platforms/MacOSX.platform/Developer/SDKs/MacOSX10.15.sdk/usr/include/libxml2 -Iinclude -I/Users/buildslave/jenkins/workspace/lldb-cmake/llvm-project/llvm/include -Wdocumentation -fPIC -fvisibility-inlines-hidden -Werror=date-time -Werror=unguarded-availability-new -fmodules -fmodules-cache-path=/Users/buildslave/jenkins/workspace/lldb-cmake/lldb-build/module.cache -fcxx-modules -Xclang -fmodules-local-submodule-visibility -Wall -Wextra -Wno-unused-parameter -Wwrite-strings -Wcast-qual -Wmissing-field-initializers -pedantic -Wno-long-long -Wimplicit-fallthrough -Wcovered-switch-default -Wno-noexcept-type -Wnon-virtual-dtor -Wdelete-non-virtual-dtor -Wstring-conversion -fdiagnostics-color -fno-common -Woverloaded-virtual -Wno-nested-anon-types -O3  -isysroot /Applications/Xcode.app/Contents/Developer/Platforms/MacOSX.platform/Developer/SDKs/MacOSX10.15.sdk    -fno-exceptions -fno-rtti -UNDEBUG -std=c++14 -MD -MT tools/clang/lib/Format/CMakeFiles/obj.clangFormat.dir/BreakableToken.cpp.o -MF tools/clang/lib/Format/CMakeFiles/obj.clangFormat.dir/BreakableToken.cpp.o.d -o tools/clang/lib/Format/CMakeFiles/obj.clangFormat.dir/BreakableToken.cpp.o -c /Users/buildslave/jenkins/workspace/lldb-cmake/llvm-project/clang/lib/Format/BreakableToken.cpp
[3005/4439] /Users/buildslave/jenkins/workspace/lldb-cmake/host-compiler/bin/clang++  -DGTEST_HAS_RTTI=0 -D_DEBUG -D_GNU_SOURCE -D__STDC_CONSTANT_MACROS -D__STDC_FORMAT_MACROS -D__STDC_LIMIT_MACROS -Itools/clang/lib/Tooling/Core -I/Users/buildslave/jenkins/workspace/lldb-cmake/llvm-project/clang/lib/Tooling/Core -I/Users/buildslave/jenkins/workspace/lldb-cmake/llvm-project/clang/include -Itools/clang/include -I/Applications/Xcode.app/Contents/Developer/Platforms/MacOSX.platform/Developer/SDKs/MacOSX10.15.sdk/usr/include/libxml2 -Iinclude -I/Users/buildslave/jenkins/workspace/lldb-cmake/llvm-project/llvm/include -Wdocumentation -fPIC -fvisibility-inlines-hidden -Werror=date-time -Werror=unguarded-availability-new -fmodules -fmodules-cache-path=/Users/buildslave/jenkins/workspace/lldb-cmake/lldb-build/module.cache -fcxx-modules -Xclang -fmodules-local-submodule-visibility -Wall -Wextra -Wno-unused-parameter -Wwrite-strings -Wcast-qual -Wmissing-field-initializers -pedantic -Wno-long-long -Wimplicit-fallthrough -Wcovered-switch-default -Wno-noexcept-type -Wnon-virtual-dtor -Wdelete-non-virtual-dtor -Wstring-conversion -fdiagnostics-color -fno-common -Woverloaded-virtual -Wno-nested-anon-types -O3  -isysroot /Applications/Xcode.app/Contents/Developer/Platforms/MacOSX.platform/Developer/SDKs/MacOSX10.15.sdk    -fno-exceptions -fno-rtti -UNDEBUG -std=c++14 -MD -MT tools/clang/lib/Tooling/Core/CMakeFiles/obj.clangToolingCore.dir/Replacement.cpp.o -MF tools/clang/lib/Tooling/Core/CMakeFiles/obj.clangToolingCore.dir/Replacement.cpp.o.d -o tools/clang/lib/Tooling/Core/CMakeFiles/obj.clangToolingCore.dir/Replacement.cpp.o -c /Users/buildslave/jenkins/workspace/lldb-cmake/llvm-project/clang/lib/Tooling/Core/Replacement.cpp
[3006/4439] : && "/Applications/Xcode.app/Contents/Developer/Toolchains/XcodeDefault.xctoolchain/usr/bin/libtool" -static -no_warning_for_no_symbols -o lib/libclangToolingCore.a  tools/clang/lib/Tooling/Core/CMakeFiles/obj.clangToolingCore.dir/Diagnostic.cpp.o tools/clang/lib/Tooling/Core/CMakeFiles/obj.clangToolingCore.dir/Lookup.cpp.o tools/clang/lib/Tooling/Core/CMakeFiles/obj.clangToolingCore.dir/Replacement.cpp.o && :
[3007/4439] /Users/buildslave/jenkins/workspace/lldb-cmake/host-compiler/bin/clang++  -DGTEST_HAS_RTTI=0 -D_DEBUG -D_GNU_SOURCE -D__STDC_CONSTANT_MACROS -D__STDC_FORMAT_MACROS -D__STDC_LIMIT_MACROS -Itools/clang/lib/Driver -I/Users/buildslave/jenkins/workspace/lldb-cmake/llvm-project/clang/lib/Driver -I/Users/buildslave/jenkins/workspace/lldb-cmake/llvm-project/clang/include -Itools/clang/include -I/Applications/Xcode.app/Contents/Developer/Platforms/MacOSX.platform/Developer/SDKs/MacOSX10.15.sdk/usr/include/libxml2 -Iinclude -I/Users/buildslave/jenkins/workspace/lldb-cmake/llvm-project/llvm/include -Wdocumentation -fPIC -fvisibility-inlines-hidden -Werror=date-time -Werror=unguarded-availability-new -fmodules -fmodules-cache-path=/Users/buildslave/jenkins/workspace/lldb-cmake/lldb-build/module.cache -fcxx-modules -Xclang -fmodules-local-submodule-visibility -Wall -Wextra -Wno-unused-parameter -Wwrite-strings -Wcast-qual -Wmissing-field-initializers -pedantic -Wno-long-long -Wimplicit-fallthrough -Wcovered-switch-default -Wno-noexcept-type -Wnon-virtual-dtor -Wdelete-non-virtual-dtor -Wstring-conversion -fdiagnostics-color -fno-common -Woverloaded-virtual -Wno-nested-anon-types -O3  -isysroot /Applications/Xcode.app/Contents/Developer/Platforms/MacOSX.platform/Developer/SDKs/MacOSX10.15.sdk    -fno-exceptions -fno-rtti -UNDEBUG -std=c++14 -MD -MT tools/clang/lib/Driver/CMakeFiles/obj.clangDriver.dir/ToolChains/Clang.cpp.o -MF tools/clang/lib/Driver/CMakeFiles/obj.clangDriver.dir/ToolChains/Clang.cpp.o.d -o tools/clang/lib/Driver/CMakeFiles/obj.clangDriver.dir/ToolChains/Clang.cpp.o -c /Users/buildslave/jenkins/workspace/lldb-cmake/llvm-project/clang/lib/Driver/ToolChains/Clang.cpp
[3008/4439] : && "/Applications/Xcode.app/Contents/Developer/Toolchains/XcodeDefault.xctoolchain/usr/bin/libtool" -static -no_warning_for_no_symbols -o lib/libclangDriver.a  tools/clang/lib/Driver/CMakeFiles/obj.clangDriver.dir/Action.cpp.o tools/clang/lib/Driver/CMakeFiles/obj.clangDriver.dir/Compilation.cpp.o tools/clang/lib/Driver/CMakeFiles/obj.clangDriver.dir/DarwinSDKInfo.cpp.o tools/clang/lib/Driver/CMakeFiles/obj.clangDriver.dir/Distro.cpp.o tools/clang/lib/Driver/CMakeFiles/obj.clangDriver.dir/Driver.cpp.o tools/clang/lib/Driver/CMakeFiles/obj.clangDriver.dir/DriverOptions.cpp.o tools/clang/lib/Driver/CMakeFiles/obj.clangDriver.dir/Job.cpp.o tools/clang/lib/Driver/CMakeFiles/obj.clangDriver.dir/Multilib.cpp.o tools/clang/lib/Driver/CMakeFiles/obj.clangDriver.dir/OptionUtils.cpp.o tools/clang/lib/Driver/CMakeFiles/obj.clangDriver.dir/Phases.cpp.o tools/clang/lib/Driver/CMakeFiles/obj.clangDriver.dir/SanitizerArgs.cpp.o tools/clang/lib/Driver/CMakeFiles/obj.clangDriver.dir/Tool.cpp.o tools/clang/lib/Driver/CMakeFiles/obj.clangDriver.dir/ToolChain.cpp.o tools/clang/lib/Driver/CMakeFiles/obj.clangDriver.dir/ToolChains/Arch/AArch64.cpp.o tools/clang/lib/Driver/CMakeFiles/obj.clangDriver.dir/ToolChains/Arch/ARM.cpp.o tools/clang/lib/Driver/CMakeFiles/obj.clangDriver.dir/ToolChains/Arch/Mips.cpp.o tools/clang/lib/Driver/CMakeFiles/obj.clangDriver.dir/ToolChains/Arch/PPC.cpp.o tools/clang/lib/Driver/CMakeFiles/obj.clangDriver.dir/ToolChains/Arch/RISCV.cpp.o tools/clang/lib/Driver/CMakeFiles/obj.clangDriver.dir/ToolChains/Arch/Sparc.cpp.o tools/clang/lib/Driver/CMakeFiles/obj.clangDriver.dir/ToolChains/Arch/SystemZ.cpp.o tools/clang/lib/Driver/CMakeFiles/obj.clangDriver.dir/ToolChains/Arch/VE.cpp.o tools/clang/lib/Driver/CMakeFiles/obj.clangDriver.dir/ToolChains/Arch/X86.cpp.o tools/clang/lib/Driver/CMakeFiles/obj.clangDriver.dir/ToolChains/AIX.cpp.o tools/clang/lib/Driver/CMakeFiles/obj.clangDriver.dir/ToolChains/Ananas.cpp.o tools/clang/lib/Driver/CMakeFiles/obj.clangDriver.dir/ToolChains/AMDGPU.cpp.o tools/clang/lib/Driver/CMakeFiles/obj.clangDriver.dir/ToolChains/AVR.cpp.o tools/clang/lib/Driver/CMakeFiles/obj.clangDriver.dir/ToolChains/BareMetal.cpp.o tools/clang/lib/Driver/CMakeFiles/obj.clangDriver.dir/ToolChains/Clang.cpp.o tools/clang/lib/Driver/CMakeFiles/obj.clangDriver.dir/ToolChains/CloudABI.cpp.o tools/clang/lib/Driver/CMakeFiles/obj.clangDriver.dir/ToolChains/CommonArgs.cpp.o tools/clang/lib/Driver/CMakeFiles/obj.clangDriver.dir/ToolChains/Contiki.cpp.o tools/clang/lib/Driver/CMakeFiles/obj.clangDriver.dir/ToolChains/CrossWindows.cpp.o tools/clang/lib/Driver/CMakeFiles/obj.clangDriver.dir/ToolChains/Cuda.cpp.o tools/clang/lib/Driver/CMakeFiles/obj.clangDriver.dir/ToolChains/Darwin.cpp.o tools/clang/lib/Driver/CMakeFiles/obj.clangDriver.dir/ToolChains/DragonFly.cpp.o tools/clang/lib/Driver/CMakeFiles/obj.clangDriver.dir/ToolChains/Flang.cpp.o tools/clang/lib/Driver/CMakeFiles/obj.clangDriver.dir/ToolChains/FreeBSD.cpp.o tools/clang/lib/Driver/CMakeFiles/obj.clangDriver.dir/ToolChains/Fuchsia.cpp.o tools/clang/lib/Driver/CMakeFiles/obj.clangDriver.dir/ToolChains/Gnu.cpp.o tools/clang/lib/Driver/CMakeFiles/obj.clangDriver.dir/ToolChains/Haiku.cpp.o tools/clang/lib/Driver/CMakeFiles/obj.clangDriver.dir/ToolChains/HIP.cpp.o tools/clang/lib/Driver/CMakeFiles/obj.clangDriver.dir/ToolChains/Hexagon.cpp.o tools/clang/lib/Driver/CMakeFiles/obj.clangDriver.dir/ToolChains/Hurd.cpp.o tools/clang/lib/Driver/CMakeFiles/obj.clangDriver.dir/ToolChains/Linux.cpp.o tools/clang/lib/Driver/CMakeFiles/obj.clangDriver.dir/ToolChains/MipsLinux.cpp.o tools/clang/lib/Driver/CMakeFiles/obj.clangDriver.dir/ToolChains/MinGW.cpp.o tools/clang/lib/Driver/CMakeFiles/obj.clangDriver.dir/ToolChains/Minix.cpp.o tools/clang/lib/Driver/CMakeFiles/obj.clangDriver.dir/ToolChains/MSP430.cpp.o tools/clang/lib/Driver/CMakeFiles/obj.clangDriver.dir/ToolChains/MSVC.cpp.o tools/clang/lib/Driver/CMakeFiles/obj.clangDriver.dir/ToolChains/Myriad.cpp.o tools/clang/lib/Driver/CMakeFiles/obj.clangDriver.dir/ToolChains/NaCl.cpp.o tools/clang/lib/Driver/CMakeFiles/obj.clangDriver.dir/ToolChains/NetBSD.cpp.o tools/clang/lib/Driver/CMakeFiles/obj.clangDriver.dir/ToolChains/OpenBSD.cpp.o tools/clang/lib/Driver/CMakeFiles/obj.clangDriver.dir/ToolChains/PS4CPU.cpp.o tools/clang/lib/Driver/CMakeFiles/obj.clangDriver.dir/ToolChains/RISCVToolchain.cpp.o tools/clang/lib/Driver/CMakeFiles/obj.clangDriver.dir/ToolChains/Solaris.cpp.o tools/clang/lib/Driver/CMakeFiles/obj.clangDriver.dir/ToolChains/TCE.cpp.o tools/clang/lib/Driver/CMakeFiles/obj.clangDriver.dir/ToolChains/VEToolchain.cpp.o tools/clang/lib/Driver/CMakeFiles/obj.clangDriver.dir/ToolChains/WebAssembly.cpp.o tools/clang/lib/Driver/CMakeFiles/obj.clangDriver.dir/ToolChains/XCore.cpp.o tools/clang/lib/Driver/CMakeFiles/obj.clangDriver.dir/ToolChains/PPCLinux.cpp.o tools/clang/lib/Driver/CMakeFiles/obj.clangDriver.dir/ToolChains/InterfaceStubs.cpp.o tools/clang/lib/Driver/CMakeFiles/obj.clangDriver.dir/Types.cpp.o tools/clang/lib/Driver/CMakeFiles/obj.clangDriver.dir/XRayArgs.cpp.o && :
[3009/4439] : && "/Applications/Xcode.app/Contents/Developer/Toolchains/XcodeDefault.xctoolchain/usr/bin/libtool" -static -no_warning_for_no_symbols -o lib/libclangARCMigrate.a  tools/clang/lib/ARCMigrate/CMakeFiles/obj.clangARCMigrate.dir/ARCMT.cpp.o tools/clang/lib/ARCMigrate/CMakeFiles/obj.clangARCMigrate.dir/ARCMTActions.cpp.o tools/clang/lib/ARCMigrate/CMakeFiles/obj.clangARCMigrate.dir/FileRemapper.cpp.o tools/clang/lib/ARCMigrate/CMakeFiles/obj.clangARCMigrate.dir/ObjCMT.cpp.o tools/clang/lib/ARCMigrate/CMakeFiles/obj.clangARCMigrate.dir/PlistReporter.cpp.o tools/clang/lib/ARCMigrate/CMakeFiles/obj.clangARCMigrate.dir/TransAPIUses.cpp.o tools/clang/lib/ARCMigrate/CMakeFiles/obj.clangARCMigrate.dir/TransARCAssign.cpp.o tools/clang/lib/ARCMigrate/CMakeFiles/obj.clangARCMigrate.dir/TransAutoreleasePool.cpp.o tools/clang/lib/ARCMigrate/CMakeFiles/obj.clangARCMigrate.dir/TransBlockObjCVariable.cpp.o tools/clang/lib/ARCMigrate/CMakeFiles/obj.clangARCMigrate.dir/TransEmptyStatementsAndDealloc.cpp.o tools/clang/lib/ARCMigrate/CMakeFiles/obj.clangARCMigrate.dir/TransGCAttrs.cpp.o tools/clang/lib/ARCMigrate/CMakeFiles/obj.clangARCMigrate.dir/TransGCCalls.cpp.o tools/clang/lib/ARCMigrate/CMakeFiles/obj.clangARCMigrate.dir/TransProperties.cpp.o tools/clang/lib/ARCMigrate/CMakeFiles/obj.clangARCMigrate.dir/TransProtectedScope.cpp.o tools/clang/lib/ARCMigrate/CMakeFiles/obj.clangARCMigrate.dir/TransRetainReleaseDealloc.cpp.o tools/clang/lib/ARCMigrate/CMakeFiles/obj.clangARCMigrate.dir/TransUnbridgedCasts.cpp.o tools/clang/lib/ARCMigrate/CMakeFiles/obj.clangARCMigrate.dir/TransUnusedInitDelegate.cpp.o tools/clang/lib/ARCMigrate/CMakeFiles/obj.clangARCMigrate.dir/TransZeroOutPropsInDealloc.cpp.o tools/clang/lib/ARCMigrate/CMakeFiles/obj.clangARCMigrate.dir/TransformActions.cpp.o tools/clang/lib/ARCMigrate/CMakeFiles/obj.clangARCMigrate.dir/Transforms.cpp.o && :
[3010/4439] /Users/buildslave/jenkins/workspace/lldb-cmake/host-compiler/bin/clang++  -DGTEST_HAS_RTTI=0 -D_DEBUG -D_GNU_SOURCE -D__STDC_CONSTANT_MACROS -D__STDC_FORMAT_MACROS -D__STDC_LIMIT_MACROS -Itools/clang/lib/Tooling/Inclusions -I/Users/buildslave/jenkins/workspace/lldb-cmake/llvm-project/clang/lib/Tooling/Inclusions -I/Users/buildslave/jenkins/workspace/lldb-cmake/llvm-project/clang/include -Itools/clang/include -I/Applications/Xcode.app/Contents/Developer/Platforms/MacOSX.platform/Developer/SDKs/MacOSX10.15.sdk/usr/include/libxml2 -Iinclude -I/Users/buildslave/jenkins/workspace/lldb-cmake/llvm-project/llvm/include -Wdocumentation -fPIC -fvisibility-inlines-hidden -Werror=date-time -Werror=unguarded-availability-new -fmodules -fmodules-cache-path=/Users/buildslave/jenkins/workspace/lldb-cmake/lldb-build/module.cache -fcxx-modules -Xclang -fmodules-local-submodule-visibility -Wall -Wextra -Wno-unused-parameter -Wwrite-strings -Wcast-qual -Wmissing-field-initializers -pedantic -Wno-long-long -Wimplicit-fallthrough -Wcovered-switch-default -Wno-noexcept-type -Wnon-virtual-dtor -Wdelete-non-virtual-dtor -Wstring-conversion -fdiagnostics-color -fno-common -Woverloaded-virtual -Wno-nested-anon-types -O3  -isysroot /Applications/Xcode.app/Contents/Developer/Platforms/MacOSX.platform/Developer/SDKs/MacOSX10.15.sdk    -fno-exceptions -fno-rtti -UNDEBUG -std=c++14 -MD -MT tools/clang/lib/Tooling/Inclusions/CMakeFiles/obj.clangToolingInclusions.dir/HeaderIncludes.cpp.o -MF tools/clang/lib/Tooling/Inclusions/CMakeFiles/obj.clangToolingInclusions.dir/HeaderIncludes.cpp.o.d -o tools/clang/lib/Tooling/Inclusions/CMakeFiles/obj.clangToolingInclusions.dir/HeaderIncludes.cpp.o -c /Users/buildslave/jenkins/workspace/lldb-cmake/llvm-project/clang/lib/Tooling/Inclusions/HeaderIncludes.cpp
[3011/4439] : && "/Applications/Xcode.app/Contents/Developer/Toolchains/XcodeDefault.xctoolchain/usr/bin/libtool" -static -no_warning_for_no_symbols -o lib/libclangToolingInclusions.a  tools/clang/lib/Tooling/Inclusions/CMakeFiles/obj.clangToolingInclusions.dir/HeaderIncludes.cpp.o tools/clang/lib/Tooling/Inclusions/CMakeFiles/obj.clangToolingInclusions.dir/IncludeStyle.cpp.o && :
[3012/4439] /Users/buildslave/jenkins/workspace/lldb-cmake/host-compiler/bin/clang++  -DGTEST_HAS_RTTI=0 -D_DEBUG -D_GNU_SOURCE -D__STDC_CONSTANT_MACROS -D__STDC_FORMAT_MACROS -D__STDC_LIMIT_MACROS -Itools/clang/lib/Format -I/Users/buildslave/jenkins/workspace/lldb-cmake/llvm-project/clang/lib/Format -I/Users/buildslave/jenkins/workspace/lldb-cmake/llvm-project/clang/include -Itools/clang/include -I/Applications/Xcode.app/Contents/Developer/Platforms/MacOSX.platform/Developer/SDKs/MacOSX10.15.sdk/usr/include/libxml2 -Iinclude -I/Users/buildslave/jenkins/workspace/lldb-cmake/llvm-project/llvm/include -Wdocumentation -fPIC -fvisibility-inlines-hidden -Werror=date-time -Werror=unguarded-availability-new -fmodules -fmodules-cache-path=/Users/buildslave/jenkins/workspace/lldb-cmake/lldb-build/module.cache -fcxx-modules -Xclang -fmodules-local-submodule-visibility -Wall -Wextra -Wno-unused-parameter -Wwrite-strings -Wcast-qual -Wmissing-field-initializers -pedantic -Wno-long-long -Wimplicit-fallthrough -Wcovered-switch-default -Wno-noexcept-type -Wnon-virtual-dtor -Wdelete-non-virtual-dtor -Wstring-conversion -fdiagnostics-color -fno-common -Woverloaded-virtual -Wno-nested-anon-types -O3  -isysroot /Applications/Xcode.app/Contents/Developer/Platforms/MacOSX.platform/Developer/SDKs/MacOSX10.15.sdk    -fno-exceptions -fno-rtti -UNDEBUG -std=c++14 -MD -MT tools/clang/lib/Format/CMakeFiles/obj.clangFormat.dir/NamespaceEndCommentsFixer.cpp.o -MF tools/clang/lib/Format/CMakeFiles/obj.clangFormat.dir/NamespaceEndCommentsFixer.cpp.o.d -o tools/clang/lib/Format/CMakeFiles/obj.clangFormat.dir/NamespaceEndCommentsFixer.cpp.o -c /Users/buildslave/jenkins/workspace/lldb-cmake/llvm-project/clang/lib/Format/NamespaceEndCommentsFixer.cpp
[3013/4439] /Users/buildslave/jenkins/workspace/lldb-cmake/host-compiler/bin/clang++  -DGTEST_HAS_RTTI=0 -D_DEBUG -D_GNU_SOURCE -D__STDC_CONSTANT_MACROS -D__STDC_FORMAT_MACROS -D__STDC_LIMIT_MACROS -Itools/clang/lib/Format -I/Users/buildslave/jenkins/workspace/lldb-cmake/llvm-project/clang/lib/Format -I/Users/buildslave/jenkins/workspace/lldb-cmake/llvm-project/clang/include -Itools/clang/include -I/Applications/Xcode.app/Contents/Developer/Platforms/MacOSX.platform/Developer/SDKs/MacOSX10.15.sdk/usr/include/libxml2 -Iinclude -I/Users/buildslave/jenkins/workspace/lldb-cmake/llvm-project/llvm/include -Wdocumentation -fPIC -fvisibility-inlines-hidden -Werror=date-time -Werror=unguarded-availability-new -fmodules -fmodules-cache-path=/Users/buildslave/jenkins/workspace/lldb-cmake/lldb-build/module.cache -fcxx-modules -Xclang -fmodules-local-submodule-visibility -Wall -Wextra -Wno-unused-parameter -Wwrite-strings -Wcast-qual -Wmissing-field-initializers -pedantic -Wno-long-long -Wimplicit-fallthrough -Wcovered-switch-default -Wno-noexcept-type -Wnon-virtual-dtor -Wdelete-non-virtual-dtor -Wstring-conversion -fdiagnostics-color -fno-common -Woverloaded-virtual -Wno-nested-anon-types -O3  -isysroot /Applications/Xcode.app/Contents/Developer/Platforms/MacOSX.platform/Developer/SDKs/MacOSX10.15.sdk    -fno-exceptions -fno-rtti -UNDEBUG -std=c++14 -MD -MT tools/clang/lib/Format/CMakeFiles/obj.clangFormat.dir/FormatTokenLexer.cpp.o -MF tools/clang/lib/Format/CMakeFiles/obj.clangFormat.dir/FormatTokenLexer.cpp.o.d -o tools/clang/lib/Format/CMakeFiles/obj.clangFormat.dir/FormatTokenLexer.cpp.o -c /Users/buildslave/jenkins/workspace/lldb-cmake/llvm-project/clang/lib/Format/FormatTokenLexer.cpp
[3014/4439] /Users/buildslave/jenkins/workspace/lldb-cmake/host-compiler/bin/clang++  -DGTEST_HAS_RTTI=0 -D_DEBUG -D_GNU_SOURCE -D__STDC_CONSTANT_MACROS -D__STDC_FORMAT_MACROS -D__STDC_LIMIT_MACROS -Itools/clang/lib/Format -I/Users/buildslave/jenkins/workspace/lldb-cmake/llvm-project/clang/lib/Format -I/Users/buildslave/jenkins/workspace/lldb-cmake/llvm-project/clang/include -Itools/clang/include -I/Applications/Xcode.app/Contents/Developer/Platforms/MacOSX.platform/Developer/SDKs/MacOSX10.15.sdk/usr/include/libxml2 -Iinclude -I/Users/buildslave/jenkins/workspace/lldb-cmake/llvm-project/llvm/include -Wdocumentation -fPIC -fvisibility-inlines-hidden -Werror=date-time -Werror=unguarded-availability-new -fmodules -fmodules-cache-path=/Users/buildslave/jenkins/workspace/lldb-cmake/lldb-build/module.cache -fcxx-modules -Xclang -fmodules-local-submodule-visibility -Wall -Wextra -Wno-unused-parameter -Wwrite-strings -Wcast-qual -Wmissing-field-initializers -pedantic -Wno-long-long -Wimplicit-fallthrough -Wcovered-switch-default -Wno-noexcept-type -Wnon-virtual-dtor -Wdelete-non-virtual-dtor -Wstring-conversion -fdiagnostics-color -fno-common -Woverloaded-virtual -Wno-nested-anon-types -O3  -isysroot /Applications/Xcode.app/Contents/Developer/Platforms/MacOSX.platform/Developer/SDKs/MacOSX10.15.sdk    -fno-exceptions -fno-rtti -UNDEBUG -std=c++14 -MD -MT tools/clang/lib/Format/CMakeFiles/obj.clangFormat.dir/ContinuationIndenter.cpp.o -MF tools/clang/lib/Format/CMakeFiles/obj.clangFormat.dir/ContinuationIndenter.cpp.o.d -o tools/clang/lib/Format/CMakeFiles/obj.clangFormat.dir/ContinuationIndenter.cpp.o -c /Users/buildslave/jenkins/workspace/lldb-cmake/llvm-project/clang/lib/Format/ContinuationIndenter.cpp
[3015/4439] /Users/buildslave/jenkins/workspace/lldb-cmake/host-compiler/bin/clang++  -DGTEST_HAS_RTTI=0 -D_DEBUG -D_GNU_SOURCE -D__STDC_CONSTANT_MACROS -D__STDC_FORMAT_MACROS -D__STDC_LIMIT_MACROS -Itools/clang/tools/diagtool -I/Users/buildslave/jenkins/workspace/lldb-cmake/llvm-project/clang/tools/diagtool -I/Users/buildslave/jenkins/workspace/lldb-cmake/llvm-project/clang/include -Itools/clang/include -I/Applications/Xcode.app/Contents/Developer/Platforms/MacOSX.platform/Developer/SDKs/MacOSX10.15.sdk/usr/include/libxml2 -Iinclude -I/Users/buildslave/jenkins/workspace/lldb-cmake/llvm-project/llvm/include -Wdocumentation -fPIC -fvisibility-inlines-hidden -Werror=date-time -Werror=unguarded-availability-new -fmodules -fmodules-cache-path=/Users/buildslave/jenkins/workspace/lldb-cmake/lldb-build/module.cache -fcxx-modules -Xclang -fmodules-local-submodule-visibility -Wall -Wextra -Wno-unused-parameter -Wwrite-strings -Wcast-qual -Wmissing-field-initializers -pedantic -Wno-long-long -Wimplicit-fallthrough -Wcovered-switch-default -Wno-noexcept-type -Wnon-virtual-dtor -Wdelete-non-virtual-dtor -Wstring-conversion -fdiagnostics-color -fno-common -Woverloaded-virtual -Wno-nested-anon-types -O3  -isysroot /Applications/Xcode.app/Contents/Developer/Platforms/MacOSX.platform/Developer/SDKs/MacOSX10.15.sdk    -fno-exceptions -fno-rtti -UNDEBUG -std=c++14 -MD -MT tools/clang/tools/diagtool/CMakeFiles/diagtool.dir/diagtool_main.cpp.o -MF tools/clang/tools/diagtool/CMakeFiles/diagtool.dir/diagtool_main.cpp.o.d -o tools/clang/tools/diagtool/CMakeFiles/diagtool.dir/diagtool_main.cpp.o -c /Users/buildslave/jenkins/workspace/lldb-cmake/llvm-project/clang/tools/diagtool/diagtool_main.cpp
[3016/4439] /Users/buildslave/jenkins/workspace/lldb-cmake/host-compiler/bin/clang++  -DGTEST_HAS_RTTI=0 -D_DEBUG -D_GNU_SOURCE -D__STDC_CONSTANT_MACROS -D__STDC_FORMAT_MACROS -D__STDC_LIMIT_MACROS -Itools/clang/lib/Testing -I/Users/buildslave/jenkins/workspace/lldb-cmake/llvm-project/clang/lib/Testing -I/Users/buildslave/jenkins/workspace/lldb-cmake/llvm-project/clang/include -Itools/clang/include -I/Applications/Xcode.app/Contents/Developer/Platforms/MacOSX.platform/Developer/SDKs/MacOSX10.15.sdk/usr/include/libxml2 -Iinclude -I/Users/buildslave/jenkins/workspace/lldb-cmake/llvm-project/llvm/include -Wdocumentation -fPIC -fvisibility-inlines-hidden -Werror=date-time -Werror=unguarded-availability-new -fmodules -fmodules-cache-path=/Users/buildslave/jenkins/workspace/lldb-cmake/lldb-build/module.cache -fcxx-modules -Xclang -fmodules-local-submodule-visibility -Wall -Wextra -Wno-unused-parameter -Wwrite-strings -Wcast-qual -Wmissing-field-initializers -pedantic -Wno-long-long -Wimplicit-fallthrough -Wcovered-switch-default -Wno-noexcept-type -Wnon-virtual-dtor -Wdelete-non-virtual-dtor -Wstring-conversion -fdiagnostics-color -fno-common -Woverloaded-virtual -Wno-nested-anon-types -O3  -isysroot /Applications/Xcode.app/Contents/Developer/Platforms/MacOSX.platform/Developer/SDKs/MacOSX10.15.sdk    -fno-exceptions -fno-rtti -UNDEBUG -std=c++14 -MD -MT tools/clang/lib/Testing/CMakeFiles/obj.clangTesting.dir/CommandLineArgs.cpp.o -MF tools/clang/lib/Testing/CMakeFiles/obj.clangTesting.dir/CommandLineArgs.cpp.o.d -o tools/clang/lib/Testing/CMakeFiles/obj.clangTesting.dir/CommandLineArgs.cpp.o -c /Users/buildslave/jenkins/workspace/lldb-cmake/llvm-project/clang/lib/Testing/CommandLineArgs.cpp
[3017/4439] : && "/Applications/Xcode.app/Contents/Developer/Toolchains/XcodeDefault.xctoolchain/usr/bin/libtool" -static -no_warning_for_no_symbols -o lib/libclangTesting.a  tools/clang/lib/Testing/CMakeFiles/obj.clangTesting.dir/CommandLineArgs.cpp.o && :
[3018/4439] /Users/buildslave/jenkins/workspace/lldb-cmake/host-compiler/bin/clang++  -DGTEST_HAS_RTTI=0 -D_DEBUG -D_GNU_SOURCE -D__STDC_CONSTANT_MACROS -D__STDC_FORMAT_MACROS -D__STDC_LIMIT_MACROS -Itools/clang/lib/Format -I/Users/buildslave/jenkins/workspace/lldb-cmake/llvm-project/clang/lib/Format -I/Users/buildslave/jenkins/workspace/lldb-cmake/llvm-project/clang/include -Itools/clang/include -I/Applications/Xcode.app/Contents/Developer/Platforms/MacOSX.platform/Developer/SDKs/MacOSX10.15.sdk/usr/include/libxml2 -Iinclude -I/Users/buildslave/jenkins/workspace/lldb-cmake/llvm-project/llvm/include -Wdocumentation -fPIC -fvisibility-inlines-hidden -Werror=date-time -Werror=unguarded-availability-new -fmodules -fmodules-cache-path=/Users/buildslave/jenkins/workspace/lldb-cmake/lldb-build/module.cache -fcxx-modules -Xclang -fmodules-local-submodule-visibility -Wall -Wextra -Wno-unused-parameter -Wwrite-strings -Wcast-qual -Wmissing-field-initializers -pedantic -Wno-long-long -Wimplicit-fallthrough -Wcovered-switch-default -Wno-noexcept-type -Wnon-virtual-dtor -Wdelete-non-virtual-dtor -Wstring-conversion -fdiagnostics-color -fno-common -Woverloaded-virtual -Wno-nested-anon-types -O3  -isysroot /Applications/Xcode.app/Contents/Developer/Platforms/MacOSX.platform/Developer/SDKs/MacOSX10.15.sdk    -fno-exceptions -fno-rtti -UNDEBUG -std=c++14 -MD -MT tools/clang/lib/Format/CMakeFiles/obj.clangFormat.dir/TokenAnalyzer.cpp.o -MF tools/clang/lib/Format/CMakeFiles/obj.clangFormat.dir/TokenAnalyzer.cpp.o.d -o tools/clang/lib/Format/CMakeFiles/obj.clangFormat.dir/TokenAnalyzer.cpp.o -c /Users/buildslave/jenkins/workspace/lldb-cmake/llvm-project/clang/lib/Format/TokenAnalyzer.cpp
[3019/4439] /Users/buildslave/jenkins/workspace/lldb-cmake/host-compiler/bin/clang++  -DGTEST_HAS_RTTI=0 -D_DEBUG -D_GNU_SOURCE -D__STDC_CONSTANT_MACROS -D__STDC_FORMAT_MACROS -D__STDC_LIMIT_MACROS -Itools/clang/lib/Format -I/Users/buildslave/jenkins/workspace/lldb-cmake/llvm-project/clang/lib/Format -I/Users/buildslave/jenkins/workspace/lldb-cmake/llvm-project/clang/include -Itools/clang/include -I/Applications/Xcode.app/Contents/Developer/Platforms/MacOSX.platform/Developer/SDKs/MacOSX10.15.sdk/usr/include/libxml2 -Iinclude -I/Users/buildslave/jenkins/workspace/lldb-cmake/llvm-project/llvm/include -Wdocumentation -fPIC -fvisibility-inlines-hidden -Werror=date-time -Werror=unguarded-availability-new -fmodules -fmodules-cache-path=/Users/buildslave/jenkins/workspace/lldb-cmake/lldb-build/module.cache -fcxx-modules -Xclang -fmodules-local-submodule-visibility -Wall -Wextra -Wno-unused-parameter -Wwrite-strings -Wcast-qual -Wmissing-field-initializers -pedantic -Wno-long-long -Wimplicit-fallthrough -Wcovered-switch-default -Wno-noexcept-type -Wnon-virtual-dtor -Wdelete-non-virtual-dtor -Wstring-conversion -fdiagnostics-color -fno-common -Woverloaded-virtual -Wno-nested-anon-types -O3  -isysroot /Applications/Xcode.app/Contents/Developer/Platforms/MacOSX.platform/Developer/SDKs/MacOSX10.15.sdk    -fno-exceptions -fno-rtti -UNDEBUG -std=c++14 -MD -MT tools/clang/lib/Format/CMakeFiles/obj.clangFormat.dir/SortJavaScriptImports.cpp.o -MF tools/clang/lib/Format/CMakeFiles/obj.clangFormat.dir/SortJavaScriptImports.cpp.o.d -o tools/clang/lib/Format/CMakeFiles/obj.clangFormat.dir/SortJavaScriptImports.cpp.o -c /Users/buildslave/jenkins/workspace/lldb-cmake/llvm-project/clang/lib/Format/SortJavaScriptImports.cpp
[3020/4439] /Users/buildslave/jenkins/workspace/lldb-cmake/host-compiler/bin/clang++  -DGTEST_HAS_RTTI=0 -D_DEBUG -D_GNU_SOURCE -D__STDC_CONSTANT_MACROS -D__STDC_FORMAT_MACROS -D__STDC_LIMIT_MACROS -Itools/clang/tools/diagtool -I/Users/buildslave/jenkins/workspace/lldb-cmake/llvm-project/clang/tools/diagtool -I/Users/buildslave/jenkins/workspace/lldb-cmake/llvm-project/clang/include -Itools/clang/include -I/Applications/Xcode.app/Contents/Developer/Platforms/MacOSX.platform/Developer/SDKs/MacOSX10.15.sdk/usr/include/libxml2 -Iinclude -I/Users/buildslave/jenkins/workspace/lldb-cmake/llvm-project/llvm/include -Wdocumentation -fPIC -fvisibility-inlines-hidden -Werror=date-time -Werror=unguarded-availability-new -fmodules -fmodules-cache-path=/Users/buildslave/jenkins/workspace/lldb-cmake/lldb-build/module.cache -fcxx-modules -Xclang -fmodules-local-submodule-visibility -Wall -Wextra -Wno-unused-parameter -Wwrite-strings -Wcast-qual -Wmissing-field-initializers -pedantic -Wno-long-long -Wimplicit-fallthrough -Wcovered-switch-default -Wno-noexcept-type -Wnon-virtual-dtor -Wdelete-non-virtual-dtor -Wstring-conversion -fdiagnostics-color -fno-common -Woverloaded-virtual -Wno-nested-anon-types -O3  -isysroot /Applications/Xcode.app/Contents/Developer/Platforms/MacOSX.platform/Developer/SDKs/MacOSX10.15.sdk    -fno-exceptions -fno-rtti -UNDEBUG -std=c++14 -MD -MT tools/clang/tools/diagtool/CMakeFiles/diagtool.dir/DiagTool.cpp.o -MF tools/clang/tools/diagtool/CMakeFiles/diagtool.dir/DiagTool.cpp.o.d -o tools/clang/tools/diagtool/CMakeFiles/diagtool.dir/DiagTool.cpp.o -c /Users/buildslave/jenkins/workspace/lldb-cmake/llvm-project/clang/tools/diagtool/DiagTool.cpp
[3021/4439] /Users/buildslave/jenkins/workspace/lldb-cmake/host-compiler/bin/clang++  -DGTEST_HAS_RTTI=0 -D_DEBUG -D_GNU_SOURCE -D__STDC_CONSTANT_MACROS -D__STDC_FORMAT_MACROS -D__STDC_LIMIT_MACROS -Itools/clang/lib/Format -I/Users/buildslave/jenkins/workspace/lldb-cmake/llvm-project/clang/lib/Format -I/Users/buildslave/jenkins/workspace/lldb-cmake/llvm-project/clang/include -Itools/clang/include -I/Applications/Xcode.app/Contents/Developer/Platforms/MacOSX.platform/Developer/SDKs/MacOSX10.15.sdk/usr/include/libxml2 -Iinclude -I/Users/buildslave/jenkins/workspace/lldb-cmake/llvm-project/llvm/include -Wdocumentation -fPIC -fvisibility-inlines-hidden -Werror=date-time -Werror=unguarded-availability-new -fmodules -fmodules-cache-path=/Users/buildslave/jenkins/workspace/lldb-cmake/lldb-build/module.cache -fcxx-modules -Xclang -fmodules-local-submodule-visibility -Wall -Wextra -Wno-unused-parameter -Wwrite-strings -Wcast-qual -Wmissing-field-initializers -pedantic -Wno-long-long -Wimplicit-fallthrough -Wcovered-switch-default -Wno-noexcept-type -Wnon-virtual-dtor -Wdelete-non-virtual-dtor -Wstring-conversion -fdiagnostics-color -fno-common -Woverloaded-virtual -Wno-nested-anon-types -O3  -isysroot /Applications/Xcode.app/Contents/Developer/Platforms/MacOSX.platform/Developer/SDKs/MacOSX10.15.sdk    -fno-exceptions -fno-rtti -UNDEBUG -std=c++14 -MD -MT tools/clang/lib/Format/CMakeFiles/obj.clangFormat.dir/UnwrappedLineFormatter.cpp.o -MF tools/clang/lib/Format/CMakeFiles/obj.clangFormat.dir/UnwrappedLineFormatter.cpp.o.d -o tools/clang/lib/Format/CMakeFiles/obj.clangFormat.dir/UnwrappedLineFormatter.cpp.o -c /Users/buildslave/jenkins/workspace/lldb-cmake/llvm-project/clang/lib/Format/UnwrappedLineFormatter.cpp
[3022/4439] /Users/buildslave/jenkins/workspace/lldb-cmake/host-compiler/bin/clang++  -DGTEST_HAS_RTTI=0 -D_DEBUG -D_GNU_SOURCE -D__STDC_CONSTANT_MACROS -D__STDC_FORMAT_MACROS -D__STDC_LIMIT_MACROS -Itools/clang/tools/diagtool -I/Users/buildslave/jenkins/workspace/lldb-cmake/llvm-project/clang/tools/diagtool -I/Users/buildslave/jenkins/workspace/lldb-cmake/llvm-project/clang/include -Itools/clang/include -I/Applications/Xcode.app/Contents/Developer/Platforms/MacOSX.platform/Developer/SDKs/MacOSX10.15.sdk/usr/include/libxml2 -Iinclude -I/Users/buildslave/jenkins/workspace/lldb-cmake/llvm-project/llvm/include -Wdocumentation -fPIC -fvisibility-inlines-hidden -Werror=date-time -Werror=unguarded-availability-new -fmodules -fmodules-cache-path=/Users/buildslave/jenkins/workspace/lldb-cmake/lldb-build/module.cache -fcxx-modules -Xclang -fmodules-local-submodule-visibility -Wall -Wextra -Wno-unused-parameter -Wwrite-strings -Wcast-qual -Wmissing-field-initializers -pedantic -Wno-long-long -Wimplicit-fallthrough -Wcovered-switch-default -Wno-noexcept-type -Wnon-virtual-dtor -Wdelete-non-virtual-dtor -Wstring-conversion -fdiagnostics-color -fno-common -Woverloaded-virtual -Wno-nested-anon-types -O3  -isysroot /Applications/Xcode.app/Contents/Developer/Platforms/MacOSX.platform/Developer/SDKs/MacOSX10.15.sdk    -fno-exceptions -fno-rtti -UNDEBUG -std=c++14 -MD -MT tools/clang/tools/diagtool/CMakeFiles/diagtool.dir/ListWarnings.cpp.o -MF tools/clang/tools/diagtool/CMakeFiles/diagtool.dir/ListWarnings.cpp.o.d -o tools/clang/tools/diagtool/CMakeFiles/diagtool.dir/ListWarnings.cpp.o -c /Users/buildslave/jenkins/workspace/lldb-cmake/llvm-project/clang/tools/diagtool/ListWarnings.cpp
[3023/4439] /Users/buildslave/jenkins/workspace/lldb-cmake/host-compiler/bin/clang++  -DGTEST_HAS_RTTI=0 -D_DEBUG -D_GNU_SOURCE -D__STDC_CONSTANT_MACROS -D__STDC_FORMAT_MACROS -D__STDC_LIMIT_MACROS -Itools/clang/lib/Format -I/Users/buildslave/jenkins/workspace/lldb-cmake/llvm-project/clang/lib/Format -I/Users/buildslave/jenkins/workspace/lldb-cmake/llvm-project/clang/include -Itools/clang/include -I/Applications/Xcode.app/Contents/Developer/Platforms/MacOSX.platform/Developer/SDKs/MacOSX10.15.sdk/usr/include/libxml2 -Iinclude -I/Users/buildslave/jenkins/workspace/lldb-cmake/llvm-project/llvm/include -Wdocumentation -fPIC -fvisibility-inlines-hidden -Werror=date-time -Werror=unguarded-availability-new -fmodules -fmodules-cache-path=/Users/buildslave/jenkins/workspace/lldb-cmake/lldb-build/module.cache -fcxx-modules -Xclang -fmodules-local-submodule-visibility -Wall -Wextra -Wno-unused-parameter -Wwrite-strings -Wcast-qual -Wmissing-field-initializers -pedantic -Wno-long-long -Wimplicit-fallthrough -Wcovered-switch-default -Wno-noexcept-type -Wnon-virtual-dtor -Wdelete-non-virtual-dtor -Wstring-conversion -fdiagnostics-color -fno-common -Woverloaded-virtual -Wno-nested-anon-types -O3  -isysroot /Applications/Xcode.app/Contents/Developer/Platforms/MacOSX.platform/Developer/SDKs/MacOSX10.15.sdk    -fno-exceptions -fno-rtti -UNDEBUG -std=c++14 -MD -MT tools/clang/lib/Format/CMakeFiles/obj.clangFormat.dir/UsingDeclarationsSorter.cpp.o -MF tools/clang/lib/Format/CMakeFiles/obj.clangFormat.dir/UsingDeclarationsSorter.cpp.o.d -o tools/clang/lib/Format/CMakeFiles/obj.clangFormat.dir/UsingDeclarationsSorter.cpp.o -c /Users/buildslave/jenkins/workspace/lldb-cmake/llvm-project/clang/lib/Format/UsingDeclarationsSorter.cpp
[3024/4439] /Users/buildslave/jenkins/workspace/lldb-cmake/host-compiler/bin/clang++  -DGTEST_HAS_RTTI=0 -D_DEBUG -D_GNU_SOURCE -D__STDC_CONSTANT_MACROS -D__STDC_FORMAT_MACROS -D__STDC_LIMIT_MACROS -Itools/clang/tools/diagtool -I/Users/buildslave/jenkins/workspace/lldb-cmake/llvm-project/clang/tools/diagtool -I/Users/buildslave/jenkins/workspace/lldb-cmake/llvm-project/clang/include -Itools/clang/include -I/Applications/Xcode.app/Contents/Developer/Platforms/MacOSX.platform/Developer/SDKs/MacOSX10.15.sdk/usr/include/libxml2 -Iinclude -I/Users/buildslave/jenkins/workspace/lldb-cmake/llvm-project/llvm/include -Wdocumentation -fPIC -fvisibility-inlines-hidden -Werror=date-time -Werror=unguarded-availability-new -fmodules -fmodules-cache-path=/Users/buildslave/jenkins/workspace/lldb-cmake/lldb-build/module.cache -fcxx-modules -Xclang -fmodules-local-submodule-visibility -Wall -Wextra -Wno-unused-parameter -Wwrite-strings -Wcast-qual -Wmissing-field-initializers -pedantic -Wno-long-long -Wimplicit-fallthrough -Wcovered-switch-default -Wno-noexcept-type -Wnon-virtual-dtor -Wdelete-non-virtual-dtor -Wstring-conversion -fdiagnostics-color -fno-common -Woverloaded-virtual -Wno-nested-anon-types -O3  -isysroot /Applications/Xcode.app/Contents/Developer/Platforms/MacOSX.platform/Developer/SDKs/MacOSX10.15.sdk    -fno-exceptions -fno-rtti -UNDEBUG -std=c++14 -MD -MT tools/clang/tools/diagtool/CMakeFiles/diagtool.dir/FindDiagnosticID.cpp.o -MF tools/clang/tools/diagtool/CMakeFiles/diagtool.dir/FindDiagnosticID.cpp.o.d -o tools/clang/tools/diagtool/CMakeFiles/diagtool.dir/FindDiagnosticID.cpp.o -c /Users/buildslave/jenkins/workspace/lldb-cmake/llvm-project/clang/tools/diagtool/FindDiagnosticID.cpp
[3025/4439] /Users/buildslave/jenkins/workspace/lldb-cmake/host-compiler/bin/clang++  -DGTEST_HAS_RTTI=0 -D_DEBUG -D_GNU_SOURCE -D__STDC_CONSTANT_MACROS -D__STDC_FORMAT_MACROS -D__STDC_LIMIT_MACROS -Itools/clang/lib/Format -I/Users/buildslave/jenkins/workspace/lldb-cmake/llvm-project/clang/lib/Format -I/Users/buildslave/jenkins/workspace/lldb-cmake/llvm-project/clang/include -Itools/clang/include -I/Applications/Xcode.app/Contents/Developer/Platforms/MacOSX.platform/Developer/SDKs/MacOSX10.15.sdk/usr/include/libxml2 -Iinclude -I/Users/buildslave/jenkins/workspace/lldb-cmake/llvm-project/llvm/include -Wdocumentation -fPIC -fvisibility-inlines-hidden -Werror=date-time -Werror=unguarded-availability-new -fmodules -fmodules-cache-path=/Users/buildslave/jenkins/workspace/lldb-cmake/lldb-build/module.cache -fcxx-modules -Xclang -fmodules-local-submodule-visibility -Wall -Wextra -Wno-unused-parameter -Wwrite-strings -Wcast-qual -Wmissing-field-initializers -pedantic -Wno-long-long -Wimplicit-fallthrough -Wcovered-switch-default -Wno-noexcept-type -Wnon-virtual-dtor -Wdelete-non-virtual-dtor -Wstring-conversion -fdiagnostics-color -fno-common -Woverloaded-virtual -Wno-nested-anon-types -O3  -isysroot /Applications/Xcode.app/Contents/Developer/Platforms/MacOSX.platform/Developer/SDKs/MacOSX10.15.sdk    -fno-exceptions -fno-rtti -UNDEBUG -std=c++14 -MD -MT tools/clang/lib/Format/CMakeFiles/obj.clangFormat.dir/TokenAnnotator.cpp.o -MF tools/clang/lib/Format/CMakeFiles/obj.clangFormat.dir/TokenAnnotator.cpp.o.d -o tools/clang/lib/Format/CMakeFiles/obj.clangFormat.dir/TokenAnnotator.cpp.o -c /Users/buildslave/jenkins/workspace/lldb-cmake/llvm-project/clang/lib/Format/TokenAnnotator.cpp
/Users/buildslave/jenkins/workspace/lldb-cmake/llvm-project/clang/lib/Format/TokenAnnotator.cpp:30:22: warning: '\c' command does not have a valid word argument [-Wdocumentation]
/// an Objective-C \c @selector, \c false otherwise.
                   ~~^
1 warning generated.
[3026/4439] /Users/buildslave/jenkins/workspace/lldb-cmake/host-compiler/bin/clang++  -DGTEST_HAS_RTTI=0 -D_DEBUG -D_GNU_SOURCE -D__STDC_CONSTANT_MACROS -D__STDC_FORMAT_MACROS -D__STDC_LIMIT_MACROS -Itools/clang/lib/Format -I/Users/buildslave/jenkins/workspace/lldb-cmake/llvm-project/clang/lib/Format -I/Users/buildslave/jenkins/workspace/lldb-cmake/llvm-project/clang/include -Itools/clang/include -I/Applications/Xcode.app/Contents/Developer/Platforms/MacOSX.platform/Developer/SDKs/MacOSX10.15.sdk/usr/include/libxml2 -Iinclude -I/Users/buildslave/jenkins/workspace/lldb-cmake/llvm-project/llvm/include -Wdocumentation -fPIC -fvisibility-inlines-hidden -Werror=date-time -Werror=unguarded-availability-new -fmodules -fmodules-cache-path=/Users/buildslave/jenkins/workspace/lldb-cmake/lldb-build/module.cache -fcxx-modules -Xclang -fmodules-local-submodule-visibility -Wall -Wextra -Wno-unused-parameter -Wwrite-strings -Wcast-qual -Wmissing-field-initializers -pedantic -Wno-long-long -Wimplicit-fallthrough -Wcovered-switch-default -Wno-noexcept-type -Wnon-virtual-dtor -Wdelete-non-virtual-dtor -Wstring-conversion -fdiagnostics-color -fno-common -Woverloaded-virtual -Wno-nested-anon-types -O3  -isysroot /Applications/Xcode.app/Contents/Developer/Platforms/MacOSX.platform/Developer/SDKs/MacOSX10.15.sdk    -fno-exceptions -fno-rtti -UNDEBUG -std=c++14 -MD -MT tools/clang/lib/Format/CMakeFiles/obj.clangFormat.dir/UnwrappedLineParser.cpp.o -MF tools/clang/lib/Format/CMakeFiles/obj.clangFormat.dir/UnwrappedLineParser.cpp.o.d -o tools/clang/lib/Format/CMakeFiles/obj.clangFormat.dir/UnwrappedLineParser.cpp.o -c /Users/buildslave/jenkins/workspace/lldb-cmake/llvm-project/clang/lib/Format/UnwrappedLineParser.cpp
[3027/4439] /Users/buildslave/jenkins/workspace/lldb-cmake/host-compiler/bin/clang++  -DGTEST_HAS_RTTI=0 -D_DEBUG -D_GNU_SOURCE -D__STDC_CONSTANT_MACROS -D__STDC_FORMAT_MACROS -D__STDC_LIMIT_MACROS -Itools/clang/tools/diagtool -I/Users/buildslave/jenkins/workspace/lldb-cmake/llvm-project/clang/tools/diagtool -I/Users/buildslave/jenkins/workspace/lldb-cmake/llvm-project/clang/include -Itools/clang/include -I/Applications/Xcode.app/Contents/Developer/Platforms/MacOSX.platform/Developer/SDKs/MacOSX10.15.sdk/usr/include/libxml2 -Iinclude -I/Users/buildslave/jenkins/workspace/lldb-cmake/llvm-project/llvm/include -Wdocumentation -fPIC -fvisibility-inlines-hidden -Werror=date-time -Werror=unguarded-availability-new -fmodules -fmodules-cache-path=/Users/buildslave/jenkins/workspace/lldb-cmake/lldb-build/module.cache -fcxx-modules -Xclang -fmodules-local-submodule-visibility -Wall -Wextra -Wno-unused-parameter -Wwrite-strings -Wcast-qual -Wmissing-field-initializers -pedantic -Wno-long-long -Wimplicit-fallthrough -Wcovered-switch-default -Wno-noexcept-type -Wnon-virtual-dtor -Wdelete-non-virtual-dtor -Wstring-conversion -fdiagnostics-color -fno-common -Woverloaded-virtual -Wno-nested-anon-types -O3  -isysroot /Applications/Xcode.app/Contents/Developer/Platforms/MacOSX.platform/Developer/SDKs/MacOSX10.15.sdk    -fno-exceptions -fno-rtti -UNDEBUG -std=c++14 -MD -MT tools/clang/tools/diagtool/CMakeFiles/diagtool.dir/TreeView.cpp.o -MF tools/clang/tools/diagtool/CMakeFiles/diagtool.dir/TreeView.cpp.o.d -o tools/clang/tools/diagtool/CMakeFiles/diagtool.dir/TreeView.cpp.o -c /Users/buildslave/jenkins/workspace/lldb-cmake/llvm-project/clang/tools/diagtool/TreeView.cpp
[3028/4439] /Users/buildslave/jenkins/workspace/lldb-cmake/host-compiler/bin/clang++  -DGTEST_HAS_RTTI=0 -D_DEBUG -D_GNU_SOURCE -D__STDC_CONSTANT_MACROS -D__STDC_FORMAT_MACROS -D__STDC_LIMIT_MACROS -Itools/clang/tools/diagtool -I/Users/buildslave/jenkins/workspace/lldb-cmake/llvm-project/clang/tools/diagtool -I/Users/buildslave/jenkins/workspace/lldb-cmake/llvm-project/clang/include -Itools/clang/include -I/Applications/Xcode.app/Contents/Developer/Platforms/MacOSX.platform/Developer/SDKs/MacOSX10.15.sdk/usr/include/libxml2 -Iinclude -I/Users/buildslave/jenkins/workspace/lldb-cmake/llvm-project/llvm/include -Wdocumentation -fPIC -fvisibility-inlines-hidden -Werror=date-time -Werror=unguarded-availability-new -fmodules -fmodules-cache-path=/Users/buildslave/jenkins/workspace/lldb-cmake/lldb-build/module.cache -fcxx-modules -Xclang -fmodules-local-submodule-visibility -Wall -Wextra -Wno-unused-parameter -Wwrite-strings -Wcast-qual -Wmissing-field-initializers -pedantic -Wno-long-long -Wimplicit-fallthrough -Wcovered-switch-default -Wno-noexcept-type -Wnon-virtual-dtor -Wdelete-non-virtual-dtor -Wstring-conversion -fdiagnostics-color -fno-common -Woverloaded-virtual -Wno-nested-anon-types -O3  -isysroot /Applications/Xcode.app/Contents/Developer/Platforms/MacOSX.platform/Developer/SDKs/MacOSX10.15.sdk    -fno-exceptions -fno-rtti -UNDEBUG -std=c++14 -MD -MT tools/clang/tools/diagtool/CMakeFiles/diagtool.dir/DiagnosticNames.cpp.o -MF tools/clang/tools/diagtool/CMakeFiles/diagtool.dir/DiagnosticNames.cpp.o.d -o tools/clang/tools/diagtool/CMakeFiles/diagtool.dir/DiagnosticNames.cpp.o -c /Users/buildslave/jenkins/workspace/lldb-cmake/llvm-project/clang/tools/diagtool/DiagnosticNames.cpp
[3029/4439] /Users/buildslave/jenkins/workspace/lldb-cmake/host-compiler/bin/clang++  -DGTEST_HAS_RTTI=0 -D_DEBUG -D_GNU_SOURCE -D__STDC_CONSTANT_MACROS -D__STDC_FORMAT_MACROS -D__STDC_LIMIT_MACROS -Itools/clang/lib/Format -I/Users/buildslave/jenkins/workspace/lldb-cmake/llvm-project/clang/lib/Format -I/Users/buildslave/jenkins/workspace/lldb-cmake/llvm-project/clang/include -Itools/clang/include -I/Applications/Xcode.app/Contents/Developer/Platforms/MacOSX.platform/Developer/SDKs/MacOSX10.15.sdk/usr/include/libxml2 -Iinclude -I/Users/buildslave/jenkins/workspace/lldb-cmake/llvm-project/llvm/include -Wdocumentation -fPIC -fvisibility-inlines-hidden -Werror=date-time -Werror=unguarded-availability-new -fmodules -fmodules-cache-path=/Users/buildslave/jenkins/workspace/lldb-cmake/lldb-build/module.cache -fcxx-modules -Xclang -fmodules-local-submodule-visibility -Wall -Wextra -Wno-unused-parameter -Wwrite-strings -Wcast-qual -Wmissing-field-initializers -pedantic -Wno-long-long -Wimplicit-fallthrough -Wcovered-switch-default -Wno-noexcept-type -Wnon-virtual-dtor -Wdelete-non-virtual-dtor -Wstring-conversion -fdiagnostics-color -fno-common -Woverloaded-virtual -Wno-nested-anon-types -O3  -isysroot /Applications/Xcode.app/Contents/Developer/Platforms/MacOSX.platform/Developer/SDKs/MacOSX10.15.sdk    -fno-exceptions -fno-rtti -UNDEBUG -std=c++14 -MD -MT tools/clang/lib/Format/CMakeFiles/obj.clangFormat.dir/WhitespaceManager.cpp.o -MF tools/clang/lib/Format/CMakeFiles/obj.clangFormat.dir/WhitespaceManager.cpp.o.d -o tools/clang/lib/Format/CMakeFiles/obj.clangFormat.dir/WhitespaceManager.cpp.o -c /Users/buildslave/jenkins/workspace/lldb-cmake/llvm-project/clang/lib/Format/WhitespaceManager.cpp
[3030/4439] : && /Users/buildslave/jenkins/workspace/lldb-cmake/host-compiler/bin/clang++  -Wdocumentation -fPIC -fvisibility-inlines-hidden -Werror=date-time -Werror=unguarded-availability-new -fmodules -fmodules-cache-path=/Users/buildslave/jenkins/workspace/lldb-cmake/lldb-build/module.cache -fcxx-modules -Xclang -fmodules-local-submodule-visibility -Wall -Wextra -Wno-unused-parameter -Wwrite-strings -Wcast-qual -Wmissing-field-initializers -pedantic -Wno-long-long -Wimplicit-fallthrough -Wcovered-switch-default -Wno-noexcept-type -Wnon-virtual-dtor -Wdelete-non-virtual-dtor -Wstring-conversion -fdiagnostics-color -fno-common -Woverloaded-virtual -Wno-nested-anon-types -O3  -isysroot /Applications/Xcode.app/Contents/Developer/Platforms/MacOSX.platform/Developer/SDKs/MacOSX10.15.sdk -Wl,-search_paths_first -Wl,-headerpad_max_install_names -Wl,-dead_strip tools/clang/tools/diagtool/CMakeFiles/diagtool.dir/diagtool_main.cpp.o tools/clang/tools/diagtool/CMakeFiles/diagtool.dir/DiagTool.cpp.o tools/clang/tools/diagtool/CMakeFiles/diagtool.dir/DiagnosticNames.cpp.o tools/clang/tools/diagtool/CMakeFiles/diagtool.dir/FindDiagnosticID.cpp.o tools/clang/tools/diagtool/CMakeFiles/diagtool.dir/ListWarnings.cpp.o tools/clang/tools/diagtool/CMakeFiles/diagtool.dir/ShowEnabledWarnings.cpp.o tools/clang/tools/diagtool/CMakeFiles/diagtool.dir/TreeView.cpp.o  -o bin/diagtool  -Wl,-rpath,@loader_path/../lib  lib/libLLVMSupport.a  lib/libclangBasic.a  lib/libclangFrontend.a  lib/libclangDriver.a  lib/libclangParse.a  lib/libclangSerialization.a  lib/libclangSema.a  lib/libclangEdit.a  lib/libclangAnalysis.a  lib/libclangASTMatchers.a  lib/libclangAST.a  lib/libclangLex.a  lib/libclangBasic.a  lib/libLLVMFrontendOpenMP.a  lib/libLLVMTransformUtils.a  lib/libLLVMAnalysis.a  lib/libLLVMObject.a  lib/libLLVMMCParser.a  lib/libLLVMMC.a  lib/libLLVMDebugInfoCodeView.a  lib/libLLVMDebugInfoMSF.a  lib/libLLVMTextAPI.a  lib/libLLVMBitReader.a  lib/libLLVMOption.a  lib/libLLVMProfileData.a  lib/libLLVMCore.a  lib/libLLVMBinaryFormat.a  lib/libLLVMRemarks.a  lib/libLLVMBitstreamReader.a  lib/libLLVMSupport.a  -lz  -lcurses  -lm  lib/libLLVMDemangle.a && :
FAILED: bin/diagtool 
: && /Users/buildslave/jenkins/workspace/lldb-cmake/host-compiler/bin/clang++  -Wdocumentation -fPIC -fvisibility-inlines-hidden -Werror=date-time -Werror=unguarded-availability-new -fmodules -fmodules-cache-path=/Users/buildslave/jenkins/workspace/lldb-cmake/lldb-build/module.cache -fcxx-modules -Xclang -fmodules-local-submodule-visibility -Wall -Wextra -Wno-unused-parameter -Wwrite-strings -Wcast-qual -Wmissing-field-initializers -pedantic -Wno-long-long -Wimplicit-fallthrough -Wcovered-switch-default -Wno-noexcept-type -Wnon-virtual-dtor -Wdelete-non-virtual-dtor -Wstring-conversion -fdiagnostics-color -fno-common -Woverloaded-virtual -Wno-nested-anon-types -O3  -isysroot /Applications/Xcode.app/Contents/Developer/Platforms/MacOSX.platform/Developer/SDKs/MacOSX10.15.sdk -Wl,-search_paths_first -Wl,-headerpad_max_install_names -Wl,-dead_strip tools/clang/tools/diagtool/CMakeFiles/diagtool.dir/diagtool_main.cpp.o tools/clang/tools/diagtool/CMakeFiles/diagtool.dir/DiagTool.cpp.o tools/clang/tools/diagtool/CMakeFiles/diagtool.dir/DiagnosticNames.cpp.o tools/clang/tools/diagtool/CMakeFiles/diagtool.dir/FindDiagnosticID.cpp.o tools/clang/tools/diagtool/CMakeFiles/diagtool.dir/ListWarnings.cpp.o tools/clang/tools/diagtool/CMakeFiles/diagtool.dir/ShowEnabledWarnings.cpp.o tools/clang/tools/diagtool/CMakeFiles/diagtool.dir/TreeView.cpp.o  -o bin/diagtool  -Wl,-rpath,@loader_path/../lib  lib/libLLVMSupport.a  lib/libclangBasic.a  lib/libclangFrontend.a  lib/libclangDriver.a  lib/libclangParse.a  lib/libclangSerialization.a  lib/libclangSema.a  lib/libclangEdit.a  lib/libclangAnalysis.a  lib/libclangASTMatchers.a  lib/libclangAST.a  lib/libclangLex.a  lib/libclangBasic.a  lib/libLLVMFrontendOpenMP.a  lib/libLLVMTransformUtils.a  lib/libLLVMAnalysis.a  lib/libLLVMObject.a  lib/libLLVMMCParser.a  lib/libLLVMMC.a  lib/libLLVMDebugInfoCodeView.a  lib/libLLVMDebugInfoMSF.a  lib/libLLVMTextAPI.a  lib/libLLVMBitReader.a  lib/libLLVMOption.a  lib/libLLVMProfileData.a  lib/libLLVMCore.a  lib/libLLVMBinaryFormat.a  lib/libLLVMRemarks.a  lib/libLLVMBitstreamReader.a  lib/libLLVMSupport.a  -lz  -lcurses  -lm  lib/libLLVMDemangle.a && :
Undefined symbols for architecture x86_64:
  "clang::ento::PackageInfo::dumpToStream(llvm::raw_ostream&) const", referenced from:
      clang::ento::PackageInfo::dump() const in ShowEnabledWarnings.cpp.o
      clang::ento::PackageInfo::dump() const in libclangFrontend.a(CompilerInstance.cpp.o)
      clang::ento::PackageInfo::dump() const in libclangFrontend.a(CompilerInvocation.cpp.o)
      clang::ento::PackageInfo::dump() const in libclangFrontend.a(CreateInvocationFromCommandLine.cpp.o)
      clang::ento::PackageInfo::dump() const in libclangFrontend.a(TextDiagnosticBuffer.cpp.o)
      clang::ento::PackageInfo::dump() const in libclangFrontend.a(FrontendAction.cpp.o)
      clang::ento::PackageInfo::dump() const in libclangFrontend.a(FrontendOptions.cpp.o)
      ...
  "clang::ento::CmdLineOption::dumpToStream(llvm::raw_ostream&) const", referenced from:
      clang::ento::CmdLineOption::dump() const in ShowEnabledWarnings.cpp.o
      clang::ento::CmdLineOption::dump() const in libclangFrontend.a(CompilerInstance.cpp.o)
      clang::ento::CmdLineOption::dump() const in libclangFrontend.a(CompilerInvocation.cpp.o)
      clang::ento::CmdLineOption::dump() const in libclangFrontend.a(CreateInvocationFromCommandLine.cpp.o)
      clang::ento::CmdLineOption::dump() const in libclangFrontend.a(TextDiagnosticBuffer.cpp.o)
      clang::ento::CmdLineOption::dump() const in libclangFrontend.a(FrontendAction.cpp.o)
      clang::ento::CmdLineOption::dump() const in libclangFrontend.a(FrontendOptions.cpp.o)
      ...
  "clang::ento::CheckerInfo::dumpToStream(llvm::raw_ostream&) const", referenced from:
      clang::ento::CheckerInfo::dump() const in ShowEnabledWarnings.cpp.o
      clang::ento::CheckerInfo::dump() const in libclangFrontend.a(CompilerInstance.cpp.o)
      clang::ento::CheckerInfo::dump() const in libclangFrontend.a(CompilerInvocation.cpp.o)
      clang::ento::CheckerInfo::dump() const in libclangFrontend.a(CreateInvocationFromCommandLine.cpp.o)
      clang::ento::CheckerInfo::dump() const in libclangFrontend.a(TextDiagnosticBuffer.cpp.o)
      clang::ento::CheckerInfo::dump() const in libclangFrontend.a(FrontendAction.cpp.o)
      clang::ento::CheckerInfo::dump() const in libclangFrontend.a(FrontendOptions.cpp.o)
      ...
ld: symbol(s) not found for architecture x86_64
clang-11: error: linker command failed with exit code 1 (use -v to see invocation)
[3031/4439] : && /Users/buildslave/jenkins/workspace/lldb-cmake/host-compiler/bin/clang++  -Wdocumentation -fPIC -fvisibility-inlines-hidden -Werror=date-time -Werror=unguarded-availability-new -fmodules -fmodules-cache-path=/Users/buildslave/jenkins/workspace/lldb-cmake/lldb-build/module.cache -fcxx-modules -Xclang -fmodules-local-submodule-visibility -Wall -Wextra -Wno-unused-parameter -Wwrite-strings -Wcast-qual -Wmissing-field-initializers -pedantic -Wno-long-long -Wimplicit-fallthrough -Wcovered-switch-default -Wno-noexcept-type -Wnon-virtual-dtor -Wdelete-non-virtual-dtor -Wstring-conversion -fdiagnostics-color -fno-common -Woverloaded-virtual -Wno-nested-anon-types -O3  -isysroot /Applications/Xcode.app/Contents/Developer/Platforms/MacOSX.platform/Developer/SDKs/MacOSX10.15.sdk -Wl,-search_paths_first -Wl,-headerpad_max_install_names -Wl,-dead_strip tools/clang/tools/clang-import-test/CMakeFiles/clang-import-test.dir/clang-import-test.cpp.o  -o bin/clang-import-test  -Wl,-rpath,@loader_path/../lib  lib/libLLVMCore.a  lib/libLLVMSupport.a  lib/libclangAST.a  lib/libclangBasic.a  lib/libclangCodeGen.a  lib/libclangDriver.a  lib/libclangFrontend.a  lib/libclangLex.a  lib/libclangParse.a  lib/libclangSerialization.a  lib/libclangDriver.a  lib/libLLVMOption.a  lib/libclangSema.a  lib/libclangEdit.a  lib/libclangAnalysis.a  lib/libclangASTMatchers.a  lib/libclangAST.a  lib/libclangLex.a  lib/libclangBasic.a  lib/libLLVMCoverage.a  lib/libLLVMLTO.a  lib/libLLVMExtensions.a  lib/libLLVMCodeGen.a  lib/libLLVMObjCARCOpts.a  lib/libLLVMPasses.a  lib/libLLVMCoroutines.a  lib/libLLVMipo.a  lib/libLLVMFrontendOpenMP.a  lib/libLLVMBitWriter.a  lib/libLLVMIRReader.a  lib/libLLVMAsmParser.a  lib/libLLVMLinker.a  lib/libLLVMInstrumentation.a  lib/libLLVMVectorize.a  lib/libLLVMScalarOpts.a  lib/libLLVMAggressiveInstCombine.a  lib/libLLVMInstCombine.a  lib/libLLVMTarget.a  lib/libLLVMTransformUtils.a  lib/libLLVMAnalysis.a  lib/libLLVMObject.a  lib/libLLVMBitReader.a  lib/libLLVMMCParser.a  lib/libLLVMMC.a  lib/libLLVMDebugInfoCodeView.a  lib/libLLVMDebugInfoMSF.a  lib/libLLVMTextAPI.a  lib/libLLVMProfileData.a  lib/libLLVMCore.a  lib/libLLVMBinaryFormat.a  lib/libLLVMRemarks.a  lib/libLLVMBitstreamReader.a  lib/libLLVMSupport.a  -lz  -lcurses  -lm  lib/libLLVMDemangle.a && :
FAILED: bin/clang-import-test 
: && /Users/buildslave/jenkins/workspace/lldb-cmake/host-compiler/bin/clang++  -Wdocumentation -fPIC -fvisibility-inlines-hidden -Werror=date-time -Werror=unguarded-availability-new -fmodules -fmodules-cache-path=/Users/buildslave/jenkins/workspace/lldb-cmake/lldb-build/module.cache -fcxx-modules -Xclang -fmodules-local-submodule-visibility -Wall -Wextra -Wno-unused-parameter -Wwrite-strings -Wcast-qual -Wmissing-field-initializers -pedantic -Wno-long-long -Wimplicit-fallthrough -Wcovered-switch-default -Wno-noexcept-type -Wnon-virtual-dtor -Wdelete-non-virtual-dtor -Wstring-conversion -fdiagnostics-color -fno-common -Woverloaded-virtual -Wno-nested-anon-types -O3  -isysroot /Applications/Xcode.app/Contents/Developer/Platforms/MacOSX.platform/Developer/SDKs/MacOSX10.15.sdk -Wl,-search_paths_first -Wl,-headerpad_max_install_names -Wl,-dead_strip tools/clang/tools/clang-import-test/CMakeFiles/clang-import-test.dir/clang-import-test.cpp.o  -o bin/clang-import-test  -Wl,-rpath,@loader_path/../lib  lib/libLLVMCore.a  lib/libLLVMSupport.a  lib/libclangAST.a  lib/libclangBasic.a  lib/libclangCodeGen.a  lib/libclangDriver.a  lib/libclangFrontend.a  lib/libclangLex.a  lib/libclangParse.a  lib/libclangSerialization.a  lib/libclangDriver.a  lib/libLLVMOption.a  lib/libclangSema.a  lib/libclangEdit.a  lib/libclangAnalysis.a  lib/libclangASTMatchers.a  lib/libclangAST.a  lib/libclangLex.a  lib/libclangBasic.a  lib/libLLVMCoverage.a  lib/libLLVMLTO.a  lib/libLLVMExtensions.a  lib/libLLVMCodeGen.a  lib/libLLVMObjCARCOpts.a  lib/libLLVMPasses.a  lib/libLLVMCoroutines.a  lib/libLLVMipo.a  lib/libLLVMFrontendOpenMP.a  lib/libLLVMBitWriter.a  lib/libLLVMIRReader.a  lib/libLLVMAsmParser.a  lib/libLLVMLinker.a  lib/libLLVMInstrumentation.a  lib/libLLVMVectorize.a  lib/libLLVMScalarOpts.a  lib/libLLVMAggressiveInstCombine.a  lib/libLLVMInstCombine.a  lib/libLLVMTarget.a  lib/libLLVMTransformUtils.a  lib/libLLVMAnalysis.a  lib/libLLVMObject.a  lib/libLLVMBitReader.a  lib/libLLVMMCParser.a  lib/libLLVMMC.a  lib/libLLVMDebugInfoCodeView.a  lib/libLLVMDebugInfoMSF.a  lib/libLLVMTextAPI.a  lib/libLLVMProfileData.a  lib/libLLVMCore.a  lib/libLLVMBinaryFormat.a  lib/libLLVMRemarks.a  lib/libLLVMBitstreamReader.a  lib/libLLVMSupport.a  -lz  -lcurses  -lm  lib/libLLVMDemangle.a && :
Undefined symbols for architecture x86_64:
  "clang::ento::PackageInfo::dumpToStream(llvm::raw_ostream&) const", referenced from:
      clang::ento::PackageInfo::dump() const in clang-import-test.cpp.o
      clang::ento::PackageInfo::dump() const in libclangCodeGen.a(ModuleBuilder.cpp.o)
      clang::ento::PackageInfo::dump() const in libclangFrontend.a(ASTConsumers.cpp.o)
      clang::ento::PackageInfo::dump() const in libclangFrontend.a(CompilerInstance.cpp.o)
      clang::ento::PackageInfo::dump() const in libclangFrontend.a(MultiplexConsumer.cpp.o)
      clang::ento::PackageInfo::dump() const in libclangFrontend.a(CompilerInvocation.cpp.o)
      clang::ento::PackageInfo::dump() const in libclangFrontend.a(TextDiagnosticBuffer.cpp.o)
      ...
  "clang::ento::CmdLineOption::dumpToStream(llvm::raw_ostream&) const", referenced from:
      clang::ento::CmdLineOption::dump() const in clang-import-test.cpp.o
      clang::ento::CmdLineOption::dump() const in libclangCodeGen.a(ModuleBuilder.cpp.o)
      clang::ento::CmdLineOption::dump() const in libclangFrontend.a(ASTConsumers.cpp.o)
      clang::ento::CmdLineOption::dump() const in libclangFrontend.a(CompilerInstance.cpp.o)
      clang::ento::CmdLineOption::dump() const in libclangFrontend.a(MultiplexConsumer.cpp.o)
      clang::ento::CmdLineOption::dump() const in libclangFrontend.a(CompilerInvocation.cpp.o)
      clang::ento::CmdLineOption::dump() const in libclangFrontend.a(TextDiagnosticBuffer.cpp.o)
      ...
  "clang::ento::CheckerInfo::dumpToStream(llvm::raw_ostream&) const", referenced from:
      clang::ento::CheckerInfo::dump() const in clang-import-test.cpp.o
      clang::ento::CheckerInfo::dump() const in libclangCodeGen.a(ModuleBuilder.cpp.o)
      clang::ento::CheckerInfo::dump() const in libclangFrontend.a(ASTConsumers.cpp.o)
      clang::ento::CheckerInfo::dump() const in libclangFrontend.a(CompilerInstance.cpp.o)
      clang::ento::CheckerInfo::dump() const in libclangFrontend.a(MultiplexConsumer.cpp.o)
      clang::ento::CheckerInfo::dump() const in libclangFrontend.a(CompilerInvocation.cpp.o)
      clang::ento::CheckerInfo::dump() const in libclangFrontend.a(TextDiagnosticBuffer.cpp.o)
      ...
ld: symbol(s) not found for architecture x86_64
clang-11: error: linker command failed with exit code 1 (use -v to see invocation)
[3032/4439] /Users/buildslave/jenkins/workspace/lldb-cmake/host-compiler/bin/clang++  -DGTEST_HAS_RTTI=0 -D_DEBUG -D_GNU_SOURCE -D__STDC_CONSTANT_MACROS -D__STDC_FORMAT_MACROS -D__STDC_LIMIT_MACROS -Itools/clang/tools/clang-format -I/Users/buildslave/jenkins/workspace/lldb-cmake/llvm-project/clang/tools/clang-format -I/Users/buildslave/jenkins/workspace/lldb-cmake/llvm-project/clang/include -Itools/clang/include -I/Applications/Xcode.app/Contents/Developer/Platforms/MacOSX.platform/Developer/SDKs/MacOSX10.15.sdk/usr/include/libxml2 -Iinclude -I/Users/buildslave/jenkins/workspace/lldb-cmake/llvm-project/llvm/include -Wdocumentation -fPIC -fvisibility-inlines-hidden -Werror=date-time -Werror=unguarded-availability-new -fmodules -fmodules-cache-path=/Users/buildslave/jenkins/workspace/lldb-cmake/lldb-build/module.cache -fcxx-modules -Xclang -fmodules-local-submodule-visibility -Wall -Wextra -Wno-unused-parameter -Wwrite-strings -Wcast-qual -Wmissing-field-initializers -pedantic -Wno-long-long -Wimplicit-fallthrough -Wcovered-switch-default -Wno-noexcept-type -Wnon-virtual-dtor -Wdelete-non-virtual-dtor -Wstring-conversion -fdiagnostics-color -fno-common -Woverloaded-virtual -Wno-nested-anon-types -O3  -isysroot /Applications/Xcode.app/Contents/Developer/Platforms/MacOSX.platform/Developer/SDKs/MacOSX10.15.sdk    -fno-exceptions -fno-rtti -UNDEBUG -std=c++14 -MD -MT tools/clang/tools/clang-format/CMakeFiles/clang-format.dir/ClangFormat.cpp.o -MF tools/clang/tools/clang-format/CMakeFiles/clang-format.dir/ClangFormat.cpp.o.d -o tools/clang/tools/clang-format/CMakeFiles/clang-format.dir/ClangFormat.cpp.o -c /Users/buildslave/jenkins/workspace/lldb-cmake/llvm-project/clang/tools/clang-format/ClangFormat.cpp
[3033/4439] /Users/buildslave/jenkins/workspace/lldb-cmake/host-compiler/bin/clang++  -DGTEST_HAS_RTTI=0 -D_DEBUG -D_GNU_SOURCE -D__STDC_CONSTANT_MACROS -D__STDC_FORMAT_MACROS -D__STDC_LIMIT_MACROS -Itools/clang/lib/Format -I/Users/buildslave/jenkins/workspace/lldb-cmake/llvm-project/clang/lib/Format -I/Users/buildslave/jenkins/workspace/lldb-cmake/llvm-project/clang/include -Itools/clang/include -I/Applications/Xcode.app/Contents/Developer/Platforms/MacOSX.platform/Developer/SDKs/MacOSX10.15.sdk/usr/include/libxml2 -Iinclude -I/Users/buildslave/jenkins/workspace/lldb-cmake/llvm-project/llvm/include -Wdocumentation -fPIC -fvisibility-inlines-hidden -Werror=date-time -Werror=unguarded-availability-new -fmodules -fmodules-cache-path=/Users/buildslave/jenkins/workspace/lldb-cmake/lldb-build/module.cache -fcxx-modules -Xclang -fmodules-local-submodule-visibility -Wall -Wextra -Wno-unused-parameter -Wwrite-strings -Wcast-qual -Wmissing-field-initializers -pedantic -Wno-long-long -Wimplicit-fallthrough -Wcovered-switch-default -Wno-noexcept-type -Wnon-virtual-dtor -Wdelete-non-virtual-dtor -Wstring-conversion -fdiagnostics-color -fno-common -Woverloaded-virtual -Wno-nested-anon-types -O3  -isysroot /Applications/Xcode.app/Contents/Developer/Platforms/MacOSX.platform/Developer/SDKs/MacOSX10.15.sdk    -fno-exceptions -fno-rtti -UNDEBUG -std=c++14 -MD -MT tools/clang/lib/Format/CMakeFiles/obj.clangFormat.dir/Format.cpp.o -MF tools/clang/lib/Format/CMakeFiles/obj.clangFormat.dir/Format.cpp.o.d -o tools/clang/lib/Format/CMakeFiles/obj.clangFormat.dir/Format.cpp.o -c /Users/buildslave/jenkins/workspace/lldb-cmake/llvm-project/clang/lib/Format/Format.cpp
[3034/4439] /Users/buildslave/jenkins/workspace/lldb-cmake/host-compiler/bin/clang++  -DGTEST_HAS_RTTI=0 -D_DEBUG -D_GNU_SOURCE -D__STDC_CONSTANT_MACROS -D__STDC_FORMAT_MACROS -D__STDC_LIMIT_MACROS -Itools/clang/tools/clang-offload-bundler -I/Users/buildslave/jenkins/workspace/lldb-cmake/llvm-project/clang/tools/clang-offload-bundler -I/Users/buildslave/jenkins/workspace/lldb-cmake/llvm-project/clang/include -Itools/clang/include -I/Applications/Xcode.app/Contents/Developer/Platforms/MacOSX.platform/Developer/SDKs/MacOSX10.15.sdk/usr/include/libxml2 -Iinclude -I/Users/buildslave/jenkins/workspace/lldb-cmake/llvm-project/llvm/include -Wdocumentation -fPIC -fvisibility-inlines-hidden -Werror=date-time -Werror=unguarded-availability-new -fmodules -fmodules-cache-path=/Users/buildslave/jenkins/workspace/lldb-cmake/lldb-build/module.cache -fcxx-modules -Xclang -fmodules-local-submodule-visibility -Wall -Wextra -Wno-unused-parameter -Wwrite-strings -Wcast-qual -Wmissing-field-initializers -pedantic -Wno-long-long -Wimplicit-fallthrough -Wcovered-switch-default -Wno-noexcept-type -Wnon-virtual-dtor -Wdelete-non-virtual-dtor -Wstring-conversion -fdiagnostics-color -fno-common -Woverloaded-virtual -Wno-nested-anon-types -O3  -isysroot /Applications/Xcode.app/Contents/Developer/Platforms/MacOSX.platform/Developer/SDKs/MacOSX10.15.sdk    -fno-exceptions -fno-rtti -UNDEBUG -std=c++14 -MD -MT tools/clang/tools/clang-offload-bundler/CMakeFiles/clang-offload-bundler.dir/ClangOffloadBundler.cpp.o -MF tools/clang/tools/clang-offload-bundler/CMakeFiles/clang-offload-bundler.dir/ClangOffloadBundler.cpp.o.d -o tools/clang/tools/clang-offload-bundler/CMakeFiles/clang-offload-bundler.dir/ClangOffloadBundler.cpp.o -c /Users/buildslave/jenkins/workspace/lldb-cmake/llvm-project/clang/tools/clang-offload-bundler/ClangOffloadBundler.cpp
[3035/4439] /Users/buildslave/jenkins/workspace/lldb-cmake/host-compiler/bin/clang++  -DGTEST_HAS_RTTI=0 -D_DEBUG -D_GNU_SOURCE -D__STDC_CONSTANT_MACROS -D__STDC_FORMAT_MACROS -D__STDC_LIMIT_MACROS -Itools/clang/tools/clang-offload-wrapper -I/Users/buildslave/jenkins/workspace/lldb-cmake/llvm-project/clang/tools/clang-offload-wrapper -I/Users/buildslave/jenkins/workspace/lldb-cmake/llvm-project/clang/include -Itools/clang/include -I/Applications/Xcode.app/Contents/Developer/Platforms/MacOSX.platform/Developer/SDKs/MacOSX10.15.sdk/usr/include/libxml2 -Iinclude -I/Users/buildslave/jenkins/workspace/lldb-cmake/llvm-project/llvm/include -Wdocumentation -fPIC -fvisibility-inlines-hidden -Werror=date-time -Werror=unguarded-availability-new -fmodules -fmodules-cache-path=/Users/buildslave/jenkins/workspace/lldb-cmake/lldb-build/module.cache -fcxx-modules -Xclang -fmodules-local-submodule-visibility -Wall -Wextra -Wno-unused-parameter -Wwrite-strings -Wcast-qual -Wmissing-field-initializers -pedantic -Wno-long-long -Wimplicit-fallthrough -Wcovered-switch-default -Wno-noexcept-type -Wnon-virtual-dtor -Wdelete-non-virtual-dtor -Wstring-conversion -fdiagnostics-color -fno-common -Woverloaded-virtual -Wno-nested-anon-types -O3  -isysroot /Applications/Xcode.app/Contents/Developer/Platforms/MacOSX.platform/Developer/SDKs/MacOSX10.15.sdk    -fno-exceptions -fno-rtti -UNDEBUG -std=c++14 -MD -MT tools/clang/tools/clang-offload-wrapper/CMakeFiles/clang-offload-wrapper.dir/ClangOffloadWrapper.cpp.o -MF tools/clang/tools/clang-offload-wrapper/CMakeFiles/clang-offload-wrapper.dir/ClangOffloadWrapper.cpp.o.d -o tools/clang/tools/clang-offload-wrapper/CMakeFiles/clang-offload-wrapper.dir/ClangOffloadWrapper.cpp.o -c /Users/buildslave/jenkins/workspace/lldb-cmake/llvm-project/clang/tools/clang-offload-wrapper/ClangOffloadWrapper.cpp
[3036/4439] /Users/buildslave/jenkins/workspace/lldb-cmake/host-compiler/bin/clang++  -DGTEST_HAS_RTTI=0 -D_DEBUG -D_GNU_SOURCE -D__STDC_CONSTANT_MACROS -D__STDC_FORMAT_MACROS -D__STDC_LIMIT_MACROS -Itools/clang/tools/clang-fuzzer/handle-llvm -I/Users/buildslave/jenkins/workspace/lldb-cmake/llvm-project/clang/tools/clang-fuzzer/handle-llvm -I/Users/buildslave/jenkins/workspace/lldb-cmake/llvm-project/clang/include -Itools/clang/include -I/Applications/Xcode.app/Contents/Developer/Platforms/MacOSX.platform/Developer/SDKs/MacOSX10.15.sdk/usr/include/libxml2 -Iinclude -I/Users/buildslave/jenkins/workspace/lldb-cmake/llvm-project/llvm/include -Wdocumentation -fPIC -fvisibility-inlines-hidden -Werror=date-time -Werror=unguarded-availability-new -fmodules -fmodules-cache-path=/Users/buildslave/jenkins/workspace/lldb-cmake/lldb-build/module.cache -fcxx-modules -Xclang -fmodules-local-submodule-visibility -Wall -Wextra -Wno-unused-parameter -Wwrite-strings -Wcast-qual -Wmissing-field-initializers -pedantic -Wno-long-long -Wimplicit-fallthrough -Wcovered-switch-default -Wno-noexcept-type -Wnon-virtual-dtor -Wdelete-non-virtual-dtor -Wstring-conversion -fdiagnostics-color -fno-common -Woverloaded-virtual -Wno-nested-anon-types -O3  -isysroot /Applications/Xcode.app/Contents/Developer/Platforms/MacOSX.platform/Developer/SDKs/MacOSX10.15.sdk    -fno-exceptions -fno-rtti -UNDEBUG -std=c++14 -MD -MT tools/clang/tools/clang-fuzzer/handle-llvm/CMakeFiles/obj.clangHandleLLVM.dir/handle_llvm.cpp.o -MF tools/clang/tools/clang-fuzzer/handle-llvm/CMakeFiles/obj.clangHandleLLVM.dir/handle_llvm.cpp.o.d -o tools/clang/tools/clang-fuzzer/handle-llvm/CMakeFiles/obj.clangHandleLLVM.dir/handle_llvm.cpp.o -c /Users/buildslave/jenkins/workspace/lldb-cmake/llvm-project/clang/tools/clang-fuzzer/handle-llvm/handle_llvm.cpp
[3037/4439] /Users/buildslave/jenkins/workspace/lldb-cmake/host-compiler/bin/clang++  -DGTEST_HAS_RTTI=0 -D_DEBUG -D_GNU_SOURCE -D__STDC_CONSTANT_MACROS -D__STDC_FORMAT_MACROS -D__STDC_LIMIT_MACROS -Itools/clang/tools/c-index-test -I/Users/buildslave/jenkins/workspace/lldb-cmake/llvm-project/clang/tools/c-index-test -I/Users/buildslave/jenkins/workspace/lldb-cmake/llvm-project/clang/include -Itools/clang/include -Iinclude -I/Users/buildslave/jenkins/workspace/lldb-cmake/llvm-project/llvm/include -isystem /Applications/Xcode.app/Contents/Developer/Platforms/MacOSX.platform/Developer/SDKs/MacOSX10.15.sdk/usr/include/libxml2 -Wdocumentation -fPIC -fvisibility-inlines-hidden -Werror=date-time -Werror=unguarded-availability-new -fmodules -fmodules-cache-path=/Users/buildslave/jenkins/workspace/lldb-cmake/lldb-build/module.cache -fcxx-modules -Xclang -fmodules-local-submodule-visibility -Wall -Wextra -Wno-unused-parameter -Wwrite-strings -Wcast-qual -Wmissing-field-initializers -pedantic -Wno-long-long -Wimplicit-fallthrough -Wcovered-switch-default -Wno-noexcept-type -Wnon-virtual-dtor -Wdelete-non-virtual-dtor -Wstring-conversion -fdiagnostics-color -fno-common -Woverloaded-virtual -Wno-nested-anon-types -O3  -isysroot /Applications/Xcode.app/Contents/Developer/Platforms/MacOSX.platform/Developer/SDKs/MacOSX10.15.sdk   -UNDEBUG -std=c++14  -fno-exceptions -fno-rtti -MD -MT tools/clang/tools/c-index-test/CMakeFiles/c-index-test.dir/core_main.cpp.o -MF tools/clang/tools/c-index-test/CMakeFiles/c-index-test.dir/core_main.cpp.o.d -o tools/clang/tools/c-index-test/CMakeFiles/c-index-test.dir/core_main.cpp.o -c /Users/buildslave/jenkins/workspace/lldb-cmake/llvm-project/clang/tools/c-index-test/core_main.cpp
[3038/4439] /Users/buildslave/jenkins/workspace/lldb-cmake/host-compiler/bin/clang++  -DGTEST_HAS_RTTI=0 -D_DEBUG -D_GNU_SOURCE -D__STDC_CONSTANT_MACROS -D__STDC_FORMAT_MACROS -D__STDC_LIMIT_MACROS -Itools/clang/tools/clang-rename -I/Users/buildslave/jenkins/workspace/lldb-cmake/llvm-project/clang/tools/clang-rename -I/Users/buildslave/jenkins/workspace/lldb-cmake/llvm-project/clang/include -Itools/clang/include -I/Applications/Xcode.app/Contents/Developer/Platforms/MacOSX.platform/Developer/SDKs/MacOSX10.15.sdk/usr/include/libxml2 -Iinclude -I/Users/buildslave/jenkins/workspace/lldb-cmake/llvm-project/llvm/include -Wdocumentation -fPIC -fvisibility-inlines-hidden -Werror=date-time -Werror=unguarded-availability-new -fmodules -fmodules-cache-path=/Users/buildslave/jenkins/workspace/lldb-cmake/lldb-build/module.cache -fcxx-modules -Xclang -fmodules-local-submodule-visibility -Wall -Wextra -Wno-unused-parameter -Wwrite-strings -Wcast-qual -Wmissing-field-initializers -pedantic -Wno-long-long -Wimplicit-fallthrough -Wcovered-switch-default -Wno-noexcept-type -Wnon-virtual-dtor -Wdelete-non-virtual-dtor -Wstring-conversion -fdiagnostics-color -fno-common -Woverloaded-virtual -Wno-nested-anon-types -O3  -isysroot /Applications/Xcode.app/Contents/Developer/Platforms/MacOSX.platform/Developer/SDKs/MacOSX10.15.sdk    -fno-exceptions -fno-rtti -UNDEBUG -std=c++14 -MD -MT tools/clang/tools/clang-rename/CMakeFiles/clang-rename.dir/ClangRename.cpp.o -MF tools/clang/tools/clang-rename/CMakeFiles/clang-rename.dir/ClangRename.cpp.o.d -o tools/clang/tools/clang-rename/CMakeFiles/clang-rename.dir/ClangRename.cpp.o -c /Users/buildslave/jenkins/workspace/lldb-cmake/llvm-project/clang/tools/clang-rename/ClangRename.cpp
[3039/4439] /Users/buildslave/jenkins/workspace/lldb-cmake/host-compiler/bin/clang++  -DGTEST_HAS_RTTI=0 -D_DEBUG -D_GNU_SOURCE -D__STDC_CONSTANT_MACROS -D__STDC_FORMAT_MACROS -D__STDC_LIMIT_MACROS -Itools/clang/tools/clang-scan-deps -I/Users/buildslave/jenkins/workspace/lldb-cmake/llvm-project/clang/tools/clang-scan-deps -I/Users/buildslave/jenkins/workspace/lldb-cmake/llvm-project/clang/include -Itools/clang/include -I/Applications/Xcode.app/Contents/Developer/Platforms/MacOSX.platform/Developer/SDKs/MacOSX10.15.sdk/usr/include/libxml2 -Iinclude -I/Users/buildslave/jenkins/workspace/lldb-cmake/llvm-project/llvm/include -Wdocumentation -fPIC -fvisibility-inlines-hidden -Werror=date-time -Werror=unguarded-availability-new -fmodules -fmodules-cache-path=/Users/buildslave/jenkins/workspace/lldb-cmake/lldb-build/module.cache -fcxx-modules -Xclang -fmodules-local-submodule-visibility -Wall -Wextra -Wno-unused-parameter -Wwrite-strings -Wcast-qual -Wmissing-field-initializers -pedantic -Wno-long-long -Wimplicit-fallthrough -Wcovered-switch-default -Wno-noexcept-type -Wnon-virtual-dtor -Wdelete-non-virtual-dtor -Wstring-conversion -fdiagnostics-color -fno-common -Woverloaded-virtual -Wno-nested-anon-types -O3  -isysroot /Applications/Xcode.app/Contents/Developer/Platforms/MacOSX.platform/Developer/SDKs/MacOSX10.15.sdk    -fno-exceptions -fno-rtti -UNDEBUG -std=c++14 -MD -MT tools/clang/tools/clang-scan-deps/CMakeFiles/clang-scan-deps.dir/ClangScanDeps.cpp.o -MF tools/clang/tools/clang-scan-deps/CMakeFiles/clang-scan-deps.dir/ClangScanDeps.cpp.o.d -o tools/clang/tools/clang-scan-deps/CMakeFiles/clang-scan-deps.dir/ClangScanDeps.cpp.o -c /Users/buildslave/jenkins/workspace/lldb-cmake/llvm-project/clang/tools/clang-scan-deps/ClangScanDeps.cpp
ninja: build stopped: subcommand failed.
Command failed: Command '['/usr/local/bin/ninja', '-v']' returned non-zero exit status 1
Command: ['/usr/local/bin/ninja', '-v']
[Pipeline] }
[Pipeline] // timeout
[Pipeline] }
[Pipeline] // stage
[Pipeline] stage
[Pipeline] { (Test)
Stage "Test" skipped due to earlier failure(s)
[Pipeline] }
[Pipeline] // stage
[Pipeline] stage
[Pipeline] { (Declarative: Post Actions)
[Pipeline] scanForIssues
[Clang (LLVM based)] Sleeping for 5 seconds due to JENKINS-32191...
[Clang (LLVM based)] Parsing console log (workspace: '/Users/buildslave/jenkins/workspace/lldb-cmake')
[Clang (LLVM based)] Successfully parsed console log
[Clang (LLVM based)] -> found 7 issues (skipped 16 duplicates)
[Clang (LLVM based)] Post processing issues on 'green-dragon-10' with source code encoding 'UTF-8'
[Clang (LLVM based)] Creating SCM blamer to obtain author and commit information for affected files
[Clang (LLVM based)] Creating SCM miner to obtain statistics for affected repository files
[Clang (LLVM based)] Resolving file names for all issues in source directory '/Users/buildslave/jenkins/workspace/lldb-cmake'
[Clang (LLVM based)] -> resolved paths in source directory (3 found, 0 not found)
[Clang (LLVM based)] Resolving module names from module definitions (build.xml, pom.xml, or Manifest.mf files)
[Clang (LLVM based)] -> resolved module names for 7 issues
[Clang (LLVM based)] Resolving package names (or namespaces) by parsing the affected files
[Clang (LLVM based)] -> resolved package names of 3 affected files
[Clang (LLVM based)] No filter has been set, publishing all 7 issues
[Clang (LLVM based)] Creating fingerprints for all affected code blocks to track issues over different builds
[Clang (LLVM based)] -> created fingerprints for 7 issues (skipped 0 issues)
[Clang (LLVM based)] Copying affected files to Jenkins' build folder '/Users/Shared/Jenkins/Home/jobs/lldb-cmake/builds/22291/files-with-issues'
[Clang (LLVM based)] -> 3 copied, 0 not in workspace, 0 not-found, 0 with I/O error
[Pipeline] junit
Recording test results
Test reports were found but none of them are new. Did leafNodes run? 
For example, /Users/buildslave/jenkins/workspace/lldb-cmake/test/results.xml is 2 days 0 hr old

Hide Details

Error when executing always post condition: hudson.AbortException: Test reports were found but none of them are new. Did leafNodes run? For example, /Users/buildslave/jenkins/workspace/lldb-cmake/test/results.xml is 2 days 0 hr old

Hide Details

at hudson.tasks.junit.TestResult.parse(TestResult.java:222) at hudson.tasks.junit.TestResult.parse(TestResult.java:178) at hudson.tasks.junit.TestResult.<init>(TestResult.java:143) at hudson.tasks.junit.JUnitParser$ParseResultCallable.invoke(JUnitParser.java:146) at hudson.tasks.junit.JUnitParser$ParseResultCallable.invoke(JUnitParser.java:118) at hudson.FilePath$FileCallableWrapper.call(FilePath.java:3069) at hudson.remoting.UserRequest.perform(UserRequest.java:211) at hudson.remoting.UserRequest.perform(UserRequest.java:54) at hudson.remoting.Request$2.run(Request.java:369) at hudson.remoting.InterceptingExecutorService$1.call(InterceptingExecutorService.java:72) at java.util.concurrent.FutureTask.run(Unknown Source) at java.util.concurrent.ThreadPoolExecutor.runWorker(Unknown Source) at java.util.concurrent.ThreadPoolExecutor$Worker.run(Unknown Source) at java.lang.Thread.run(Unknown Source) Suppressed: hudson.remoting.Channel$CallSiteStackTrace: Remote call to green-dragon-10 at hudson.remoting.Channel.attachCallSiteStackTrace(Channel.java:1788) at hudson.remoting.UserRequest$ExceptionResponse.retrieve(UserRequest.java:356) at hudson.remoting.Channel.call(Channel.java:998) at hudson.FilePath.act(FilePath.java:1069) at hudson.FilePath.act(FilePath.java:1058) at hudson.tasks.junit.JUnitParser.parseResult(JUnitParser.java:114) at hudson.tasks.junit.JUnitResultArchiver.parse(JUnitResultArchiver.java:137) at hudson.tasks.junit.JUnitResultArchiver.parseAndAttach(JUnitResultArchiver.java:167) at hudson.tasks.junit.pipeline.JUnitResultsStepExecution.run(JUnitResultsStepExecution.java:52) at hudson.tasks.junit.pipeline.JUnitResultsStepExecution.run(JUnitResultsStepExecution.java:25) at org.jenkinsci.plugins.workflow.steps.SynchronousNonBlockingStepExecution.lambda$start$0(SynchronousNonBlockingStepExecution.java:47) at java.util.concurrent.Executors$RunnableAdapter.call(Executors.java:511) at java.util.concurrent.FutureTask.run(FutureTask.java:266) at java.util.concurrent.ThreadPoolExecutor.runWorker(ThreadPoolExecutor.java:1149) at java.util.concurrent.ThreadPoolExecutor$Worker.run(ThreadPoolExecutor.java:624) at java.lang.Thread.run(Thread.java:748)

Hide Details

[Pipeline] } [Pipeline] // stage [Pipeline] } [Pipeline] // withEnv [Pipeline] } [Pipeline] // node [Pipeline] End of Pipeline ERROR: script returned exit code 1 Finished: FAILURE