Started 7 mo 4 days ago
Took 28 min

Failed Build clang-d333053-g6ed9cef25f9-t4278-b4278.tar.gz (Dec 3, 2019 10:40:57 AM)

Issues

Found 11 issues:
Ninja target: alias-4.c.o [3982/7684] /Users/buildslave/jenkins/workspace/test-suite-verify-machineinstrs-x86_64-O3/test-suite-build/tools/timeit --summary SingleSource/Regression/C/gcc-c-torture/execute/CMakeFiles/GCC-C-execute-20120615-1.dir/20120615-1.c.o.time /Users/buildslave/jenkins/workspace/test-suite-verify-machineinstrs-x86_64-O3/compiler/bin/clang -DNDEBUG -B /Applications/Xcode.app/Contents/Developer/Toolchains/XcodeDefault.xctoolchain/usr/bin -Wno-unused-command-line-argument -mllvm -verify-machineinstrs -O3 -arch x86_64 -isysroot /Applications/Xcode.app/Contents/Developer/Platforms/MacOSX.platform/Developer/SDKs/MacOSX10.14.sdk -w -Werror=date-time -w -MD -MT SingleSource/Regression/C/gcc-c-torture/execute/CMakeFiles/GCC-C-execute-20120615-1.dir/20120615-1.c.o -MF SingleSource/Regression/C/gcc-c-torture/execute/CMakeFiles/GCC-C-execute-20120615-1.dir/20120615-1.c.o.d -o SingleSource/Regression/C/gcc-c-torture/execute/CMakeFiles/GCC-C-execute-20120615-1.dir/20120615-1.c.o -c /Users/buildslave/jenkins/workspace/test-suite-verify-machineinstrs-x86_64-O3/test-suite/SingleSource/Regression/C/gcc-c-torture/execute/20120615-1.c [3983/7684] : && /Users/buildslave/jenkins/workspace/test-suite-verify-machineinstrs-x86_64-O3/test-suite-build/tools/timeit --summary SingleSource/Regression/C/gcc-c-torture/execute/GCC-C-execute-990531-1.link.time /Users/buildslave/jenkins/workspace/test-suite-verify-machineinstrs-x86_64-O3/compiler/bin/clang -B /Applications/Xcode.app/Contents/Developer/Toolchains/XcodeDefault.xctoolchain/usr/bin -Wno-unused-command-line-argument -mllvm -verify-machineinstrs -O3 -arch x86_64 -isysroot /Applications/Xcode.app/Contents/Developer/Platforms/MacOSX.platform/Developer/SDKs/MacOSX10.14.sdk -Wl,-search_paths_first -Wl,-headerpad_max_install_names -B /Applications/Xcode.app/Contents/Developer/Toolchains/XcodeDefault.xctoolchain/usr/bin SingleSource/Regression/C/gcc-c-torture/execute/CMakeFiles/GCC-C-execute-990531-1.dir/990531-1.c.o -o SingleSource/Regression/C/gcc-c-torture/execute/GCC-C-execute-990531-1 -Wl,-no_pie && : [3984/7684] : && /Users/buildslave/jenkins/workspace/test-suite-verify-machineinstrs-x86_64-O3/test-suite-build/tools/timeit --summary SingleSource/Regression/C/gcc-c-torture/execute/GCC-C-execute-960312-1.link.time /Users/buildslave/jenkins/workspace/test-suite-verify-machineinstrs-x86_64-O3/compiler/bin/clang -B /Applications/Xcode.app/Contents/Developer/Toolchains/XcodeDefault.xctoolchain/usr/bin -Wno-unused-command-line-argument -mllvm -verify-machineinstrs -O3 -arch x86_64 -isysroot /Applications/Xcode.app/Contents/Developer/Platforms/MacOSX.platform/Developer/SDKs/MacOSX10.14.sdk -Wl,-search_paths_first -Wl,-headerpad_max_install_names -B /Applications/Xcode.app/Contents/Developer/Toolchains/XcodeDefault.xctoolchain/usr/bin SingleSource/Regression/C/gcc-c-torture/execute/CMakeFiles/GCC-C-execute-960312-1.dir/960312-1.c.o -o SingleSource/Regression/C/gcc-c-torture/execute/GCC-C-execute-960312-1 -Wl,-no_pie && : [3985/7684] : && /Users/buildslave/jenkins/workspace/test-suite-verify-machineinstrs-x86_64-O3/test-suite-build/tools/timeit --summary SingleSource/Regression/C/gcc-c-torture/execute/GCC-C-execute-20120615-1.link.time /Users/buildslave/jenkins/workspace/test-suite-verify-machineinstrs-x86_64-O3/compiler/bin/clang -B /Applications/Xcode.app/Contents/Developer/Toolchains/XcodeDefault.xctoolchain/usr/bin -Wno-unused-command-line-argument -mllvm -verify-machineinstrs -O3 -arch x86_64 -isysroot /Applications/Xcode.app/Contents/Developer/Platforms/MacOSX.platform/Developer/SDKs/MacOSX10.14.sdk -Wl,-search_paths_first -Wl,-headerpad_max_install_names -B /Applications/Xcode.app/Contents/Developer/Toolchains/XcodeDefault.xctoolchain/usr/bin SingleSource/Regression/C/gcc-c-torture/execute/CMakeFiles/GCC-C-execute-20120615-1.dir/20120615-1.c.o -o SingleSource/Regression/C/gcc-c-torture/execute/GCC-C-execute-20120615-1 -Wl,-no_pie && : [3986/7684] /Users/buildslave/jenkins/workspace/test-suite-verify-machineinstrs-x86_64-O3/test-suite-build/tools/timeit --summary SingleSource/Regression/C/gcc-c-torture/execute/CMakeFiles/GCC-C-execute-alias-4.dir/alias-4.c.o.time /Users/buildslave/jenkins/workspace/test-suite-verify-machineinstrs-x86_64-O3/compiler/bin/clang -DNDEBUG -B /Applications/Xcode.app/Contents/Developer/Toolchains/XcodeDefault.xctoolchain/usr/bin -Wno-unused-command-line-argument -mllvm -verify-machineinstrs -O3 -arch x86_64 -isysroot /Applications/Xcode.app/Contents/Developer/Platforms/MacOSX.platform/Developer/SDKs/MacOSX10.14.sdk -w -Werror=date-time -w -MD -MT SingleSource/Regression/C/gcc-c-torture/execute/CMakeFiles/GCC-C-execute-alias-4.dir/alias-4.c.o -MF SingleSource/Regression/C/gcc-c-torture/execute/CMakeFiles/GCC-C-execute-alias-4.dir/alias-4.c.o.d -o SingleSource/Regression/C/gcc-c-torture/execute/CMakeFiles/GCC-C-execute-alias-4.dir/alias-4.c.o -c /Users/buildslave/jenkins/workspace/test-suite-verify-machineinstrs-x86_64-O3/test-suite/SingleSource/Regression/C/gcc-c-torture/execute/alias-4.c FAILED: SingleSource/Regression/C/gcc-c-torture/execute/CMakeFiles/GCC-C-execute-alias-4.dir/alias-4.c.o /Users/buildslave/jenkins/workspace/test-suite-verify-machineinstrs-x86_64-O3/test-suite-build/tools/timeit --summary SingleSource/Regression/C/gcc-c-torture/execute/CMakeFiles/GCC-C-execute-alias-4.dir/alias-4.c.o.time /Users/buildslave/jenkins/workspace/test-suite-verify-machineinstrs-x86_64-O3/compiler/bin/clang -DNDEBUG -B /Applications/Xcode.app/Contents/Developer/Toolchains/XcodeDefault.xctoolchain/usr/bin -Wno-unused-command-line-argument -mllvm -verify-machineinstrs -O3 -arch x86_64 -isysroot /Applications/Xcode.app/Contents/Developer/Platforms/MacOSX.platform/Developer/SDKs/MacOSX10.14.sdk -w -Werror=date-time -w -MD -MT SingleSource/Regression/C/gcc-c-torture/execute/CMakeFiles/GCC-C-execute-alias-4.dir/alias-4.c.o -MF SingleSource/Regression/C/gcc-c-torture/execute/CMakeFiles/GCC-C-execute-alias-4.dir/alias-4.c.o.d -o SingleSource/Regression/C/gcc-c-torture/execute/CMakeFiles/GCC-C-execute-alias-4.dir/alias-4.c.o -c /Users/buildslave/jenkins/workspace/test-suite-verify-machineinstrs-x86_64-O3/test-suite/SingleSource/Regression/C/gcc-c-torture/execute/alias-4.c /Users/buildslave/jenkins/workspace/test-suite-verify-machineinstrs-x86_64-O3/test-suite/SingleSource/Regression/C/gcc-c-torture/execute/alias-4.c:3:30: error: aliases are not supported on darwin alias-4.c error: aliases are not supported on darwin [3984/7684] : && /Users/buildslave/jenkins/workspace/test-suite-verify-machineinstrs-x86_64-O3/test-suite-build/tools/timeit --summary SingleSource/Regression/C/gcc-c-torture/execute/GCC-C-execute-960312-1.link.time /Users/buildslave/jenkins/workspace/test-suite-verify-machineinstrs-x86_64-O3/compiler/bin/clang -B /Applications/Xcode.app/Contents/Developer/Toolchains/XcodeDefault.xctoolchain/usr/bin -Wno-unused-command-line-argument -mllvm -verify-machineinstrs -O3 -arch x86_64 -isysroot /Applications/Xcode.app/Contents/Developer/Platforms/MacOSX.platform/Developer/SDKs/MacOSX10.14.sdk -Wl,-search_paths_first -Wl,-headerpad_max_install_names -B /Applications/Xcode.app/Contents/Developer/Toolchains/XcodeDefault.xctoolchain/usr/bin SingleSource/Regression/C/gcc-c-torture/execute/CMakeFiles/GCC-C-execute-960312-1.dir/960312-1.c.o -o SingleSource/Regression/C/gcc-c-torture/execute/GCC-C-execute-960312-1 -Wl,-no_pie && : [3985/7684] : && /Users/buildslave/jenkins/workspace/test-suite-verify-machineinstrs-x86_64-O3/test-suite-build/tools/timeit --summary SingleSource/Regression/C/gcc-c-torture/execute/GCC-C-execute-20120615-1.link.time /Users/buildslave/jenkins/workspace/test-suite-verify-machineinstrs-x86_64-O3/compiler/bin/clang -B /Applications/Xcode.app/Contents/Developer/Toolchains/XcodeDefault.xctoolchain/usr/bin -Wno-unused-command-line-argument -mllvm -verify-machineinstrs -O3 -arch x86_64 -isysroot /Applications/Xcode.app/Contents/Developer/Platforms/MacOSX.platform/Developer/SDKs/MacOSX10.14.sdk -Wl,-search_paths_first -Wl,-headerpad_max_install_names -B /Applications/Xcode.app/Contents/Developer/Toolchains/XcodeDefault.xctoolchain/usr/bin SingleSource/Regression/C/gcc-c-torture/execute/CMakeFiles/GCC-C-execute-20120615-1.dir/20120615-1.c.o -o SingleSource/Regression/C/gcc-c-torture/execute/GCC-C-execute-20120615-1 -Wl,-no_pie && : [3986/7684] /Users/buildslave/jenkins/workspace/test-suite-verify-machineinstrs-x86_64-O3/test-suite-build/tools/timeit --summary SingleSource/Regression/C/gcc-c-torture/execute/CMakeFiles/GCC-C-execute-alias-4.dir/alias-4.c.o.time /Users/buildslave/jenkins/workspace/test-suite-verify-machineinstrs-x86_64-O3/compiler/bin/clang -DNDEBUG -B /Applications/Xcode.app/Contents/Developer/Toolchains/XcodeDefault.xctoolchain/usr/bin -Wno-unused-command-line-argument -mllvm -verify-machineinstrs -O3 -arch x86_64 -isysroot /Applications/Xcode.app/Contents/Developer/Platforms/MacOSX.platform/Developer/SDKs/MacOSX10.14.sdk -w -Werror=date-time -w -MD -MT SingleSource/Regression/C/gcc-c-torture/execute/CMakeFiles/GCC-C-execute-alias-4.dir/alias-4.c.o -MF SingleSource/Regression/C/gcc-c-torture/execute/CMakeFiles/GCC-C-execute-alias-4.dir/alias-4.c.o.d -o SingleSource/Regression/C/gcc-c-torture/execute/CMakeFiles/GCC-C-execute-alias-4.dir/alias-4.c.o -c /Users/buildslave/jenkins/workspace/test-suite-verify-machineinstrs-x86_64-O3/test-suite/SingleSource/Regression/C/gcc-c-torture/execute/alias-4.c FAILED: SingleSource/Regression/C/gcc-c-torture/execute/CMakeFiles/GCC-C-execute-alias-4.dir/alias-4.c.o /Users/buildslave/jenkins/workspace/test-suite-verify-machineinstrs-x86_64-O3/test-suite-build/tools/timeit --summary SingleSource/Regression/C/gcc-c-torture/execute/CMakeFiles/GCC-C-execute-alias-4.dir/alias-4.c.o.time /Users/buildslave/jenkins/workspace/test-suite-verify-machineinstrs-x86_64-O3/compiler/bin/clang -DNDEBUG -B /Applications/Xcode.app/Contents/Developer/Toolchains/XcodeDefault.xctoolchain/usr/bin -Wno-unused-command-line-argument -mllvm -verify-machineinstrs -O3 -arch x86_64 -isysroot /Applications/Xcode.app/Contents/Developer/Platforms/MacOSX.platform/Developer/SDKs/MacOSX10.14.sdk -w -Werror=date-time -w -MD -MT SingleSource/Regression/C/gcc-c-torture/execute/CMakeFiles/GCC-C-execute-alias-4.dir/alias-4.c.o -MF SingleSource/Regression/C/gcc-c-torture/execute/CMakeFiles/GCC-C-execute-alias-4.dir/alias-4.c.o.d -o SingleSource/Regression/C/gcc-c-torture/execute/CMakeFiles/GCC-C-execute-alias-4.dir/alias-4.c.o -c /Users/buildslave/jenkins/workspace/test-suite-verify-machineinstrs-x86_64-O3/test-suite/SingleSource/Regression/C/gcc-c-torture/execute/alias-4.c /Users/buildslave/jenkins/workspace/test-suite-verify-machineinstrs-x86_64-O3/test-suite/SingleSource/Regression/C/gcc-c-torture/execute/alias-4.c:3:30: error: aliases are not supported on darwin extern int b __attribute__ ((alias ("a"))); ^ alias-4.c error: aliases are not supported on darwin FAILED: SingleSource/Regression/C/gcc-c-torture/execute/CMakeFiles/GCC-C-execute-alias-4.dir/alias-4.c.o /Users/buildslave/jenkins/workspace/test-suite-verify-machineinstrs-x86_64-O3/test-suite-build/tools/timeit --summary SingleSource/Regression/C/gcc-c-torture/execute/CMakeFiles/GCC-C-execute-alias-4.dir/alias-4.c.o.time /Users/buildslave/jenkins/workspace/test-suite-verify-machineinstrs-x86_64-O3/compiler/bin/clang -DNDEBUG -B /Applications/Xcode.app/Contents/Developer/Toolchains/XcodeDefault.xctoolchain/usr/bin -Wno-unused-command-line-argument -mllvm -verify-machineinstrs -O3 -arch x86_64 -isysroot /Applications/Xcode.app/Contents/Developer/Platforms/MacOSX.platform/Developer/SDKs/MacOSX10.14.sdk -w -Werror=date-time -w -MD -MT SingleSource/Regression/C/gcc-c-torture/execute/CMakeFiles/GCC-C-execute-alias-4.dir/alias-4.c.o -MF SingleSource/Regression/C/gcc-c-torture/execute/CMakeFiles/GCC-C-execute-alias-4.dir/alias-4.c.o.d -o SingleSource/Regression/C/gcc-c-torture/execute/CMakeFiles/GCC-C-execute-alias-4.dir/alias-4.c.o -c /Users/buildslave/jenkins/workspace/test-suite-verify-machineinstrs-x86_64-O3/test-suite/SingleSource/Regression/C/gcc-c-torture/execute/alias-4.c /Users/buildslave/jenkins/workspace/test-suite-verify-machineinstrs-x86_64-O3/test-suite/SingleSource/Regression/C/gcc-c-torture/execute/alias-4.c:3:30: error: aliases are not supported on darwin extern int b __attribute__ ((alias ("a"))); ^ /Users/buildslave/jenkins/workspace/test-suite-verify-machineinstrs-x86_64-O3/test-suite/SingleSource/Regression/C/gcc-c-torture/execute/alias-4.c:5:30: error: aliases are not supported on darwin extern int d __attribute__ ((alias ("c"))); ^ Ninja target: alias-3.c.o [5768/7684] : && /Users/buildslave/jenkins/workspace/test-suite-verify-machineinstrs-x86_64-O3/test-suite-build/tools/timeit --summary SingleSource/Regression/C/gcc-c-torture/execute/GCC-C-execute-align-1.link.time /Users/buildslave/jenkins/workspace/test-suite-verify-machineinstrs-x86_64-O3/compiler/bin/clang -B /Applications/Xcode.app/Contents/Developer/Toolchains/XcodeDefault.xctoolchain/usr/bin -Wno-unused-command-line-argument -mllvm -verify-machineinstrs -O3 -arch x86_64 -isysroot /Applications/Xcode.app/Contents/Developer/Platforms/MacOSX.platform/Developer/SDKs/MacOSX10.14.sdk -Wl,-search_paths_first -Wl,-headerpad_max_install_names -B /Applications/Xcode.app/Contents/Developer/Toolchains/XcodeDefault.xctoolchain/usr/bin SingleSource/Regression/C/gcc-c-torture/execute/CMakeFiles/GCC-C-execute-align-1.dir/align-1.c.o -o SingleSource/Regression/C/gcc-c-torture/execute/GCC-C-execute-align-1 -Wl,-no_pie && : [5769/7684] : && /Users/buildslave/jenkins/workspace/test-suite-verify-machineinstrs-x86_64-O3/test-suite-build/tools/timeit --summary SingleSource/Regression/C/gcc-c-torture/execute/GCC-C-execute-align-2.link.time /Users/buildslave/jenkins/workspace/test-suite-verify-machineinstrs-x86_64-O3/compiler/bin/clang -B /Applications/Xcode.app/Contents/Developer/Toolchains/XcodeDefault.xctoolchain/usr/bin -Wno-unused-command-line-argument -mllvm -verify-machineinstrs -O3 -arch x86_64 -isysroot /Applications/Xcode.app/Contents/Developer/Platforms/MacOSX.platform/Developer/SDKs/MacOSX10.14.sdk -Wl,-search_paths_first -Wl,-headerpad_max_install_names -B /Applications/Xcode.app/Contents/Developer/Toolchains/XcodeDefault.xctoolchain/usr/bin SingleSource/Regression/C/gcc-c-torture/execute/CMakeFiles/GCC-C-execute-align-2.dir/align-2.c.o -o SingleSource/Regression/C/gcc-c-torture/execute/GCC-C-execute-align-2 -Wl,-no_pie && : [5770/7684] /Users/buildslave/jenkins/workspace/test-suite-verify-machineinstrs-x86_64-O3/test-suite-build/tools/timeit --summary SingleSource/Regression/C/gcc-c-torture/execute/CMakeFiles/GCC-C-execute-pr61306-2.dir/pr61306-2.c.o.time /Users/buildslave/jenkins/workspace/test-suite-verify-machineinstrs-x86_64-O3/compiler/bin/clang -DNDEBUG -B /Applications/Xcode.app/Contents/Developer/Toolchains/XcodeDefault.xctoolchain/usr/bin -Wno-unused-command-line-argument -mllvm -verify-machineinstrs -O3 -arch x86_64 -isysroot /Applications/Xcode.app/Contents/Developer/Platforms/MacOSX.platform/Developer/SDKs/MacOSX10.14.sdk -w -Werror=date-time -w -MD -MT SingleSource/Regression/C/gcc-c-torture/execute/CMakeFiles/GCC-C-execute-pr61306-2.dir/pr61306-2.c.o -MF SingleSource/Regression/C/gcc-c-torture/execute/CMakeFiles/GCC-C-execute-pr61306-2.dir/pr61306-2.c.o.d -o SingleSource/Regression/C/gcc-c-torture/execute/CMakeFiles/GCC-C-execute-pr61306-2.dir/pr61306-2.c.o -c /Users/buildslave/jenkins/workspace/test-suite-verify-machineinstrs-x86_64-O3/test-suite/SingleSource/Regression/C/gcc-c-torture/execute/pr61306-2.c [5771/7684] : && /Users/buildslave/jenkins/workspace/test-suite-verify-machineinstrs-x86_64-O3/test-suite-build/tools/timeit --summary SingleSource/Regression/C/gcc-c-torture/execute/GCC-C-execute-alias-access-path-1.link.time /Users/buildslave/jenkins/workspace/test-suite-verify-machineinstrs-x86_64-O3/compiler/bin/clang -B /Applications/Xcode.app/Contents/Developer/Toolchains/XcodeDefault.xctoolchain/usr/bin -Wno-unused-command-line-argument -mllvm -verify-machineinstrs -O3 -arch x86_64 -isysroot /Applications/Xcode.app/Contents/Developer/Platforms/MacOSX.platform/Developer/SDKs/MacOSX10.14.sdk -Wl,-search_paths_first -Wl,-headerpad_max_install_names -B /Applications/Xcode.app/Contents/Developer/Toolchains/XcodeDefault.xctoolchain/usr/bin SingleSource/Regression/C/gcc-c-torture/execute/CMakeFiles/GCC-C-execute-alias-access-path-1.dir/alias-access-path-1.c.o -o SingleSource/Regression/C/gcc-c-torture/execute/GCC-C-execute-alias-access-path-1 -Wl,-no_pie && : [5772/7684] /Users/buildslave/jenkins/workspace/test-suite-verify-machineinstrs-x86_64-O3/test-suite-build/tools/timeit --summary SingleSource/Regression/C/gcc-c-torture/execute/CMakeFiles/GCC-C-execute-alias-3.dir/alias-3.c.o.time /Users/buildslave/jenkins/workspace/test-suite-verify-machineinstrs-x86_64-O3/compiler/bin/clang -DNDEBUG -B /Applications/Xcode.app/Contents/Developer/Toolchains/XcodeDefault.xctoolchain/usr/bin -Wno-unused-command-line-argument -mllvm -verify-machineinstrs -O3 -arch x86_64 -isysroot /Applications/Xcode.app/Contents/Developer/Platforms/MacOSX.platform/Developer/SDKs/MacOSX10.14.sdk -w -Werror=date-time -w -MD -MT SingleSource/Regression/C/gcc-c-torture/execute/CMakeFiles/GCC-C-execute-alias-3.dir/alias-3.c.o -MF SingleSource/Regression/C/gcc-c-torture/execute/CMakeFiles/GCC-C-execute-alias-3.dir/alias-3.c.o.d -o SingleSource/Regression/C/gcc-c-torture/execute/CMakeFiles/GCC-C-execute-alias-3.dir/alias-3.c.o -c /Users/buildslave/jenkins/workspace/test-suite-verify-machineinstrs-x86_64-O3/test-suite/SingleSource/Regression/C/gcc-c-torture/execute/alias-3.c FAILED: SingleSource/Regression/C/gcc-c-torture/execute/CMakeFiles/GCC-C-execute-alias-3.dir/alias-3.c.o /Users/buildslave/jenkins/workspace/test-suite-verify-machineinstrs-x86_64-O3/test-suite-build/tools/timeit --summary SingleSource/Regression/C/gcc-c-torture/execute/CMakeFiles/GCC-C-execute-alias-3.dir/alias-3.c.o.time /Users/buildslave/jenkins/workspace/test-suite-verify-machineinstrs-x86_64-O3/compiler/bin/clang -DNDEBUG -B /Applications/Xcode.app/Contents/Developer/Toolchains/XcodeDefault.xctoolchain/usr/bin -Wno-unused-command-line-argument -mllvm -verify-machineinstrs -O3 -arch x86_64 -isysroot /Applications/Xcode.app/Contents/Developer/Platforms/MacOSX.platform/Developer/SDKs/MacOSX10.14.sdk -w -Werror=date-time -w -MD -MT SingleSource/Regression/C/gcc-c-torture/execute/CMakeFiles/GCC-C-execute-alias-3.dir/alias-3.c.o -MF SingleSource/Regression/C/gcc-c-torture/execute/CMakeFiles/GCC-C-execute-alias-3.dir/alias-3.c.o.d -o SingleSource/Regression/C/gcc-c-torture/execute/CMakeFiles/GCC-C-execute-alias-3.dir/alias-3.c.o -c /Users/buildslave/jenkins/workspace/test-suite-verify-machineinstrs-x86_64-O3/test-suite/SingleSource/Regression/C/gcc-c-torture/execute/alias-3.c /Users/buildslave/jenkins/workspace/test-suite-verify-machineinstrs-x86_64-O3/test-suite/SingleSource/Regression/C/gcc-c-torture/execute/alias-3.c:4:30: error: aliases are not supported on darwin alias-3.c error: aliases are not supported on darwin [5770/7684] /Users/buildslave/jenkins/workspace/test-suite-verify-machineinstrs-x86_64-O3/test-suite-build/tools/timeit --summary SingleSource/Regression/C/gcc-c-torture/execute/CMakeFiles/GCC-C-execute-pr61306-2.dir/pr61306-2.c.o.time /Users/buildslave/jenkins/workspace/test-suite-verify-machineinstrs-x86_64-O3/compiler/bin/clang -DNDEBUG -B /Applications/Xcode.app/Contents/Developer/Toolchains/XcodeDefault.xctoolchain/usr/bin -Wno-unused-command-line-argument -mllvm -verify-machineinstrs -O3 -arch x86_64 -isysroot /Applications/Xcode.app/Contents/Developer/Platforms/MacOSX.platform/Developer/SDKs/MacOSX10.14.sdk -w -Werror=date-time -w -MD -MT SingleSource/Regression/C/gcc-c-torture/execute/CMakeFiles/GCC-C-execute-pr61306-2.dir/pr61306-2.c.o -MF SingleSource/Regression/C/gcc-c-torture/execute/CMakeFiles/GCC-C-execute-pr61306-2.dir/pr61306-2.c.o.d -o SingleSource/Regression/C/gcc-c-torture/execute/CMakeFiles/GCC-C-execute-pr61306-2.dir/pr61306-2.c.o -c /Users/buildslave/jenkins/workspace/test-suite-verify-machineinstrs-x86_64-O3/test-suite/SingleSource/Regression/C/gcc-c-torture/execute/pr61306-2.c [5771/7684] : && /Users/buildslave/jenkins/workspace/test-suite-verify-machineinstrs-x86_64-O3/test-suite-build/tools/timeit --summary SingleSource/Regression/C/gcc-c-torture/execute/GCC-C-execute-alias-access-path-1.link.time /Users/buildslave/jenkins/workspace/test-suite-verify-machineinstrs-x86_64-O3/compiler/bin/clang -B /Applications/Xcode.app/Contents/Developer/Toolchains/XcodeDefault.xctoolchain/usr/bin -Wno-unused-command-line-argument -mllvm -verify-machineinstrs -O3 -arch x86_64 -isysroot /Applications/Xcode.app/Contents/Developer/Platforms/MacOSX.platform/Developer/SDKs/MacOSX10.14.sdk -Wl,-search_paths_first -Wl,-headerpad_max_install_names -B /Applications/Xcode.app/Contents/Developer/Toolchains/XcodeDefault.xctoolchain/usr/bin SingleSource/Regression/C/gcc-c-torture/execute/CMakeFiles/GCC-C-execute-alias-access-path-1.dir/alias-access-path-1.c.o -o SingleSource/Regression/C/gcc-c-torture/execute/GCC-C-execute-alias-access-path-1 -Wl,-no_pie && : [5772/7684] /Users/buildslave/jenkins/workspace/test-suite-verify-machineinstrs-x86_64-O3/test-suite-build/tools/timeit --summary SingleSource/Regression/C/gcc-c-torture/execute/CMakeFiles/GCC-C-execute-alias-3.dir/alias-3.c.o.time /Users/buildslave/jenkins/workspace/test-suite-verify-machineinstrs-x86_64-O3/compiler/bin/clang -DNDEBUG -B /Applications/Xcode.app/Contents/Developer/Toolchains/XcodeDefault.xctoolchain/usr/bin -Wno-unused-command-line-argument -mllvm -verify-machineinstrs -O3 -arch x86_64 -isysroot /Applications/Xcode.app/Contents/Developer/Platforms/MacOSX.platform/Developer/SDKs/MacOSX10.14.sdk -w -Werror=date-time -w -MD -MT SingleSource/Regression/C/gcc-c-torture/execute/CMakeFiles/GCC-C-execute-alias-3.dir/alias-3.c.o -MF SingleSource/Regression/C/gcc-c-torture/execute/CMakeFiles/GCC-C-execute-alias-3.dir/alias-3.c.o.d -o SingleSource/Regression/C/gcc-c-torture/execute/CMakeFiles/GCC-C-execute-alias-3.dir/alias-3.c.o -c /Users/buildslave/jenkins/workspace/test-suite-verify-machineinstrs-x86_64-O3/test-suite/SingleSource/Regression/C/gcc-c-torture/execute/alias-3.c FAILED: SingleSource/Regression/C/gcc-c-torture/execute/CMakeFiles/GCC-C-execute-alias-3.dir/alias-3.c.o /Users/buildslave/jenkins/workspace/test-suite-verify-machineinstrs-x86_64-O3/test-suite-build/tools/timeit --summary SingleSource/Regression/C/gcc-c-torture/execute/CMakeFiles/GCC-C-execute-alias-3.dir/alias-3.c.o.time /Users/buildslave/jenkins/workspace/test-suite-verify-machineinstrs-x86_64-O3/compiler/bin/clang -DNDEBUG -B /Applications/Xcode.app/Contents/Developer/Toolchains/XcodeDefault.xctoolchain/usr/bin -Wno-unused-command-line-argument -mllvm -verify-machineinstrs -O3 -arch x86_64 -isysroot /Applications/Xcode.app/Contents/Developer/Platforms/MacOSX.platform/Developer/SDKs/MacOSX10.14.sdk -w -Werror=date-time -w -MD -MT SingleSource/Regression/C/gcc-c-torture/execute/CMakeFiles/GCC-C-execute-alias-3.dir/alias-3.c.o -MF SingleSource/Regression/C/gcc-c-torture/execute/CMakeFiles/GCC-C-execute-alias-3.dir/alias-3.c.o.d -o SingleSource/Regression/C/gcc-c-torture/execute/CMakeFiles/GCC-C-execute-alias-3.dir/alias-3.c.o -c /Users/buildslave/jenkins/workspace/test-suite-verify-machineinstrs-x86_64-O3/test-suite/SingleSource/Regression/C/gcc-c-torture/execute/alias-3.c /Users/buildslave/jenkins/workspace/test-suite-verify-machineinstrs-x86_64-O3/test-suite/SingleSource/Regression/C/gcc-c-torture/execute/alias-3.c:4:30: error: aliases are not supported on darwin extern int b __attribute__ ((alias("a"))); ^ Ninja target: alias-2.c.o /Users/buildslave/jenkins/workspace/test-suite-verify-machineinstrs-x86_64-O3/test-suite/SingleSource/Regression/C/gcc-c-torture/execute/alias-3.c:4:30: error: aliases are not supported on darwin extern int b __attribute__ ((alias("a"))); ^ 1 error generated. [5773/7684] /Users/buildslave/jenkins/workspace/test-suite-verify-machineinstrs-x86_64-O3/test-suite-build/tools/timeit --summary SingleSource/Regression/C/gcc-c-torture/execute/CMakeFiles/GCC-C-execute-alias-2.dir/alias-2.c.o.time /Users/buildslave/jenkins/workspace/test-suite-verify-machineinstrs-x86_64-O3/compiler/bin/clang -DNDEBUG -B /Applications/Xcode.app/Contents/Developer/Toolchains/XcodeDefault.xctoolchain/usr/bin -Wno-unused-command-line-argument -mllvm -verify-machineinstrs -O3 -arch x86_64 -isysroot /Applications/Xcode.app/Contents/Developer/Platforms/MacOSX.platform/Developer/SDKs/MacOSX10.14.sdk -w -Werror=date-time -w -MD -MT SingleSource/Regression/C/gcc-c-torture/execute/CMakeFiles/GCC-C-execute-alias-2.dir/alias-2.c.o -MF SingleSource/Regression/C/gcc-c-torture/execute/CMakeFiles/GCC-C-execute-alias-2.dir/alias-2.c.o.d -o SingleSource/Regression/C/gcc-c-torture/execute/CMakeFiles/GCC-C-execute-alias-2.dir/alias-2.c.o -c /Users/buildslave/jenkins/workspace/test-suite-verify-machineinstrs-x86_64-O3/test-suite/SingleSource/Regression/C/gcc-c-torture/execute/alias-2.c FAILED: SingleSource/Regression/C/gcc-c-torture/execute/CMakeFiles/GCC-C-execute-alias-2.dir/alias-2.c.o /Users/buildslave/jenkins/workspace/test-suite-verify-machineinstrs-x86_64-O3/test-suite-build/tools/timeit --summary SingleSource/Regression/C/gcc-c-torture/execute/CMakeFiles/GCC-C-execute-alias-2.dir/alias-2.c.o.time /Users/buildslave/jenkins/workspace/test-suite-verify-machineinstrs-x86_64-O3/compiler/bin/clang -DNDEBUG -B /Applications/Xcode.app/Contents/Developer/Toolchains/XcodeDefault.xctoolchain/usr/bin -Wno-unused-command-line-argument -mllvm -verify-machineinstrs -O3 -arch x86_64 -isysroot /Applications/Xcode.app/Contents/Developer/Platforms/MacOSX.platform/Developer/SDKs/MacOSX10.14.sdk -w -Werror=date-time -w -MD -MT SingleSource/Regression/C/gcc-c-torture/execute/CMakeFiles/GCC-C-execute-alias-2.dir/alias-2.c.o -MF SingleSource/Regression/C/gcc-c-torture/execute/CMakeFiles/GCC-C-execute-alias-2.dir/alias-2.c.o.d -o SingleSource/Regression/C/gcc-c-torture/execute/CMakeFiles/GCC-C-execute-alias-2.dir/alias-2.c.o -c /Users/buildslave/jenkins/workspace/test-suite-verify-machineinstrs-x86_64-O3/test-suite/SingleSource/Regression/C/gcc-c-torture/execute/alias-2.c /Users/buildslave/jenkins/workspace/test-suite-verify-machineinstrs-x86_64-O3/test-suite/SingleSource/Regression/C/gcc-c-torture/execute/alias-2.c:3:34: error: aliases are not supported on darwin alias-2.c error: aliases are not supported on darwin ^ 1 error generated. [5773/7684] /Users/buildslave/jenkins/workspace/test-suite-verify-machineinstrs-x86_64-O3/test-suite-build/tools/timeit --summary SingleSource/Regression/C/gcc-c-torture/execute/CMakeFiles/GCC-C-execute-alias-2.dir/alias-2.c.o.time /Users/buildslave/jenkins/workspace/test-suite-verify-machineinstrs-x86_64-O3/compiler/bin/clang -DNDEBUG -B /Applications/Xcode.app/Contents/Developer/Toolchains/XcodeDefault.xctoolchain/usr/bin -Wno-unused-command-line-argument -mllvm -verify-machineinstrs -O3 -arch x86_64 -isysroot /Applications/Xcode.app/Contents/Developer/Platforms/MacOSX.platform/Developer/SDKs/MacOSX10.14.sdk -w -Werror=date-time -w -MD -MT SingleSource/Regression/C/gcc-c-torture/execute/CMakeFiles/GCC-C-execute-alias-2.dir/alias-2.c.o -MF SingleSource/Regression/C/gcc-c-torture/execute/CMakeFiles/GCC-C-execute-alias-2.dir/alias-2.c.o.d -o SingleSource/Regression/C/gcc-c-torture/execute/CMakeFiles/GCC-C-execute-alias-2.dir/alias-2.c.o -c /Users/buildslave/jenkins/workspace/test-suite-verify-machineinstrs-x86_64-O3/test-suite/SingleSource/Regression/C/gcc-c-torture/execute/alias-2.c FAILED: SingleSource/Regression/C/gcc-c-torture/execute/CMakeFiles/GCC-C-execute-alias-2.dir/alias-2.c.o /Users/buildslave/jenkins/workspace/test-suite-verify-machineinstrs-x86_64-O3/test-suite-build/tools/timeit --summary SingleSource/Regression/C/gcc-c-torture/execute/CMakeFiles/GCC-C-execute-alias-2.dir/alias-2.c.o.time /Users/buildslave/jenkins/workspace/test-suite-verify-machineinstrs-x86_64-O3/compiler/bin/clang -DNDEBUG -B /Applications/Xcode.app/Contents/Developer/Toolchains/XcodeDefault.xctoolchain/usr/bin -Wno-unused-command-line-argument -mllvm -verify-machineinstrs -O3 -arch x86_64 -isysroot /Applications/Xcode.app/Contents/Developer/Platforms/MacOSX.platform/Developer/SDKs/MacOSX10.14.sdk -w -Werror=date-time -w -MD -MT SingleSource/Regression/C/gcc-c-torture/execute/CMakeFiles/GCC-C-execute-alias-2.dir/alias-2.c.o -MF SingleSource/Regression/C/gcc-c-torture/execute/CMakeFiles/GCC-C-execute-alias-2.dir/alias-2.c.o.d -o SingleSource/Regression/C/gcc-c-torture/execute/CMakeFiles/GCC-C-execute-alias-2.dir/alias-2.c.o -c /Users/buildslave/jenkins/workspace/test-suite-verify-machineinstrs-x86_64-O3/test-suite/SingleSource/Regression/C/gcc-c-torture/execute/alias-2.c /Users/buildslave/jenkins/workspace/test-suite-verify-machineinstrs-x86_64-O3/test-suite/SingleSource/Regression/C/gcc-c-torture/execute/alias-2.c:3:34: error: aliases are not supported on darwin extern int b[10] __attribute__ ((alias("a"))); ^ Ninja target: GCC-C-execute-930513-1 [6183/7684] /Users/buildslave/jenkins/workspace/test-suite-verify-machineinstrs-x86_64-O3/test-suite-build/tools/timeit --summary SingleSource/Regression/C/gcc-c-torture/execute/CMakeFiles/GCC-C-execute-930513-1.dir/930513-1.c.o.time /Users/buildslave/jenkins/workspace/test-suite-verify-machineinstrs-x86_64-O3/compiler/bin/clang -DNDEBUG -B /Applications/Xcode.app/Contents/Developer/Toolchains/XcodeDefault.xctoolchain/usr/bin -Wno-unused-command-line-argument -mllvm -verify-machineinstrs -O3 -arch x86_64 -isysroot /Applications/Xcode.app/Contents/Developer/Platforms/MacOSX.platform/Developer/SDKs/MacOSX10.14.sdk -w -Werror=date-time -w -MD -MT SingleSource/Regression/C/gcc-c-torture/execute/CMakeFiles/GCC-C-execute-930513-1.dir/930513-1.c.o -MF SingleSource/Regression/C/gcc-c-torture/execute/CMakeFiles/GCC-C-execute-930513-1.dir/930513-1.c.o.d -o SingleSource/Regression/C/gcc-c-torture/execute/CMakeFiles/GCC-C-execute-930513-1.dir/930513-1.c.o -c /Users/buildslave/jenkins/workspace/test-suite-verify-machineinstrs-x86_64-O3/test-suite/SingleSource/Regression/C/gcc-c-torture/execute/930513-1.c [6184/7684] : && /Users/buildslave/jenkins/workspace/test-suite-verify-machineinstrs-x86_64-O3/test-suite-build/tools/timeit --summary SingleSource/Regression/C/gcc-c-torture/execute/GCC-C-execute-930429-2.link.time /Users/buildslave/jenkins/workspace/test-suite-verify-machineinstrs-x86_64-O3/compiler/bin/clang -B /Applications/Xcode.app/Contents/Developer/Toolchains/XcodeDefault.xctoolchain/usr/bin -Wno-unused-command-line-argument -mllvm -verify-machineinstrs -O3 -arch x86_64 -isysroot /Applications/Xcode.app/Contents/Developer/Platforms/MacOSX.platform/Developer/SDKs/MacOSX10.14.sdk -Wl,-search_paths_first -Wl,-headerpad_max_install_names -B /Applications/Xcode.app/Contents/Developer/Toolchains/XcodeDefault.xctoolchain/usr/bin SingleSource/Regression/C/gcc-c-torture/execute/CMakeFiles/GCC-C-execute-930429-2.dir/930429-2.c.o -o SingleSource/Regression/C/gcc-c-torture/execute/GCC-C-execute-930429-2 -Wl,-no_pie && : [6185/7684] /Users/buildslave/jenkins/workspace/test-suite-verify-machineinstrs-x86_64-O3/test-suite-build/tools/timeit --summary SingleSource/Regression/C/gcc-c-torture/execute/CMakeFiles/GCC-C-execute-loop-2d.dir/loop-2d.c.o.time /Users/buildslave/jenkins/workspace/test-suite-verify-machineinstrs-x86_64-O3/compiler/bin/clang -DNDEBUG -B /Applications/Xcode.app/Contents/Developer/Toolchains/XcodeDefault.xctoolchain/usr/bin -Wno-unused-command-line-argument -mllvm -verify-machineinstrs -O3 -arch x86_64 -isysroot /Applications/Xcode.app/Contents/Developer/Platforms/MacOSX.platform/Developer/SDKs/MacOSX10.14.sdk -w -Werror=date-time -w -MD -MT SingleSource/Regression/C/gcc-c-torture/execute/CMakeFiles/GCC-C-execute-loop-2d.dir/loop-2d.c.o -MF SingleSource/Regression/C/gcc-c-torture/execute/CMakeFiles/GCC-C-execute-loop-2d.dir/loop-2d.c.o.d -o SingleSource/Regression/C/gcc-c-torture/execute/CMakeFiles/GCC-C-execute-loop-2d.dir/loop-2d.c.o -c /Users/buildslave/jenkins/workspace/test-suite-verify-machineinstrs-x86_64-O3/test-suite/SingleSource/Regression/C/gcc-c-torture/execute/loop-2d.c [6186/7684] : && /Users/buildslave/jenkins/workspace/test-suite-verify-machineinstrs-x86_64-O3/test-suite-build/tools/timeit --summary SingleSource/Regression/C/gcc-c-torture/execute/GCC-C-execute-930406-1.link.time /Users/buildslave/jenkins/workspace/test-suite-verify-machineinstrs-x86_64-O3/compiler/bin/clang -B /Applications/Xcode.app/Contents/Developer/Toolchains/XcodeDefault.xctoolchain/usr/bin -Wno-unused-command-line-argument -mllvm -verify-machineinstrs -O3 -arch x86_64 -isysroot /Applications/Xcode.app/Contents/Developer/Platforms/MacOSX.platform/Developer/SDKs/MacOSX10.14.sdk -Wl,-search_paths_first -Wl,-headerpad_max_install_names -B /Applications/Xcode.app/Contents/Developer/Toolchains/XcodeDefault.xctoolchain/usr/bin SingleSource/Regression/C/gcc-c-torture/execute/CMakeFiles/GCC-C-execute-930406-1.dir/930406-1.c.o -o SingleSource/Regression/C/gcc-c-torture/execute/GCC-C-execute-930406-1 -Wl,-no_pie && : [6187/7684] : && /Users/buildslave/jenkins/workspace/test-suite-verify-machineinstrs-x86_64-O3/test-suite-build/tools/timeit --summary SingleSource/Regression/C/gcc-c-torture/execute/GCC-C-execute-930513-1.link.time /Users/buildslave/jenkins/workspace/test-suite-verify-machineinstrs-x86_64-O3/compiler/bin/clang -B /Applications/Xcode.app/Contents/Developer/Toolchains/XcodeDefault.xctoolchain/usr/bin -Wno-unused-command-line-argument -mllvm -verify-machineinstrs -O3 -arch x86_64 -isysroot /Applications/Xcode.app/Contents/Developer/Platforms/MacOSX.platform/Developer/SDKs/MacOSX10.14.sdk -Wl,-search_paths_first -Wl,-headerpad_max_install_names -B /Applications/Xcode.app/Contents/Developer/Toolchains/XcodeDefault.xctoolchain/usr/bin SingleSource/Regression/C/gcc-c-torture/execute/CMakeFiles/GCC-C-execute-930513-1.dir/930513-1.c.o -o SingleSource/Regression/C/gcc-c-torture/execute/GCC-C-execute-930513-1 -Wl,-no_pie -Wl,-u,_printf_float && : FAILED: SingleSource/Regression/C/gcc-c-torture/execute/GCC-C-execute-930513-1 : && /Users/buildslave/jenkins/workspace/test-suite-verify-machineinstrs-x86_64-O3/test-suite-build/tools/timeit --summary SingleSource/Regression/C/gcc-c-torture/execute/GCC-C-execute-930513-1.link.time /Users/buildslave/jenkins/workspace/test-suite-verify-machineinstrs-x86_64-O3/compiler/bin/clang -B /Applications/Xcode.app/Contents/Developer/Toolchains/XcodeDefault.xctoolchain/usr/bin -Wno-unused-command-line-argument -mllvm -verify-machineinstrs -O3 -arch x86_64 -isysroot /Applications/Xcode.app/Contents/Developer/Platforms/MacOSX.platform/Developer/SDKs/MacOSX10.14.sdk -Wl,-search_paths_first -Wl,-headerpad_max_install_names -B /Applications/Xcode.app/Contents/Developer/Toolchains/XcodeDefault.xctoolchain/usr/bin SingleSource/Regression/C/gcc-c-torture/execute/CMakeFiles/GCC-C-execute-930513-1.dir/930513-1.c.o -o SingleSource/Regression/C/gcc-c-torture/execute/GCC-C-execute-930513-1 -Wl,-no_pie -Wl,-u,_printf_float && : Undefined symbols for architecture x86_64: link error : && /Users/buildslave/jenkins/workspace/test-suite-verify-machineinstrs-x86_64-O3/test-suite-build/tools/timeit --summary SingleSource/Regression/C/gcc-c-torture/execute/GCC-C-execute-930513-1.link.time /Users/buildslave/jenkins/workspace/test-suite-verify-machineinstrs-x86_64-O3/compiler/bin/clang -B /Applications/Xcode.app/Contents/Developer/Toolchains/XcodeDefault.xctoolchain/usr/bin -Wno-unused-command-line-argument -mllvm -verify-machineinstrs -O3 -arch x86_64 -isysroot /Applications/Xcode.app/Contents/Developer/Platforms/MacOSX.platform/Developer/SDKs/MacOSX10.14.sdk -Wl,-search_paths_first -Wl,-headerpad_max_install_names -B /Applications/Xcode.app/Contents/Developer/Toolchains/XcodeDefault.xctoolchain/usr/bin SingleSource/Regression/C/gcc-c-torture/execute/CMakeFiles/GCC-C-execute-930513-1.dir/930513-1.c.o -o SingleSource/Regression/C/gcc-c-torture/execute/GCC-C-execute-930513-1 -Wl,-no_pie -Wl,-u,_printf_float && : Undefined symbols for architecture x86_64: "_printf_float", referenced from: -u command line option ld: symbol(s) not found for architecture x86_64 clang-10: error: linker command failed with exit code 1 (use -v to see invocation) [6188/7684] /Users/buildslave/jenkins/workspace/test-suite-verify-machineinstrs-x86_64-O3/test-suite-build/tools/timeit --summary SingleSource/Regression/C/gcc-c-torture/execute/CMakeFiles/GCC-C-execute-pr51933.dir/pr51933.c.o.time /Users/buildslave/jenkins/workspace/test-suite-verify-machineinstrs-x86_64-O3/compiler/bin/clang -DNDEBUG -B /Applications/Xcode.app/Contents/Developer/Toolchains/XcodeDefault.xctoolchain/usr/bin -Wno-unused-command-line-argument -mllvm -verify-machineinstrs -O3 -arch x86_64 -isysroot /Applications/Xcode.app/Contents/Developer/Platforms/MacOSX.platform/Developer/SDKs/MacOSX10.14.sdk -w -Werror=date-time -w -MD -MT SingleSource/Regression/C/gcc-c-torture/execute/CMakeFiles/GCC-C-execute-pr51933.dir/pr51933.c.o -MF SingleSource/Regression/C/gcc-c-torture/execute/CMakeFiles/GCC-C-execute-pr51933.dir/pr51933.c.o.d -o SingleSource/Regression/C/gcc-c-torture/execute/CMakeFiles/GCC-C-execute-pr51933.dir/pr51933.c.o -c /Users/buildslave/jenkins/workspace/test-suite-verify-machineinstrs-x86_64-O3/test-suite/SingleSource/Regression/C/gcc-c-torture/execute/pr51933.c [6189/7684] : && /Users/buildslave/jenkins/workspace/test-suite-verify-machineinstrs-x86_64-O3/test-suite-build/tools/timeit --summary SingleSource/Regression/C/gcc-c-torture/execute/GCC-C-execute-loop-2d.link.time /Users/buildslave/jenkins/workspace/test-suite-verify-machineinstrs-x86_64-O3/compiler/bin/clang -B /Applications/Xcode.app/Contents/Developer/Toolchains/XcodeDefault.xctoolchain/usr/bin -Wno-unused-command-line-argument -mllvm -verify-machineinstrs -O3 -arch x86_64 -isysroot /Applications/Xcode.app/Contents/Developer/Platforms/MacOSX.platform/Developer/SDKs/MacOSX10.14.sdk -Wl,-search_paths_first -Wl,-headerpad_max_install_names -B /Applications/Xcode.app/Contents/Developer/Toolchains/XcodeDefault.xctoolchain/usr/bin SingleSource/Regression/C/gcc-c-torture/execute/CMakeFiles/GCC-C-execute-loop-2d.dir/loop-2d.c.o -o SingleSource/Regression/C/gcc-c-torture/execute/GCC-C-execute-loop-2d -Wl,-no_pie && : Ninja target: GCC-C-execute-920501-8 [7241/7684] : && /Users/buildslave/jenkins/workspace/test-suite-verify-machineinstrs-x86_64-O3/test-suite-build/tools/timeit --summary SingleSource/Regression/C/gcc-c-torture/execute/GCC-C-execute-20120817-1.link.time /Users/buildslave/jenkins/workspace/test-suite-verify-machineinstrs-x86_64-O3/compiler/bin/clang -B /Applications/Xcode.app/Contents/Developer/Toolchains/XcodeDefault.xctoolchain/usr/bin -Wno-unused-command-line-argument -mllvm -verify-machineinstrs -O3 -arch x86_64 -isysroot /Applications/Xcode.app/Contents/Developer/Platforms/MacOSX.platform/Developer/SDKs/MacOSX10.14.sdk -Wl,-search_paths_first -Wl,-headerpad_max_install_names -B /Applications/Xcode.app/Contents/Developer/Toolchains/XcodeDefault.xctoolchain/usr/bin SingleSource/Regression/C/gcc-c-torture/execute/CMakeFiles/GCC-C-execute-20120817-1.dir/20120817-1.c.o -o SingleSource/Regression/C/gcc-c-torture/execute/GCC-C-execute-20120817-1 -Wl,-no_pie && : [7242/7684] /Users/buildslave/jenkins/workspace/test-suite-verify-machineinstrs-x86_64-O3/test-suite-build/tools/timeit --summary SingleSource/Regression/C/gcc-c-torture/execute/CMakeFiles/GCC-C-execute-20071213-1.dir/20071213-1.c.o.time /Users/buildslave/jenkins/workspace/test-suite-verify-machineinstrs-x86_64-O3/compiler/bin/clang -DNDEBUG -B /Applications/Xcode.app/Contents/Developer/Toolchains/XcodeDefault.xctoolchain/usr/bin -Wno-unused-command-line-argument -mllvm -verify-machineinstrs -O3 -arch x86_64 -isysroot /Applications/Xcode.app/Contents/Developer/Platforms/MacOSX.platform/Developer/SDKs/MacOSX10.14.sdk -w -Werror=date-time -w -MD -MT SingleSource/Regression/C/gcc-c-torture/execute/CMakeFiles/GCC-C-execute-20071213-1.dir/20071213-1.c.o -MF SingleSource/Regression/C/gcc-c-torture/execute/CMakeFiles/GCC-C-execute-20071213-1.dir/20071213-1.c.o.d -o SingleSource/Regression/C/gcc-c-torture/execute/CMakeFiles/GCC-C-execute-20071213-1.dir/20071213-1.c.o -c /Users/buildslave/jenkins/workspace/test-suite-verify-machineinstrs-x86_64-O3/test-suite/SingleSource/Regression/C/gcc-c-torture/execute/20071213-1.c [7243/7684] /Users/buildslave/jenkins/workspace/test-suite-verify-machineinstrs-x86_64-O3/test-suite-build/tools/timeit --summary SingleSource/Regression/C/gcc-c-torture/execute/CMakeFiles/GCC-C-execute-920501-8.dir/920501-8.c.o.time /Users/buildslave/jenkins/workspace/test-suite-verify-machineinstrs-x86_64-O3/compiler/bin/clang -DNDEBUG -B /Applications/Xcode.app/Contents/Developer/Toolchains/XcodeDefault.xctoolchain/usr/bin -Wno-unused-command-line-argument -mllvm -verify-machineinstrs -O3 -arch x86_64 -isysroot /Applications/Xcode.app/Contents/Developer/Platforms/MacOSX.platform/Developer/SDKs/MacOSX10.14.sdk -w -Werror=date-time -w -MD -MT SingleSource/Regression/C/gcc-c-torture/execute/CMakeFiles/GCC-C-execute-920501-8.dir/920501-8.c.o -MF SingleSource/Regression/C/gcc-c-torture/execute/CMakeFiles/GCC-C-execute-920501-8.dir/920501-8.c.o.d -o SingleSource/Regression/C/gcc-c-torture/execute/CMakeFiles/GCC-C-execute-920501-8.dir/920501-8.c.o -c /Users/buildslave/jenkins/workspace/test-suite-verify-machineinstrs-x86_64-O3/test-suite/SingleSource/Regression/C/gcc-c-torture/execute/920501-8.c [7244/7684] : && /Users/buildslave/jenkins/workspace/test-suite-verify-machineinstrs-x86_64-O3/test-suite-build/tools/timeit --summary SingleSource/Regression/C/gcc-c-torture/execute/GCC-C-execute-20071213-1.link.time /Users/buildslave/jenkins/workspace/test-suite-verify-machineinstrs-x86_64-O3/compiler/bin/clang -B /Applications/Xcode.app/Contents/Developer/Toolchains/XcodeDefault.xctoolchain/usr/bin -Wno-unused-command-line-argument -mllvm -verify-machineinstrs -O3 -arch x86_64 -isysroot /Applications/Xcode.app/Contents/Developer/Platforms/MacOSX.platform/Developer/SDKs/MacOSX10.14.sdk -Wl,-search_paths_first -Wl,-headerpad_max_install_names -B /Applications/Xcode.app/Contents/Developer/Toolchains/XcodeDefault.xctoolchain/usr/bin SingleSource/Regression/C/gcc-c-torture/execute/CMakeFiles/GCC-C-execute-20071213-1.dir/20071213-1.c.o -o SingleSource/Regression/C/gcc-c-torture/execute/GCC-C-execute-20071213-1 -Wl,-no_pie && : [7245/7684] : && /Users/buildslave/jenkins/workspace/test-suite-verify-machineinstrs-x86_64-O3/test-suite-build/tools/timeit --summary SingleSource/Regression/C/gcc-c-torture/execute/GCC-C-execute-920501-8.link.time /Users/buildslave/jenkins/workspace/test-suite-verify-machineinstrs-x86_64-O3/compiler/bin/clang -B /Applications/Xcode.app/Contents/Developer/Toolchains/XcodeDefault.xctoolchain/usr/bin -Wno-unused-command-line-argument -mllvm -verify-machineinstrs -O3 -arch x86_64 -isysroot /Applications/Xcode.app/Contents/Developer/Platforms/MacOSX.platform/Developer/SDKs/MacOSX10.14.sdk -Wl,-search_paths_first -Wl,-headerpad_max_install_names -B /Applications/Xcode.app/Contents/Developer/Toolchains/XcodeDefault.xctoolchain/usr/bin SingleSource/Regression/C/gcc-c-torture/execute/CMakeFiles/GCC-C-execute-920501-8.dir/920501-8.c.o -o SingleSource/Regression/C/gcc-c-torture/execute/GCC-C-execute-920501-8 -Wl,-no_pie -Wl,-u,_printf_float && : FAILED: SingleSource/Regression/C/gcc-c-torture/execute/GCC-C-execute-920501-8 : && /Users/buildslave/jenkins/workspace/test-suite-verify-machineinstrs-x86_64-O3/test-suite-build/tools/timeit --summary SingleSource/Regression/C/gcc-c-torture/execute/GCC-C-execute-920501-8.link.time /Users/buildslave/jenkins/workspace/test-suite-verify-machineinstrs-x86_64-O3/compiler/bin/clang -B /Applications/Xcode.app/Contents/Developer/Toolchains/XcodeDefault.xctoolchain/usr/bin -Wno-unused-command-line-argument -mllvm -verify-machineinstrs -O3 -arch x86_64 -isysroot /Applications/Xcode.app/Contents/Developer/Platforms/MacOSX.platform/Developer/SDKs/MacOSX10.14.sdk -Wl,-search_paths_first -Wl,-headerpad_max_install_names -B /Applications/Xcode.app/Contents/Developer/Toolchains/XcodeDefault.xctoolchain/usr/bin SingleSource/Regression/C/gcc-c-torture/execute/CMakeFiles/GCC-C-execute-920501-8.dir/920501-8.c.o -o SingleSource/Regression/C/gcc-c-torture/execute/GCC-C-execute-920501-8 -Wl,-no_pie -Wl,-u,_printf_float && : Undefined symbols for architecture x86_64: link error : && /Users/buildslave/jenkins/workspace/test-suite-verify-machineinstrs-x86_64-O3/test-suite-build/tools/timeit --summary SingleSource/Regression/C/gcc-c-torture/execute/GCC-C-execute-920501-8.link.time /Users/buildslave/jenkins/workspace/test-suite-verify-machineinstrs-x86_64-O3/compiler/bin/clang -B /Applications/Xcode.app/Contents/Developer/Toolchains/XcodeDefault.xctoolchain/usr/bin -Wno-unused-command-line-argument -mllvm -verify-machineinstrs -O3 -arch x86_64 -isysroot /Applications/Xcode.app/Contents/Developer/Platforms/MacOSX.platform/Developer/SDKs/MacOSX10.14.sdk -Wl,-search_paths_first -Wl,-headerpad_max_install_names -B /Applications/Xcode.app/Contents/Developer/Toolchains/XcodeDefault.xctoolchain/usr/bin SingleSource/Regression/C/gcc-c-torture/execute/CMakeFiles/GCC-C-execute-920501-8.dir/920501-8.c.o -o SingleSource/Regression/C/gcc-c-torture/execute/GCC-C-execute-920501-8 -Wl,-no_pie -Wl,-u,_printf_float && : Undefined symbols for architecture x86_64: "_printf_float", referenced from: -u command line option ld: symbol(s) not found for architecture x86_64 clang-10: error: linker command failed with exit code 1 (use -v to see invocation) [7246/7684] /Users/buildslave/jenkins/workspace/test-suite-verify-machineinstrs-x86_64-O3/test-suite-build/tools/timeit --summary SingleSource/Regression/C/gcc-c-torture/execute/CMakeFiles/GCC-C-execute-20010221-1.dir/20010221-1.c.o.time /Users/buildslave/jenkins/workspace/test-suite-verify-machineinstrs-x86_64-O3/compiler/bin/clang -DNDEBUG -B /Applications/Xcode.app/Contents/Developer/Toolchains/XcodeDefault.xctoolchain/usr/bin -Wno-unused-command-line-argument -mllvm -verify-machineinstrs -O3 -arch x86_64 -isysroot /Applications/Xcode.app/Contents/Developer/Platforms/MacOSX.platform/Developer/SDKs/MacOSX10.14.sdk -w -Werror=date-time -w -MD -MT SingleSource/Regression/C/gcc-c-torture/execute/CMakeFiles/GCC-C-execute-20010221-1.dir/20010221-1.c.o -MF SingleSource/Regression/C/gcc-c-torture/execute/CMakeFiles/GCC-C-execute-20010221-1.dir/20010221-1.c.o.d -o SingleSource/Regression/C/gcc-c-torture/execute/CMakeFiles/GCC-C-execute-20010221-1.dir/20010221-1.c.o -c /Users/buildslave/jenkins/workspace/test-suite-verify-machineinstrs-x86_64-O3/test-suite/SingleSource/Regression/C/gcc-c-torture/execute/20010221-1.c [7247/7684] : && /Users/buildslave/jenkins/workspace/test-suite-verify-machineinstrs-x86_64-O3/test-suite-build/tools/timeit --summary SingleSource/Regression/C/gcc-c-torture/execute/GCC-C-execute-20010221-1.link.time /Users/buildslave/jenkins/workspace/test-suite-verify-machineinstrs-x86_64-O3/compiler/bin/clang -B /Applications/Xcode.app/Contents/Developer/Toolchains/XcodeDefault.xctoolchain/usr/bin -Wno-unused-command-line-argument -mllvm -verify-machineinstrs -O3 -arch x86_64 -isysroot /Applications/Xcode.app/Contents/Developer/Platforms/MacOSX.platform/Developer/SDKs/MacOSX10.14.sdk -Wl,-search_paths_first -Wl,-headerpad_max_install_names -B /Applications/Xcode.app/Contents/Developer/Toolchains/XcodeDefault.xctoolchain/usr/bin SingleSource/Regression/C/gcc-c-torture/execute/CMakeFiles/GCC-C-execute-20010221-1.dir/20010221-1.c.o -o SingleSource/Regression/C/gcc-c-torture/execute/GCC-C-execute-20010221-1 -Wl,-no_pie && :

Build Log

Changes
  1. [AArch64] Fix over-eager fusing of NEON SIMD MUL/ADD (details)
  2. [lldb/Reproducer] Add version check (details)
  3. [OpenCL] Use generic addr space for lambda call operator (details)
  4. [EditLine] Fix RecallHistory to make it go in the right direction. (details)
  5. [SYCL] Add sycl_kernel attribute for accelerated code outlining (details)
  6. [SLP] Enhance SLPVectorizer to vectorize different combinations of (details)
  7. [scudo][standalone] Add chunk ownership function (details)
  8. Reland [clangd] Rethink how SelectionTree deals with macros and (details)
  9. llvm-config: do not link absolute paths with `-l` (details)
  10. [NFC][KnownBits] Add getMinValue() / getMaxValue() methods (details)
  11. [clang-format] Add new option to add spaces around conditions Summary: (details)
  12. Revert "Temporarily revert "build: avoid hardcoding the libxml2 library (details)
  13. Revert "[libomptarget] Build a minimal deviceRTL for amdgcn" (details)
  14. Rename `tsan/race_range_pc.cc` to `test/tsan/race_range_pc.cpp`. (details)
  15. [LV] Scalar with predication must not be uniform (details)

Started by upstream project relay-test-suite-verify-machineinstrs build number 6857
originally caused by:

This run spent:

  • 7.3 sec waiting;
  • 28 min build duration;
  • 28 min total from scheduled to completion.
Revision: 6ed9cef25f915d4533f261c401cee29d8d8012d5
  • detached

Identified problems

Compile Error

This build failed because of a compile error. Below is a list of all errors in the build log:
Indication 1

Ninja target failed

Below is a link to the first failed ninja target.
Indication 2

Link error

A link command has failed:
Indication 3