Started 9 mo 20 days ago
Took 2 hr 11 min

Failed Build clang-d333991-g0133dc3983c-t4544-b4544.tar.gz (Dec 15, 2019 10:42:25 AM)

Issues

Found 11 issues:
Ninja target: alias-4.c.o
[200/7684] : && /Users/buildslave/jenkins/workspace/test-suite-verify-machineinstrs-x86_64-O3/test-suite-build/tools/timeit --summary SingleSource/Regression/C/gcc-c-torture/execute/GCC-C-execute-960312-1.link.time /Users/buildslave/jenkins/workspace/test-suite-verify-machineinstrs-x86_64-O3/compiler/bin/clang -B /Applications/Xcode.app/Contents/Developer/Toolchains/XcodeDefault.xctoolchain/usr/bin    -Wno-unused-command-line-argument -mllvm -verify-machineinstrs -O3 -arch x86_64 -isysroot /Applications/Xcode.app/Contents/Developer/Platforms/MacOSX.platform/Developer/SDKs/MacOSX10.14.sdk -Wl,-search_paths_first -Wl,-headerpad_max_install_names -B /Applications/Xcode.app/Contents/Developer/Toolchains/XcodeDefault.xctoolchain/usr/bin SingleSource/Regression/C/gcc-c-torture/execute/CMakeFiles/GCC-C-execute-960312-1.dir/960312-1.c.o  -o SingleSource/Regression/C/gcc-c-torture/execute/GCC-C-execute-960312-1  -Wl,-no_pie && :
[201/7684] : && /Users/buildslave/jenkins/workspace/test-suite-verify-machineinstrs-x86_64-O3/test-suite-build/tools/timeit --summary SingleSource/Regression/C/gcc-c-torture/execute/GCC-C-execute-20000801-2.link.time /Users/buildslave/jenkins/workspace/test-suite-verify-machineinstrs-x86_64-O3/compiler/bin/clang -B /Applications/Xcode.app/Contents/Developer/Toolchains/XcodeDefault.xctoolchain/usr/bin    -Wno-unused-command-line-argument -mllvm -verify-machineinstrs -O3 -arch x86_64 -isysroot /Applications/Xcode.app/Contents/Developer/Platforms/MacOSX.platform/Developer/SDKs/MacOSX10.14.sdk -Wl,-search_paths_first -Wl,-headerpad_max_install_names -B /Applications/Xcode.app/Contents/Developer/Toolchains/XcodeDefault.xctoolchain/usr/bin SingleSource/Regression/C/gcc-c-torture/execute/CMakeFiles/GCC-C-execute-20000801-2.dir/20000801-2.c.o  -o SingleSource/Regression/C/gcc-c-torture/execute/GCC-C-execute-20000801-2  -Wl,-no_pie && :
[202/7684] /Users/buildslave/jenkins/workspace/test-suite-verify-machineinstrs-x86_64-O3/test-suite-build/tools/timeit --summary SingleSource/Regression/C/gcc-c-torture/execute/CMakeFiles/GCC-C-execute-990531-1.dir/990531-1.c.o.time /Users/buildslave/jenkins/workspace/test-suite-verify-machineinstrs-x86_64-O3/compiler/bin/clang -DNDEBUG  -B /Applications/Xcode.app/Contents/Developer/Toolchains/XcodeDefault.xctoolchain/usr/bin    -Wno-unused-command-line-argument -mllvm -verify-machineinstrs -O3 -arch x86_64 -isysroot /Applications/Xcode.app/Contents/Developer/Platforms/MacOSX.platform/Developer/SDKs/MacOSX10.14.sdk   -w -Werror=date-time -w -MD -MT SingleSource/Regression/C/gcc-c-torture/execute/CMakeFiles/GCC-C-execute-990531-1.dir/990531-1.c.o -MF SingleSource/Regression/C/gcc-c-torture/execute/CMakeFiles/GCC-C-execute-990531-1.dir/990531-1.c.o.d -o SingleSource/Regression/C/gcc-c-torture/execute/CMakeFiles/GCC-C-execute-990531-1.dir/990531-1.c.o   -c /Users/buildslave/jenkins/workspace/test-suite-verify-machineinstrs-x86_64-O3/test-suite/SingleSource/Regression/C/gcc-c-torture/execute/990531-1.c
[203/7684] /Users/buildslave/jenkins/workspace/test-suite-verify-machineinstrs-x86_64-O3/test-suite-build/tools/timeit --summary SingleSource/Regression/C/gcc-c-torture/execute/CMakeFiles/GCC-C-execute-20120615-1.dir/20120615-1.c.o.time /Users/buildslave/jenkins/workspace/test-suite-verify-machineinstrs-x86_64-O3/compiler/bin/clang -DNDEBUG  -B /Applications/Xcode.app/Contents/Developer/Toolchains/XcodeDefault.xctoolchain/usr/bin    -Wno-unused-command-line-argument -mllvm -verify-machineinstrs -O3 -arch x86_64 -isysroot /Applications/Xcode.app/Contents/Developer/Platforms/MacOSX.platform/Developer/SDKs/MacOSX10.14.sdk   -w -Werror=date-time -w -MD -MT SingleSource/Regression/C/gcc-c-torture/execute/CMakeFiles/GCC-C-execute-20120615-1.dir/20120615-1.c.o -MF SingleSource/Regression/C/gcc-c-torture/execute/CMakeFiles/GCC-C-execute-20120615-1.dir/20120615-1.c.o.d -o SingleSource/Regression/C/gcc-c-torture/execute/CMakeFiles/GCC-C-execute-20120615-1.dir/20120615-1.c.o   -c /Users/buildslave/jenkins/workspace/test-suite-verify-machineinstrs-x86_64-O3/test-suite/SingleSource/Regression/C/gcc-c-torture/execute/20120615-1.c
[204/7684] /Users/buildslave/jenkins/workspace/test-suite-verify-machineinstrs-x86_64-O3/test-suite-build/tools/timeit --summary SingleSource/Regression/C/gcc-c-torture/execute/CMakeFiles/GCC-C-execute-alias-4.dir/alias-4.c.o.time /Users/buildslave/jenkins/workspace/test-suite-verify-machineinstrs-x86_64-O3/compiler/bin/clang -DNDEBUG  -B /Applications/Xcode.app/Contents/Developer/Toolchains/XcodeDefault.xctoolchain/usr/bin    -Wno-unused-command-line-argument -mllvm -verify-machineinstrs -O3 -arch x86_64 -isysroot /Applications/Xcode.app/Contents/Developer/Platforms/MacOSX.platform/Developer/SDKs/MacOSX10.14.sdk   -w -Werror=date-time -w -MD -MT SingleSource/Regression/C/gcc-c-torture/execute/CMakeFiles/GCC-C-execute-alias-4.dir/alias-4.c.o -MF SingleSource/Regression/C/gcc-c-torture/execute/CMakeFiles/GCC-C-execute-alias-4.dir/alias-4.c.o.d -o SingleSource/Regression/C/gcc-c-torture/execute/CMakeFiles/GCC-C-execute-alias-4.dir/alias-4.c.o   -c /Users/buildslave/jenkins/workspace/test-suite-verify-machineinstrs-x86_64-O3/test-suite/SingleSource/Regression/C/gcc-c-torture/execute/alias-4.c
FAILED: SingleSource/Regression/C/gcc-c-torture/execute/CMakeFiles/GCC-C-execute-alias-4.dir/alias-4.c.o 
/Users/buildslave/jenkins/workspace/test-suite-verify-machineinstrs-x86_64-O3/test-suite-build/tools/timeit --summary SingleSource/Regression/C/gcc-c-torture/execute/CMakeFiles/GCC-C-execute-alias-4.dir/alias-4.c.o.time /Users/buildslave/jenkins/workspace/test-suite-verify-machineinstrs-x86_64-O3/compiler/bin/clang -DNDEBUG  -B /Applications/Xcode.app/Contents/Developer/Toolchains/XcodeDefault.xctoolchain/usr/bin    -Wno-unused-command-line-argument -mllvm -verify-machineinstrs -O3 -arch x86_64 -isysroot /Applications/Xcode.app/Contents/Developer/Platforms/MacOSX.platform/Developer/SDKs/MacOSX10.14.sdk   -w -Werror=date-time -w -MD -MT SingleSource/Regression/C/gcc-c-torture/execute/CMakeFiles/GCC-C-execute-alias-4.dir/alias-4.c.o -MF SingleSource/Regression/C/gcc-c-torture/execute/CMakeFiles/GCC-C-execute-alias-4.dir/alias-4.c.o.d -o SingleSource/Regression/C/gcc-c-torture/execute/CMakeFiles/GCC-C-execute-alias-4.dir/alias-4.c.o   -c /Users/buildslave/jenkins/workspace/test-suite-verify-machineinstrs-x86_64-O3/test-suite/SingleSource/Regression/C/gcc-c-torture/execute/alias-4.c
/Users/buildslave/jenkins/workspace/test-suite-verify-machineinstrs-x86_64-O3/test-suite/SingleSource/Regression/C/gcc-c-torture/execute/alias-4.c:3:30: error: aliases are not supported on darwin
alias-4.c error: aliases are not supported on darwin
[202/7684] /Users/buildslave/jenkins/workspace/test-suite-verify-machineinstrs-x86_64-O3/test-suite-build/tools/timeit --summary SingleSource/Regression/C/gcc-c-torture/execute/CMakeFiles/GCC-C-execute-990531-1.dir/990531-1.c.o.time /Users/buildslave/jenkins/workspace/test-suite-verify-machineinstrs-x86_64-O3/compiler/bin/clang -DNDEBUG  -B /Applications/Xcode.app/Contents/Developer/Toolchains/XcodeDefault.xctoolchain/usr/bin    -Wno-unused-command-line-argument -mllvm -verify-machineinstrs -O3 -arch x86_64 -isysroot /Applications/Xcode.app/Contents/Developer/Platforms/MacOSX.platform/Developer/SDKs/MacOSX10.14.sdk   -w -Werror=date-time -w -MD -MT SingleSource/Regression/C/gcc-c-torture/execute/CMakeFiles/GCC-C-execute-990531-1.dir/990531-1.c.o -MF SingleSource/Regression/C/gcc-c-torture/execute/CMakeFiles/GCC-C-execute-990531-1.dir/990531-1.c.o.d -o SingleSource/Regression/C/gcc-c-torture/execute/CMakeFiles/GCC-C-execute-990531-1.dir/990531-1.c.o   -c /Users/buildslave/jenkins/workspace/test-suite-verify-machineinstrs-x86_64-O3/test-suite/SingleSource/Regression/C/gcc-c-torture/execute/990531-1.c
[203/7684] /Users/buildslave/jenkins/workspace/test-suite-verify-machineinstrs-x86_64-O3/test-suite-build/tools/timeit --summary SingleSource/Regression/C/gcc-c-torture/execute/CMakeFiles/GCC-C-execute-20120615-1.dir/20120615-1.c.o.time /Users/buildslave/jenkins/workspace/test-suite-verify-machineinstrs-x86_64-O3/compiler/bin/clang -DNDEBUG  -B /Applications/Xcode.app/Contents/Developer/Toolchains/XcodeDefault.xctoolchain/usr/bin    -Wno-unused-command-line-argument -mllvm -verify-machineinstrs -O3 -arch x86_64 -isysroot /Applications/Xcode.app/Contents/Developer/Platforms/MacOSX.platform/Developer/SDKs/MacOSX10.14.sdk   -w -Werror=date-time -w -MD -MT SingleSource/Regression/C/gcc-c-torture/execute/CMakeFiles/GCC-C-execute-20120615-1.dir/20120615-1.c.o -MF SingleSource/Regression/C/gcc-c-torture/execute/CMakeFiles/GCC-C-execute-20120615-1.dir/20120615-1.c.o.d -o SingleSource/Regression/C/gcc-c-torture/execute/CMakeFiles/GCC-C-execute-20120615-1.dir/20120615-1.c.o   -c /Users/buildslave/jenkins/workspace/test-suite-verify-machineinstrs-x86_64-O3/test-suite/SingleSource/Regression/C/gcc-c-torture/execute/20120615-1.c
[204/7684] /Users/buildslave/jenkins/workspace/test-suite-verify-machineinstrs-x86_64-O3/test-suite-build/tools/timeit --summary SingleSource/Regression/C/gcc-c-torture/execute/CMakeFiles/GCC-C-execute-alias-4.dir/alias-4.c.o.time /Users/buildslave/jenkins/workspace/test-suite-verify-machineinstrs-x86_64-O3/compiler/bin/clang -DNDEBUG  -B /Applications/Xcode.app/Contents/Developer/Toolchains/XcodeDefault.xctoolchain/usr/bin    -Wno-unused-command-line-argument -mllvm -verify-machineinstrs -O3 -arch x86_64 -isysroot /Applications/Xcode.app/Contents/Developer/Platforms/MacOSX.platform/Developer/SDKs/MacOSX10.14.sdk   -w -Werror=date-time -w -MD -MT SingleSource/Regression/C/gcc-c-torture/execute/CMakeFiles/GCC-C-execute-alias-4.dir/alias-4.c.o -MF SingleSource/Regression/C/gcc-c-torture/execute/CMakeFiles/GCC-C-execute-alias-4.dir/alias-4.c.o.d -o SingleSource/Regression/C/gcc-c-torture/execute/CMakeFiles/GCC-C-execute-alias-4.dir/alias-4.c.o   -c /Users/buildslave/jenkins/workspace/test-suite-verify-machineinstrs-x86_64-O3/test-suite/SingleSource/Regression/C/gcc-c-torture/execute/alias-4.c
FAILED: SingleSource/Regression/C/gcc-c-torture/execute/CMakeFiles/GCC-C-execute-alias-4.dir/alias-4.c.o 
/Users/buildslave/jenkins/workspace/test-suite-verify-machineinstrs-x86_64-O3/test-suite-build/tools/timeit --summary SingleSource/Regression/C/gcc-c-torture/execute/CMakeFiles/GCC-C-execute-alias-4.dir/alias-4.c.o.time /Users/buildslave/jenkins/workspace/test-suite-verify-machineinstrs-x86_64-O3/compiler/bin/clang -DNDEBUG  -B /Applications/Xcode.app/Contents/Developer/Toolchains/XcodeDefault.xctoolchain/usr/bin    -Wno-unused-command-line-argument -mllvm -verify-machineinstrs -O3 -arch x86_64 -isysroot /Applications/Xcode.app/Contents/Developer/Platforms/MacOSX.platform/Developer/SDKs/MacOSX10.14.sdk   -w -Werror=date-time -w -MD -MT SingleSource/Regression/C/gcc-c-torture/execute/CMakeFiles/GCC-C-execute-alias-4.dir/alias-4.c.o -MF SingleSource/Regression/C/gcc-c-torture/execute/CMakeFiles/GCC-C-execute-alias-4.dir/alias-4.c.o.d -o SingleSource/Regression/C/gcc-c-torture/execute/CMakeFiles/GCC-C-execute-alias-4.dir/alias-4.c.o   -c /Users/buildslave/jenkins/workspace/test-suite-verify-machineinstrs-x86_64-O3/test-suite/SingleSource/Regression/C/gcc-c-torture/execute/alias-4.c
/Users/buildslave/jenkins/workspace/test-suite-verify-machineinstrs-x86_64-O3/test-suite/SingleSource/Regression/C/gcc-c-torture/execute/alias-4.c:3:30: error: aliases are not supported on darwin
extern int b __attribute__ ((alias ("a")));
                             ^
alias-4.c error: aliases are not supported on darwin
FAILED: SingleSource/Regression/C/gcc-c-torture/execute/CMakeFiles/GCC-C-execute-alias-4.dir/alias-4.c.o 
/Users/buildslave/jenkins/workspace/test-suite-verify-machineinstrs-x86_64-O3/test-suite-build/tools/timeit --summary SingleSource/Regression/C/gcc-c-torture/execute/CMakeFiles/GCC-C-execute-alias-4.dir/alias-4.c.o.time /Users/buildslave/jenkins/workspace/test-suite-verify-machineinstrs-x86_64-O3/compiler/bin/clang -DNDEBUG  -B /Applications/Xcode.app/Contents/Developer/Toolchains/XcodeDefault.xctoolchain/usr/bin    -Wno-unused-command-line-argument -mllvm -verify-machineinstrs -O3 -arch x86_64 -isysroot /Applications/Xcode.app/Contents/Developer/Platforms/MacOSX.platform/Developer/SDKs/MacOSX10.14.sdk   -w -Werror=date-time -w -MD -MT SingleSource/Regression/C/gcc-c-torture/execute/CMakeFiles/GCC-C-execute-alias-4.dir/alias-4.c.o -MF SingleSource/Regression/C/gcc-c-torture/execute/CMakeFiles/GCC-C-execute-alias-4.dir/alias-4.c.o.d -o SingleSource/Regression/C/gcc-c-torture/execute/CMakeFiles/GCC-C-execute-alias-4.dir/alias-4.c.o   -c /Users/buildslave/jenkins/workspace/test-suite-verify-machineinstrs-x86_64-O3/test-suite/SingleSource/Regression/C/gcc-c-torture/execute/alias-4.c
/Users/buildslave/jenkins/workspace/test-suite-verify-machineinstrs-x86_64-O3/test-suite/SingleSource/Regression/C/gcc-c-torture/execute/alias-4.c:3:30: error: aliases are not supported on darwin
extern int b __attribute__ ((alias ("a")));
                             ^
/Users/buildslave/jenkins/workspace/test-suite-verify-machineinstrs-x86_64-O3/test-suite/SingleSource/Regression/C/gcc-c-torture/execute/alias-4.c:5:30: error: aliases are not supported on darwin
extern int d __attribute__ ((alias ("c")));
                             ^
Ninja target: alias-3.c.o
[6044/7684] /Users/buildslave/jenkins/workspace/test-suite-verify-machineinstrs-x86_64-O3/test-suite-build/tools/timeit --summary SingleSource/Regression/C/gcc-c-torture/execute/CMakeFiles/GCC-C-execute-alias-access-path-1.dir/alias-access-path-1.c.o.time /Users/buildslave/jenkins/workspace/test-suite-verify-machineinstrs-x86_64-O3/compiler/bin/clang -DNDEBUG  -B /Applications/Xcode.app/Contents/Developer/Toolchains/XcodeDefault.xctoolchain/usr/bin    -Wno-unused-command-line-argument -mllvm -verify-machineinstrs -O3 -arch x86_64 -isysroot /Applications/Xcode.app/Contents/Developer/Platforms/MacOSX.platform/Developer/SDKs/MacOSX10.14.sdk   -w -Werror=date-time -w -MD -MT SingleSource/Regression/C/gcc-c-torture/execute/CMakeFiles/GCC-C-execute-alias-access-path-1.dir/alias-access-path-1.c.o -MF SingleSource/Regression/C/gcc-c-torture/execute/CMakeFiles/GCC-C-execute-alias-access-path-1.dir/alias-access-path-1.c.o.d -o SingleSource/Regression/C/gcc-c-torture/execute/CMakeFiles/GCC-C-execute-alias-access-path-1.dir/alias-access-path-1.c.o   -c /Users/buildslave/jenkins/workspace/test-suite-verify-machineinstrs-x86_64-O3/test-suite/SingleSource/Regression/C/gcc-c-torture/execute/alias-access-path-1.c
[6045/7684] : && /Users/buildslave/jenkins/workspace/test-suite-verify-machineinstrs-x86_64-O3/test-suite-build/tools/timeit --summary SingleSource/Regression/C/gcc-c-torture/execute/GCC-C-execute-align-1.link.time /Users/buildslave/jenkins/workspace/test-suite-verify-machineinstrs-x86_64-O3/compiler/bin/clang -B /Applications/Xcode.app/Contents/Developer/Toolchains/XcodeDefault.xctoolchain/usr/bin    -Wno-unused-command-line-argument -mllvm -verify-machineinstrs -O3 -arch x86_64 -isysroot /Applications/Xcode.app/Contents/Developer/Platforms/MacOSX.platform/Developer/SDKs/MacOSX10.14.sdk -Wl,-search_paths_first -Wl,-headerpad_max_install_names -B /Applications/Xcode.app/Contents/Developer/Toolchains/XcodeDefault.xctoolchain/usr/bin SingleSource/Regression/C/gcc-c-torture/execute/CMakeFiles/GCC-C-execute-align-1.dir/align-1.c.o  -o SingleSource/Regression/C/gcc-c-torture/execute/GCC-C-execute-align-1  -Wl,-no_pie && :
[6046/7684] : && /Users/buildslave/jenkins/workspace/test-suite-verify-machineinstrs-x86_64-O3/test-suite-build/tools/timeit --summary SingleSource/Regression/C/gcc-c-torture/execute/GCC-C-execute-ashldi-1.link.time /Users/buildslave/jenkins/workspace/test-suite-verify-machineinstrs-x86_64-O3/compiler/bin/clang -B /Applications/Xcode.app/Contents/Developer/Toolchains/XcodeDefault.xctoolchain/usr/bin    -Wno-unused-command-line-argument -mllvm -verify-machineinstrs -O3 -arch x86_64 -isysroot /Applications/Xcode.app/Contents/Developer/Platforms/MacOSX.platform/Developer/SDKs/MacOSX10.14.sdk -Wl,-search_paths_first -Wl,-headerpad_max_install_names -B /Applications/Xcode.app/Contents/Developer/Toolchains/XcodeDefault.xctoolchain/usr/bin SingleSource/Regression/C/gcc-c-torture/execute/CMakeFiles/GCC-C-execute-ashldi-1.dir/ashldi-1.c.o  -o SingleSource/Regression/C/gcc-c-torture/execute/GCC-C-execute-ashldi-1  -Wl,-no_pie && :
[6047/7684] /Users/buildslave/jenkins/workspace/test-suite-verify-machineinstrs-x86_64-O3/test-suite-build/tools/timeit --summary SingleSource/Regression/C/gcc-c-torture/execute/CMakeFiles/GCC-C-execute-pr61306-2.dir/pr61306-2.c.o.time /Users/buildslave/jenkins/workspace/test-suite-verify-machineinstrs-x86_64-O3/compiler/bin/clang -DNDEBUG  -B /Applications/Xcode.app/Contents/Developer/Toolchains/XcodeDefault.xctoolchain/usr/bin    -Wno-unused-command-line-argument -mllvm -verify-machineinstrs -O3 -arch x86_64 -isysroot /Applications/Xcode.app/Contents/Developer/Platforms/MacOSX.platform/Developer/SDKs/MacOSX10.14.sdk   -w -Werror=date-time -w -MD -MT SingleSource/Regression/C/gcc-c-torture/execute/CMakeFiles/GCC-C-execute-pr61306-2.dir/pr61306-2.c.o -MF SingleSource/Regression/C/gcc-c-torture/execute/CMakeFiles/GCC-C-execute-pr61306-2.dir/pr61306-2.c.o.d -o SingleSource/Regression/C/gcc-c-torture/execute/CMakeFiles/GCC-C-execute-pr61306-2.dir/pr61306-2.c.o   -c /Users/buildslave/jenkins/workspace/test-suite-verify-machineinstrs-x86_64-O3/test-suite/SingleSource/Regression/C/gcc-c-torture/execute/pr61306-2.c
[6048/7684] /Users/buildslave/jenkins/workspace/test-suite-verify-machineinstrs-x86_64-O3/test-suite-build/tools/timeit --summary SingleSource/Regression/C/gcc-c-torture/execute/CMakeFiles/GCC-C-execute-alias-3.dir/alias-3.c.o.time /Users/buildslave/jenkins/workspace/test-suite-verify-machineinstrs-x86_64-O3/compiler/bin/clang -DNDEBUG  -B /Applications/Xcode.app/Contents/Developer/Toolchains/XcodeDefault.xctoolchain/usr/bin    -Wno-unused-command-line-argument -mllvm -verify-machineinstrs -O3 -arch x86_64 -isysroot /Applications/Xcode.app/Contents/Developer/Platforms/MacOSX.platform/Developer/SDKs/MacOSX10.14.sdk   -w -Werror=date-time -w -MD -MT SingleSource/Regression/C/gcc-c-torture/execute/CMakeFiles/GCC-C-execute-alias-3.dir/alias-3.c.o -MF SingleSource/Regression/C/gcc-c-torture/execute/CMakeFiles/GCC-C-execute-alias-3.dir/alias-3.c.o.d -o SingleSource/Regression/C/gcc-c-torture/execute/CMakeFiles/GCC-C-execute-alias-3.dir/alias-3.c.o   -c /Users/buildslave/jenkins/workspace/test-suite-verify-machineinstrs-x86_64-O3/test-suite/SingleSource/Regression/C/gcc-c-torture/execute/alias-3.c
FAILED: SingleSource/Regression/C/gcc-c-torture/execute/CMakeFiles/GCC-C-execute-alias-3.dir/alias-3.c.o 
/Users/buildslave/jenkins/workspace/test-suite-verify-machineinstrs-x86_64-O3/test-suite-build/tools/timeit --summary SingleSource/Regression/C/gcc-c-torture/execute/CMakeFiles/GCC-C-execute-alias-3.dir/alias-3.c.o.time /Users/buildslave/jenkins/workspace/test-suite-verify-machineinstrs-x86_64-O3/compiler/bin/clang -DNDEBUG  -B /Applications/Xcode.app/Contents/Developer/Toolchains/XcodeDefault.xctoolchain/usr/bin    -Wno-unused-command-line-argument -mllvm -verify-machineinstrs -O3 -arch x86_64 -isysroot /Applications/Xcode.app/Contents/Developer/Platforms/MacOSX.platform/Developer/SDKs/MacOSX10.14.sdk   -w -Werror=date-time -w -MD -MT SingleSource/Regression/C/gcc-c-torture/execute/CMakeFiles/GCC-C-execute-alias-3.dir/alias-3.c.o -MF SingleSource/Regression/C/gcc-c-torture/execute/CMakeFiles/GCC-C-execute-alias-3.dir/alias-3.c.o.d -o SingleSource/Regression/C/gcc-c-torture/execute/CMakeFiles/GCC-C-execute-alias-3.dir/alias-3.c.o   -c /Users/buildslave/jenkins/workspace/test-suite-verify-machineinstrs-x86_64-O3/test-suite/SingleSource/Regression/C/gcc-c-torture/execute/alias-3.c
/Users/buildslave/jenkins/workspace/test-suite-verify-machineinstrs-x86_64-O3/test-suite/SingleSource/Regression/C/gcc-c-torture/execute/alias-3.c:4:30: error: aliases are not supported on darwin
alias-3.c error: aliases are not supported on darwin
[6046/7684] : && /Users/buildslave/jenkins/workspace/test-suite-verify-machineinstrs-x86_64-O3/test-suite-build/tools/timeit --summary SingleSource/Regression/C/gcc-c-torture/execute/GCC-C-execute-ashldi-1.link.time /Users/buildslave/jenkins/workspace/test-suite-verify-machineinstrs-x86_64-O3/compiler/bin/clang -B /Applications/Xcode.app/Contents/Developer/Toolchains/XcodeDefault.xctoolchain/usr/bin    -Wno-unused-command-line-argument -mllvm -verify-machineinstrs -O3 -arch x86_64 -isysroot /Applications/Xcode.app/Contents/Developer/Platforms/MacOSX.platform/Developer/SDKs/MacOSX10.14.sdk -Wl,-search_paths_first -Wl,-headerpad_max_install_names -B /Applications/Xcode.app/Contents/Developer/Toolchains/XcodeDefault.xctoolchain/usr/bin SingleSource/Regression/C/gcc-c-torture/execute/CMakeFiles/GCC-C-execute-ashldi-1.dir/ashldi-1.c.o  -o SingleSource/Regression/C/gcc-c-torture/execute/GCC-C-execute-ashldi-1  -Wl,-no_pie && :
[6047/7684] /Users/buildslave/jenkins/workspace/test-suite-verify-machineinstrs-x86_64-O3/test-suite-build/tools/timeit --summary SingleSource/Regression/C/gcc-c-torture/execute/CMakeFiles/GCC-C-execute-pr61306-2.dir/pr61306-2.c.o.time /Users/buildslave/jenkins/workspace/test-suite-verify-machineinstrs-x86_64-O3/compiler/bin/clang -DNDEBUG  -B /Applications/Xcode.app/Contents/Developer/Toolchains/XcodeDefault.xctoolchain/usr/bin    -Wno-unused-command-line-argument -mllvm -verify-machineinstrs -O3 -arch x86_64 -isysroot /Applications/Xcode.app/Contents/Developer/Platforms/MacOSX.platform/Developer/SDKs/MacOSX10.14.sdk   -w -Werror=date-time -w -MD -MT SingleSource/Regression/C/gcc-c-torture/execute/CMakeFiles/GCC-C-execute-pr61306-2.dir/pr61306-2.c.o -MF SingleSource/Regression/C/gcc-c-torture/execute/CMakeFiles/GCC-C-execute-pr61306-2.dir/pr61306-2.c.o.d -o SingleSource/Regression/C/gcc-c-torture/execute/CMakeFiles/GCC-C-execute-pr61306-2.dir/pr61306-2.c.o   -c /Users/buildslave/jenkins/workspace/test-suite-verify-machineinstrs-x86_64-O3/test-suite/SingleSource/Regression/C/gcc-c-torture/execute/pr61306-2.c
[6048/7684] /Users/buildslave/jenkins/workspace/test-suite-verify-machineinstrs-x86_64-O3/test-suite-build/tools/timeit --summary SingleSource/Regression/C/gcc-c-torture/execute/CMakeFiles/GCC-C-execute-alias-3.dir/alias-3.c.o.time /Users/buildslave/jenkins/workspace/test-suite-verify-machineinstrs-x86_64-O3/compiler/bin/clang -DNDEBUG  -B /Applications/Xcode.app/Contents/Developer/Toolchains/XcodeDefault.xctoolchain/usr/bin    -Wno-unused-command-line-argument -mllvm -verify-machineinstrs -O3 -arch x86_64 -isysroot /Applications/Xcode.app/Contents/Developer/Platforms/MacOSX.platform/Developer/SDKs/MacOSX10.14.sdk   -w -Werror=date-time -w -MD -MT SingleSource/Regression/C/gcc-c-torture/execute/CMakeFiles/GCC-C-execute-alias-3.dir/alias-3.c.o -MF SingleSource/Regression/C/gcc-c-torture/execute/CMakeFiles/GCC-C-execute-alias-3.dir/alias-3.c.o.d -o SingleSource/Regression/C/gcc-c-torture/execute/CMakeFiles/GCC-C-execute-alias-3.dir/alias-3.c.o   -c /Users/buildslave/jenkins/workspace/test-suite-verify-machineinstrs-x86_64-O3/test-suite/SingleSource/Regression/C/gcc-c-torture/execute/alias-3.c
FAILED: SingleSource/Regression/C/gcc-c-torture/execute/CMakeFiles/GCC-C-execute-alias-3.dir/alias-3.c.o 
/Users/buildslave/jenkins/workspace/test-suite-verify-machineinstrs-x86_64-O3/test-suite-build/tools/timeit --summary SingleSource/Regression/C/gcc-c-torture/execute/CMakeFiles/GCC-C-execute-alias-3.dir/alias-3.c.o.time /Users/buildslave/jenkins/workspace/test-suite-verify-machineinstrs-x86_64-O3/compiler/bin/clang -DNDEBUG  -B /Applications/Xcode.app/Contents/Developer/Toolchains/XcodeDefault.xctoolchain/usr/bin    -Wno-unused-command-line-argument -mllvm -verify-machineinstrs -O3 -arch x86_64 -isysroot /Applications/Xcode.app/Contents/Developer/Platforms/MacOSX.platform/Developer/SDKs/MacOSX10.14.sdk   -w -Werror=date-time -w -MD -MT SingleSource/Regression/C/gcc-c-torture/execute/CMakeFiles/GCC-C-execute-alias-3.dir/alias-3.c.o -MF SingleSource/Regression/C/gcc-c-torture/execute/CMakeFiles/GCC-C-execute-alias-3.dir/alias-3.c.o.d -o SingleSource/Regression/C/gcc-c-torture/execute/CMakeFiles/GCC-C-execute-alias-3.dir/alias-3.c.o   -c /Users/buildslave/jenkins/workspace/test-suite-verify-machineinstrs-x86_64-O3/test-suite/SingleSource/Regression/C/gcc-c-torture/execute/alias-3.c
/Users/buildslave/jenkins/workspace/test-suite-verify-machineinstrs-x86_64-O3/test-suite/SingleSource/Regression/C/gcc-c-torture/execute/alias-3.c:4:30: error: aliases are not supported on darwin
extern int b __attribute__ ((alias("a")));
                             ^
Ninja target: alias-2.c.o
/Users/buildslave/jenkins/workspace/test-suite-verify-machineinstrs-x86_64-O3/test-suite/SingleSource/Regression/C/gcc-c-torture/execute/alias-3.c:4:30: error: aliases are not supported on darwin
extern int b __attribute__ ((alias("a")));
                             ^
1 error generated.
[6049/7684] /Users/buildslave/jenkins/workspace/test-suite-verify-machineinstrs-x86_64-O3/test-suite-build/tools/timeit --summary SingleSource/Regression/C/gcc-c-torture/execute/CMakeFiles/GCC-C-execute-alias-2.dir/alias-2.c.o.time /Users/buildslave/jenkins/workspace/test-suite-verify-machineinstrs-x86_64-O3/compiler/bin/clang -DNDEBUG  -B /Applications/Xcode.app/Contents/Developer/Toolchains/XcodeDefault.xctoolchain/usr/bin    -Wno-unused-command-line-argument -mllvm -verify-machineinstrs -O3 -arch x86_64 -isysroot /Applications/Xcode.app/Contents/Developer/Platforms/MacOSX.platform/Developer/SDKs/MacOSX10.14.sdk   -w -Werror=date-time -w -MD -MT SingleSource/Regression/C/gcc-c-torture/execute/CMakeFiles/GCC-C-execute-alias-2.dir/alias-2.c.o -MF SingleSource/Regression/C/gcc-c-torture/execute/CMakeFiles/GCC-C-execute-alias-2.dir/alias-2.c.o.d -o SingleSource/Regression/C/gcc-c-torture/execute/CMakeFiles/GCC-C-execute-alias-2.dir/alias-2.c.o   -c /Users/buildslave/jenkins/workspace/test-suite-verify-machineinstrs-x86_64-O3/test-suite/SingleSource/Regression/C/gcc-c-torture/execute/alias-2.c
FAILED: SingleSource/Regression/C/gcc-c-torture/execute/CMakeFiles/GCC-C-execute-alias-2.dir/alias-2.c.o 
/Users/buildslave/jenkins/workspace/test-suite-verify-machineinstrs-x86_64-O3/test-suite-build/tools/timeit --summary SingleSource/Regression/C/gcc-c-torture/execute/CMakeFiles/GCC-C-execute-alias-2.dir/alias-2.c.o.time /Users/buildslave/jenkins/workspace/test-suite-verify-machineinstrs-x86_64-O3/compiler/bin/clang -DNDEBUG  -B /Applications/Xcode.app/Contents/Developer/Toolchains/XcodeDefault.xctoolchain/usr/bin    -Wno-unused-command-line-argument -mllvm -verify-machineinstrs -O3 -arch x86_64 -isysroot /Applications/Xcode.app/Contents/Developer/Platforms/MacOSX.platform/Developer/SDKs/MacOSX10.14.sdk   -w -Werror=date-time -w -MD -MT SingleSource/Regression/C/gcc-c-torture/execute/CMakeFiles/GCC-C-execute-alias-2.dir/alias-2.c.o -MF SingleSource/Regression/C/gcc-c-torture/execute/CMakeFiles/GCC-C-execute-alias-2.dir/alias-2.c.o.d -o SingleSource/Regression/C/gcc-c-torture/execute/CMakeFiles/GCC-C-execute-alias-2.dir/alias-2.c.o   -c /Users/buildslave/jenkins/workspace/test-suite-verify-machineinstrs-x86_64-O3/test-suite/SingleSource/Regression/C/gcc-c-torture/execute/alias-2.c
/Users/buildslave/jenkins/workspace/test-suite-verify-machineinstrs-x86_64-O3/test-suite/SingleSource/Regression/C/gcc-c-torture/execute/alias-2.c:3:34: error: aliases are not supported on darwin
alias-2.c error: aliases are not supported on darwin
                             ^
1 error generated.
[6049/7684] /Users/buildslave/jenkins/workspace/test-suite-verify-machineinstrs-x86_64-O3/test-suite-build/tools/timeit --summary SingleSource/Regression/C/gcc-c-torture/execute/CMakeFiles/GCC-C-execute-alias-2.dir/alias-2.c.o.time /Users/buildslave/jenkins/workspace/test-suite-verify-machineinstrs-x86_64-O3/compiler/bin/clang -DNDEBUG  -B /Applications/Xcode.app/Contents/Developer/Toolchains/XcodeDefault.xctoolchain/usr/bin    -Wno-unused-command-line-argument -mllvm -verify-machineinstrs -O3 -arch x86_64 -isysroot /Applications/Xcode.app/Contents/Developer/Platforms/MacOSX.platform/Developer/SDKs/MacOSX10.14.sdk   -w -Werror=date-time -w -MD -MT SingleSource/Regression/C/gcc-c-torture/execute/CMakeFiles/GCC-C-execute-alias-2.dir/alias-2.c.o -MF SingleSource/Regression/C/gcc-c-torture/execute/CMakeFiles/GCC-C-execute-alias-2.dir/alias-2.c.o.d -o SingleSource/Regression/C/gcc-c-torture/execute/CMakeFiles/GCC-C-execute-alias-2.dir/alias-2.c.o   -c /Users/buildslave/jenkins/workspace/test-suite-verify-machineinstrs-x86_64-O3/test-suite/SingleSource/Regression/C/gcc-c-torture/execute/alias-2.c
FAILED: SingleSource/Regression/C/gcc-c-torture/execute/CMakeFiles/GCC-C-execute-alias-2.dir/alias-2.c.o 
/Users/buildslave/jenkins/workspace/test-suite-verify-machineinstrs-x86_64-O3/test-suite-build/tools/timeit --summary SingleSource/Regression/C/gcc-c-torture/execute/CMakeFiles/GCC-C-execute-alias-2.dir/alias-2.c.o.time /Users/buildslave/jenkins/workspace/test-suite-verify-machineinstrs-x86_64-O3/compiler/bin/clang -DNDEBUG  -B /Applications/Xcode.app/Contents/Developer/Toolchains/XcodeDefault.xctoolchain/usr/bin    -Wno-unused-command-line-argument -mllvm -verify-machineinstrs -O3 -arch x86_64 -isysroot /Applications/Xcode.app/Contents/Developer/Platforms/MacOSX.platform/Developer/SDKs/MacOSX10.14.sdk   -w -Werror=date-time -w -MD -MT SingleSource/Regression/C/gcc-c-torture/execute/CMakeFiles/GCC-C-execute-alias-2.dir/alias-2.c.o -MF SingleSource/Regression/C/gcc-c-torture/execute/CMakeFiles/GCC-C-execute-alias-2.dir/alias-2.c.o.d -o SingleSource/Regression/C/gcc-c-torture/execute/CMakeFiles/GCC-C-execute-alias-2.dir/alias-2.c.o   -c /Users/buildslave/jenkins/workspace/test-suite-verify-machineinstrs-x86_64-O3/test-suite/SingleSource/Regression/C/gcc-c-torture/execute/alias-2.c
/Users/buildslave/jenkins/workspace/test-suite-verify-machineinstrs-x86_64-O3/test-suite/SingleSource/Regression/C/gcc-c-torture/execute/alias-2.c:3:34: error: aliases are not supported on darwin
extern int b[10] __attribute__ ((alias("a")));
                                 ^
Ninja target: GCC-C-execute-930513-1
[6460/7684] : && /Users/buildslave/jenkins/workspace/test-suite-verify-machineinstrs-x86_64-O3/test-suite-build/tools/timeit --summary SingleSource/Regression/C/gcc-c-torture/execute/GCC-C-execute-930429-2.link.time /Users/buildslave/jenkins/workspace/test-suite-verify-machineinstrs-x86_64-O3/compiler/bin/clang -B /Applications/Xcode.app/Contents/Developer/Toolchains/XcodeDefault.xctoolchain/usr/bin    -Wno-unused-command-line-argument -mllvm -verify-machineinstrs -O3 -arch x86_64 -isysroot /Applications/Xcode.app/Contents/Developer/Platforms/MacOSX.platform/Developer/SDKs/MacOSX10.14.sdk -Wl,-search_paths_first -Wl,-headerpad_max_install_names -B /Applications/Xcode.app/Contents/Developer/Toolchains/XcodeDefault.xctoolchain/usr/bin SingleSource/Regression/C/gcc-c-torture/execute/CMakeFiles/GCC-C-execute-930429-2.dir/930429-2.c.o  -o SingleSource/Regression/C/gcc-c-torture/execute/GCC-C-execute-930429-2  -Wl,-no_pie && :
[6461/7684] /Users/buildslave/jenkins/workspace/test-suite-verify-machineinstrs-x86_64-O3/test-suite-build/tools/timeit --summary SingleSource/Regression/C/gcc-c-torture/execute/CMakeFiles/GCC-C-execute-930513-1.dir/930513-1.c.o.time /Users/buildslave/jenkins/workspace/test-suite-verify-machineinstrs-x86_64-O3/compiler/bin/clang -DNDEBUG  -B /Applications/Xcode.app/Contents/Developer/Toolchains/XcodeDefault.xctoolchain/usr/bin    -Wno-unused-command-line-argument -mllvm -verify-machineinstrs -O3 -arch x86_64 -isysroot /Applications/Xcode.app/Contents/Developer/Platforms/MacOSX.platform/Developer/SDKs/MacOSX10.14.sdk   -w -Werror=date-time -w -MD -MT SingleSource/Regression/C/gcc-c-torture/execute/CMakeFiles/GCC-C-execute-930513-1.dir/930513-1.c.o -MF SingleSource/Regression/C/gcc-c-torture/execute/CMakeFiles/GCC-C-execute-930513-1.dir/930513-1.c.o.d -o SingleSource/Regression/C/gcc-c-torture/execute/CMakeFiles/GCC-C-execute-930513-1.dir/930513-1.c.o   -c /Users/buildslave/jenkins/workspace/test-suite-verify-machineinstrs-x86_64-O3/test-suite/SingleSource/Regression/C/gcc-c-torture/execute/930513-1.c
[6462/7684] : && /Users/buildslave/jenkins/workspace/test-suite-verify-machineinstrs-x86_64-O3/test-suite-build/tools/timeit --summary SingleSource/Regression/C/gcc-c-torture/execute/GCC-C-execute-930406-1.link.time /Users/buildslave/jenkins/workspace/test-suite-verify-machineinstrs-x86_64-O3/compiler/bin/clang -B /Applications/Xcode.app/Contents/Developer/Toolchains/XcodeDefault.xctoolchain/usr/bin    -Wno-unused-command-line-argument -mllvm -verify-machineinstrs -O3 -arch x86_64 -isysroot /Applications/Xcode.app/Contents/Developer/Platforms/MacOSX.platform/Developer/SDKs/MacOSX10.14.sdk -Wl,-search_paths_first -Wl,-headerpad_max_install_names -B /Applications/Xcode.app/Contents/Developer/Toolchains/XcodeDefault.xctoolchain/usr/bin SingleSource/Regression/C/gcc-c-torture/execute/CMakeFiles/GCC-C-execute-930406-1.dir/930406-1.c.o  -o SingleSource/Regression/C/gcc-c-torture/execute/GCC-C-execute-930406-1  -Wl,-no_pie && :
[6463/7684] /Users/buildslave/jenkins/workspace/test-suite-verify-machineinstrs-x86_64-O3/test-suite-build/tools/timeit --summary SingleSource/Regression/C/gcc-c-torture/execute/CMakeFiles/GCC-C-execute-loop-2d.dir/loop-2d.c.o.time /Users/buildslave/jenkins/workspace/test-suite-verify-machineinstrs-x86_64-O3/compiler/bin/clang -DNDEBUG  -B /Applications/Xcode.app/Contents/Developer/Toolchains/XcodeDefault.xctoolchain/usr/bin    -Wno-unused-command-line-argument -mllvm -verify-machineinstrs -O3 -arch x86_64 -isysroot /Applications/Xcode.app/Contents/Developer/Platforms/MacOSX.platform/Developer/SDKs/MacOSX10.14.sdk   -w -Werror=date-time -w -MD -MT SingleSource/Regression/C/gcc-c-torture/execute/CMakeFiles/GCC-C-execute-loop-2d.dir/loop-2d.c.o -MF SingleSource/Regression/C/gcc-c-torture/execute/CMakeFiles/GCC-C-execute-loop-2d.dir/loop-2d.c.o.d -o SingleSource/Regression/C/gcc-c-torture/execute/CMakeFiles/GCC-C-execute-loop-2d.dir/loop-2d.c.o   -c /Users/buildslave/jenkins/workspace/test-suite-verify-machineinstrs-x86_64-O3/test-suite/SingleSource/Regression/C/gcc-c-torture/execute/loop-2d.c
[6464/7684] : && /Users/buildslave/jenkins/workspace/test-suite-verify-machineinstrs-x86_64-O3/test-suite-build/tools/timeit --summary SingleSource/Regression/C/gcc-c-torture/execute/GCC-C-execute-930513-1.link.time /Users/buildslave/jenkins/workspace/test-suite-verify-machineinstrs-x86_64-O3/compiler/bin/clang -B /Applications/Xcode.app/Contents/Developer/Toolchains/XcodeDefault.xctoolchain/usr/bin    -Wno-unused-command-line-argument -mllvm -verify-machineinstrs -O3 -arch x86_64 -isysroot /Applications/Xcode.app/Contents/Developer/Platforms/MacOSX.platform/Developer/SDKs/MacOSX10.14.sdk -Wl,-search_paths_first -Wl,-headerpad_max_install_names -B /Applications/Xcode.app/Contents/Developer/Toolchains/XcodeDefault.xctoolchain/usr/bin SingleSource/Regression/C/gcc-c-torture/execute/CMakeFiles/GCC-C-execute-930513-1.dir/930513-1.c.o  -o SingleSource/Regression/C/gcc-c-torture/execute/GCC-C-execute-930513-1  -Wl,-no_pie -Wl,-u,_printf_float && :
FAILED: SingleSource/Regression/C/gcc-c-torture/execute/GCC-C-execute-930513-1 
: && /Users/buildslave/jenkins/workspace/test-suite-verify-machineinstrs-x86_64-O3/test-suite-build/tools/timeit --summary SingleSource/Regression/C/gcc-c-torture/execute/GCC-C-execute-930513-1.link.time /Users/buildslave/jenkins/workspace/test-suite-verify-machineinstrs-x86_64-O3/compiler/bin/clang -B /Applications/Xcode.app/Contents/Developer/Toolchains/XcodeDefault.xctoolchain/usr/bin    -Wno-unused-command-line-argument -mllvm -verify-machineinstrs -O3 -arch x86_64 -isysroot /Applications/Xcode.app/Contents/Developer/Platforms/MacOSX.platform/Developer/SDKs/MacOSX10.14.sdk -Wl,-search_paths_first -Wl,-headerpad_max_install_names -B /Applications/Xcode.app/Contents/Developer/Toolchains/XcodeDefault.xctoolchain/usr/bin SingleSource/Regression/C/gcc-c-torture/execute/CMakeFiles/GCC-C-execute-930513-1.dir/930513-1.c.o  -o SingleSource/Regression/C/gcc-c-torture/execute/GCC-C-execute-930513-1  -Wl,-no_pie -Wl,-u,_printf_float && :
Undefined symbols for architecture x86_64:
link error
: && /Users/buildslave/jenkins/workspace/test-suite-verify-machineinstrs-x86_64-O3/test-suite-build/tools/timeit --summary SingleSource/Regression/C/gcc-c-torture/execute/GCC-C-execute-930513-1.link.time /Users/buildslave/jenkins/workspace/test-suite-verify-machineinstrs-x86_64-O3/compiler/bin/clang -B /Applications/Xcode.app/Contents/Developer/Toolchains/XcodeDefault.xctoolchain/usr/bin    -Wno-unused-command-line-argument -mllvm -verify-machineinstrs -O3 -arch x86_64 -isysroot /Applications/Xcode.app/Contents/Developer/Platforms/MacOSX.platform/Developer/SDKs/MacOSX10.14.sdk -Wl,-search_paths_first -Wl,-headerpad_max_install_names -B /Applications/Xcode.app/Contents/Developer/Toolchains/XcodeDefault.xctoolchain/usr/bin SingleSource/Regression/C/gcc-c-torture/execute/CMakeFiles/GCC-C-execute-930513-1.dir/930513-1.c.o  -o SingleSource/Regression/C/gcc-c-torture/execute/GCC-C-execute-930513-1  -Wl,-no_pie -Wl,-u,_printf_float && :
Undefined symbols for architecture x86_64:
  "_printf_float", referenced from:
     -u command line option
ld: symbol(s) not found for architecture x86_64
clang-10: error: linker command failed with exit code 1 (use -v to see invocation)
[6465/7684] /Users/buildslave/jenkins/workspace/test-suite-verify-machineinstrs-x86_64-O3/test-suite-build/tools/timeit --summary SingleSource/Regression/C/gcc-c-torture/execute/CMakeFiles/GCC-C-execute-931012-1.dir/931012-1.c.o.time /Users/buildslave/jenkins/workspace/test-suite-verify-machineinstrs-x86_64-O3/compiler/bin/clang -DNDEBUG  -B /Applications/Xcode.app/Contents/Developer/Toolchains/XcodeDefault.xctoolchain/usr/bin    -Wno-unused-command-line-argument -mllvm -verify-machineinstrs -O3 -arch x86_64 -isysroot /Applications/Xcode.app/Contents/Developer/Platforms/MacOSX.platform/Developer/SDKs/MacOSX10.14.sdk   -w -Werror=date-time -w -MD -MT SingleSource/Regression/C/gcc-c-torture/execute/CMakeFiles/GCC-C-execute-931012-1.dir/931012-1.c.o -MF SingleSource/Regression/C/gcc-c-torture/execute/CMakeFiles/GCC-C-execute-931012-1.dir/931012-1.c.o.d -o SingleSource/Regression/C/gcc-c-torture/execute/CMakeFiles/GCC-C-execute-931012-1.dir/931012-1.c.o   -c /Users/buildslave/jenkins/workspace/test-suite-verify-machineinstrs-x86_64-O3/test-suite/SingleSource/Regression/C/gcc-c-torture/execute/931012-1.c
[6466/7684] /Users/buildslave/jenkins/workspace/test-suite-verify-machineinstrs-x86_64-O3/test-suite-build/tools/timeit --summary SingleSource/Regression/C/gcc-c-torture/execute/CMakeFiles/GCC-C-execute-921208-1.dir/921208-1.c.o.time /Users/buildslave/jenkins/workspace/test-suite-verify-machineinstrs-x86_64-O3/compiler/bin/clang -DNDEBUG  -B /Applications/Xcode.app/Contents/Developer/Toolchains/XcodeDefault.xctoolchain/usr/bin    -Wno-unused-command-line-argument -mllvm -verify-machineinstrs -O3 -arch x86_64 -isysroot /Applications/Xcode.app/Contents/Developer/Platforms/MacOSX.platform/Developer/SDKs/MacOSX10.14.sdk   -w -Werror=date-time -w -MD -MT SingleSource/Regression/C/gcc-c-torture/execute/CMakeFiles/GCC-C-execute-921208-1.dir/921208-1.c.o -MF SingleSource/Regression/C/gcc-c-torture/execute/CMakeFiles/GCC-C-execute-921208-1.dir/921208-1.c.o.d -o SingleSource/Regression/C/gcc-c-torture/execute/CMakeFiles/GCC-C-execute-921208-1.dir/921208-1.c.o   -c /Users/buildslave/jenkins/workspace/test-suite-verify-machineinstrs-x86_64-O3/test-suite/SingleSource/Regression/C/gcc-c-torture/execute/921208-1.c
Ninja target: GCC-C-execute-920501-8
[7256/7684] : && /Users/buildslave/jenkins/workspace/test-suite-verify-machineinstrs-x86_64-O3/test-suite-build/tools/timeit --summary SingleSource/Regression/C/gcc-c-torture/execute/GCC-C-execute-20071213-1.link.time /Users/buildslave/jenkins/workspace/test-suite-verify-machineinstrs-x86_64-O3/compiler/bin/clang -B /Applications/Xcode.app/Contents/Developer/Toolchains/XcodeDefault.xctoolchain/usr/bin    -Wno-unused-command-line-argument -mllvm -verify-machineinstrs -O3 -arch x86_64 -isysroot /Applications/Xcode.app/Contents/Developer/Platforms/MacOSX.platform/Developer/SDKs/MacOSX10.14.sdk -Wl,-search_paths_first -Wl,-headerpad_max_install_names -B /Applications/Xcode.app/Contents/Developer/Toolchains/XcodeDefault.xctoolchain/usr/bin SingleSource/Regression/C/gcc-c-torture/execute/CMakeFiles/GCC-C-execute-20071213-1.dir/20071213-1.c.o  -o SingleSource/Regression/C/gcc-c-torture/execute/GCC-C-execute-20071213-1  -Wl,-no_pie && :
[7257/7684] /Users/buildslave/jenkins/workspace/test-suite-verify-machineinstrs-x86_64-O3/test-suite-build/tools/timeit --summary SingleSource/Regression/C/gcc-c-torture/execute/CMakeFiles/GCC-C-execute-920501-8.dir/920501-8.c.o.time /Users/buildslave/jenkins/workspace/test-suite-verify-machineinstrs-x86_64-O3/compiler/bin/clang -DNDEBUG  -B /Applications/Xcode.app/Contents/Developer/Toolchains/XcodeDefault.xctoolchain/usr/bin    -Wno-unused-command-line-argument -mllvm -verify-machineinstrs -O3 -arch x86_64 -isysroot /Applications/Xcode.app/Contents/Developer/Platforms/MacOSX.platform/Developer/SDKs/MacOSX10.14.sdk   -w -Werror=date-time -w -MD -MT SingleSource/Regression/C/gcc-c-torture/execute/CMakeFiles/GCC-C-execute-920501-8.dir/920501-8.c.o -MF SingleSource/Regression/C/gcc-c-torture/execute/CMakeFiles/GCC-C-execute-920501-8.dir/920501-8.c.o.d -o SingleSource/Regression/C/gcc-c-torture/execute/CMakeFiles/GCC-C-execute-920501-8.dir/920501-8.c.o   -c /Users/buildslave/jenkins/workspace/test-suite-verify-machineinstrs-x86_64-O3/test-suite/SingleSource/Regression/C/gcc-c-torture/execute/920501-8.c
[7258/7684] /Users/buildslave/jenkins/workspace/test-suite-verify-machineinstrs-x86_64-O3/test-suite-build/tools/timeit --summary SingleSource/Regression/C/gcc-c-torture/execute/CMakeFiles/GCC-C-execute-pr84521.dir/pr84521.c.o.time /Users/buildslave/jenkins/workspace/test-suite-verify-machineinstrs-x86_64-O3/compiler/bin/clang -DNDEBUG  -B /Applications/Xcode.app/Contents/Developer/Toolchains/XcodeDefault.xctoolchain/usr/bin    -Wno-unused-command-line-argument -mllvm -verify-machineinstrs -O3 -arch x86_64 -isysroot /Applications/Xcode.app/Contents/Developer/Platforms/MacOSX.platform/Developer/SDKs/MacOSX10.14.sdk   -w -Werror=date-time -w -fomit-frame-pointer -fno-inline -MD -MT SingleSource/Regression/C/gcc-c-torture/execute/CMakeFiles/GCC-C-execute-pr84521.dir/pr84521.c.o -MF SingleSource/Regression/C/gcc-c-torture/execute/CMakeFiles/GCC-C-execute-pr84521.dir/pr84521.c.o.d -o SingleSource/Regression/C/gcc-c-torture/execute/CMakeFiles/GCC-C-execute-pr84521.dir/pr84521.c.o   -c /Users/buildslave/jenkins/workspace/test-suite-verify-machineinstrs-x86_64-O3/test-suite/SingleSource/Regression/C/gcc-c-torture/execute/pr84521.c
[7259/7684] /Users/buildslave/jenkins/workspace/test-suite-verify-machineinstrs-x86_64-O3/test-suite-build/tools/timeit --summary SingleSource/Regression/C/gcc-c-torture/execute/CMakeFiles/GCC-C-execute-930208-1.dir/930208-1.c.o.time /Users/buildslave/jenkins/workspace/test-suite-verify-machineinstrs-x86_64-O3/compiler/bin/clang -DNDEBUG  -B /Applications/Xcode.app/Contents/Developer/Toolchains/XcodeDefault.xctoolchain/usr/bin    -Wno-unused-command-line-argument -mllvm -verify-machineinstrs -O3 -arch x86_64 -isysroot /Applications/Xcode.app/Contents/Developer/Platforms/MacOSX.platform/Developer/SDKs/MacOSX10.14.sdk   -w -Werror=date-time -w -MD -MT SingleSource/Regression/C/gcc-c-torture/execute/CMakeFiles/GCC-C-execute-930208-1.dir/930208-1.c.o -MF SingleSource/Regression/C/gcc-c-torture/execute/CMakeFiles/GCC-C-execute-930208-1.dir/930208-1.c.o.d -o SingleSource/Regression/C/gcc-c-torture/execute/CMakeFiles/GCC-C-execute-930208-1.dir/930208-1.c.o   -c /Users/buildslave/jenkins/workspace/test-suite-verify-machineinstrs-x86_64-O3/test-suite/SingleSource/Regression/C/gcc-c-torture/execute/930208-1.c
[7260/7684] : && /Users/buildslave/jenkins/workspace/test-suite-verify-machineinstrs-x86_64-O3/test-suite-build/tools/timeit --summary SingleSource/Regression/C/gcc-c-torture/execute/GCC-C-execute-920501-8.link.time /Users/buildslave/jenkins/workspace/test-suite-verify-machineinstrs-x86_64-O3/compiler/bin/clang -B /Applications/Xcode.app/Contents/Developer/Toolchains/XcodeDefault.xctoolchain/usr/bin    -Wno-unused-command-line-argument -mllvm -verify-machineinstrs -O3 -arch x86_64 -isysroot /Applications/Xcode.app/Contents/Developer/Platforms/MacOSX.platform/Developer/SDKs/MacOSX10.14.sdk -Wl,-search_paths_first -Wl,-headerpad_max_install_names -B /Applications/Xcode.app/Contents/Developer/Toolchains/XcodeDefault.xctoolchain/usr/bin SingleSource/Regression/C/gcc-c-torture/execute/CMakeFiles/GCC-C-execute-920501-8.dir/920501-8.c.o  -o SingleSource/Regression/C/gcc-c-torture/execute/GCC-C-execute-920501-8  -Wl,-no_pie -Wl,-u,_printf_float && :
FAILED: SingleSource/Regression/C/gcc-c-torture/execute/GCC-C-execute-920501-8 
: && /Users/buildslave/jenkins/workspace/test-suite-verify-machineinstrs-x86_64-O3/test-suite-build/tools/timeit --summary SingleSource/Regression/C/gcc-c-torture/execute/GCC-C-execute-920501-8.link.time /Users/buildslave/jenkins/workspace/test-suite-verify-machineinstrs-x86_64-O3/compiler/bin/clang -B /Applications/Xcode.app/Contents/Developer/Toolchains/XcodeDefault.xctoolchain/usr/bin    -Wno-unused-command-line-argument -mllvm -verify-machineinstrs -O3 -arch x86_64 -isysroot /Applications/Xcode.app/Contents/Developer/Platforms/MacOSX.platform/Developer/SDKs/MacOSX10.14.sdk -Wl,-search_paths_first -Wl,-headerpad_max_install_names -B /Applications/Xcode.app/Contents/Developer/Toolchains/XcodeDefault.xctoolchain/usr/bin SingleSource/Regression/C/gcc-c-torture/execute/CMakeFiles/GCC-C-execute-920501-8.dir/920501-8.c.o  -o SingleSource/Regression/C/gcc-c-torture/execute/GCC-C-execute-920501-8  -Wl,-no_pie -Wl,-u,_printf_float && :
Undefined symbols for architecture x86_64:
link error
: && /Users/buildslave/jenkins/workspace/test-suite-verify-machineinstrs-x86_64-O3/test-suite-build/tools/timeit --summary SingleSource/Regression/C/gcc-c-torture/execute/GCC-C-execute-920501-8.link.time /Users/buildslave/jenkins/workspace/test-suite-verify-machineinstrs-x86_64-O3/compiler/bin/clang -B /Applications/Xcode.app/Contents/Developer/Toolchains/XcodeDefault.xctoolchain/usr/bin    -Wno-unused-command-line-argument -mllvm -verify-machineinstrs -O3 -arch x86_64 -isysroot /Applications/Xcode.app/Contents/Developer/Platforms/MacOSX.platform/Developer/SDKs/MacOSX10.14.sdk -Wl,-search_paths_first -Wl,-headerpad_max_install_names -B /Applications/Xcode.app/Contents/Developer/Toolchains/XcodeDefault.xctoolchain/usr/bin SingleSource/Regression/C/gcc-c-torture/execute/CMakeFiles/GCC-C-execute-920501-8.dir/920501-8.c.o  -o SingleSource/Regression/C/gcc-c-torture/execute/GCC-C-execute-920501-8  -Wl,-no_pie -Wl,-u,_printf_float && :
Undefined symbols for architecture x86_64:
  "_printf_float", referenced from:
     -u command line option
ld: symbol(s) not found for architecture x86_64
clang-10: error: linker command failed with exit code 1 (use -v to see invocation)
[7261/7684] /Users/buildslave/jenkins/workspace/test-suite-verify-machineinstrs-x86_64-O3/test-suite-build/tools/timeit --summary SingleSource/Regression/C/gcc-c-torture/execute/CMakeFiles/GCC-C-execute-pr43560.dir/pr43560.c.o.time /Users/buildslave/jenkins/workspace/test-suite-verify-machineinstrs-x86_64-O3/compiler/bin/clang -DNDEBUG  -B /Applications/Xcode.app/Contents/Developer/Toolchains/XcodeDefault.xctoolchain/usr/bin    -Wno-unused-command-line-argument -mllvm -verify-machineinstrs -O3 -arch x86_64 -isysroot /Applications/Xcode.app/Contents/Developer/Platforms/MacOSX.platform/Developer/SDKs/MacOSX10.14.sdk   -w -Werror=date-time -w -MD -MT SingleSource/Regression/C/gcc-c-torture/execute/CMakeFiles/GCC-C-execute-pr43560.dir/pr43560.c.o -MF SingleSource/Regression/C/gcc-c-torture/execute/CMakeFiles/GCC-C-execute-pr43560.dir/pr43560.c.o.d -o SingleSource/Regression/C/gcc-c-torture/execute/CMakeFiles/GCC-C-execute-pr43560.dir/pr43560.c.o   -c /Users/buildslave/jenkins/workspace/test-suite-verify-machineinstrs-x86_64-O3/test-suite/SingleSource/Regression/C/gcc-c-torture/execute/pr43560.c
[7262/7684] : && /Users/buildslave/jenkins/workspace/test-suite-verify-machineinstrs-x86_64-O3/test-suite-build/tools/timeit --summary SingleSource/Regression/C/gcc-c-torture/execute/GCC-C-execute-pr84521.link.time /Users/buildslave/jenkins/workspace/test-suite-verify-machineinstrs-x86_64-O3/compiler/bin/clang -B /Applications/Xcode.app/Contents/Developer/Toolchains/XcodeDefault.xctoolchain/usr/bin    -Wno-unused-command-line-argument -mllvm -verify-machineinstrs -O3 -arch x86_64 -isysroot /Applications/Xcode.app/Contents/Developer/Platforms/MacOSX.platform/Developer/SDKs/MacOSX10.14.sdk -Wl,-search_paths_first -Wl,-headerpad_max_install_names -B /Applications/Xcode.app/Contents/Developer/Toolchains/XcodeDefault.xctoolchain/usr/bin SingleSource/Regression/C/gcc-c-torture/execute/CMakeFiles/GCC-C-execute-pr84521.dir/pr84521.c.o  -o SingleSource/Regression/C/gcc-c-torture/execute/GCC-C-execute-pr84521  -Wl,-no_pie && :

Build Log

Changes
  1. [ARM][LowOverheadLoops] Remove dead loop update instructions. (details)
  2. [lldb][NFC] Cleanup includes in FormatManagerTests.cpp (details)
  3. [Clang] Pragma vectorize_width() implies vectorize(enable) (details)
  4. [PowerPC][NFC] add test case for lwa - loop ds form prep (details)
  5. [AArch64][SVE] Implement intrinsics for non-temporal loads & stores (details)
  6. [clang-tidy] Link shared library clangTidyOpenMPModule to library (details)
  7. [Analyzer][NFC] Iterator Checkers - Separate iterator modeling and the (details)
  8. [TableGen] Add bang-operators !getop and !setop. (details)
  9. Revert "Reland [AArch64][MachineOutliner] Return address signing for (details)
  10. [llvm-readobj][llvm-readelf] - Remove excessive empty lines when (details)
  11. [ARM][MVE] Factor out an IntrinsicMX multiclass. (details)
  12. gn build: Merge afb13afcf22 (details)
  13. CodeGen: Allow annotations on globals in non-zero address space (details)
  14. [SYCL] Add support for auxiliary triple specification to Frontend (details)
  15. [AArch64][SVE] Add DAG combine rules for gather loads and sext/zext (details)
  16. [lldb][NFC] Remove ClangExternalASTSourceCommon::g_TotalSizeOfMetadata (details)
  17. [Analyzer] Iterator Modeling: Print Container Data and Iterator (details)
  18. Rollback assumeAligned in MemorySanitizer (details)
  19. [lldb][NFC] Remove dead metadata code in ClangASTSourceProxy (details)
  20. [DebugInfo] Fix printing of DW_LNS_set_isa (details)
  21. [Alignment][NFC] Introduce Align in IRBuilder (details)
  22. [test][llvm-dwarfdump] Add missing testing for some --debug-* options (details)
  23. Removing an unused selection field from a diagnostic; NFC. (details)
  24. [AArch64] Teach Load/Store optimizier to rename store operands for (details)
  25. Revert "[AArch64][SVE] Implement intrinsics for non-temporal loads & (details)
  26. [lldb] Don't search the metadata map three times when retrieving (details)
  27. [LLD][ELF][AArch64][ARM] Add missing classof to patch sections. (details)
  28. [LLD][ELF][AArch64][ARM] When errata patching, round thunk size to 4KiB. (details)
  29. AMDGPU: Fix copy-pasted test name error (details)
  30. [Analyzer] Iterator Checkers: Replace `UnknownVal` in comparison result (details)
  31. Verifier: Check frame-pointer attribute values (details)
  32. [ARM][NFC] Change test to use CHECK-NEXT (details)
  33. [Support] Add TimeTraceScope constructor without detail arg (details)
  34. [Loop] Add isRotated method to Loop class. (details)
  35. [SystemZ] Fix 128-bit strict FMA expansion pre-z14 (details)
  36. [TableGen] Remove unused target intrinsic generation logic (details)
  37. [X86] Erase dead LEA instruction after converting it to MOV in (details)
  38. [SystemZ] Add llvm.minimum / llvm.maximum tests (details)
  39. [AArch64] Skip debug ops with regsOverlap in AArch64 LD/ST opt. (details)
  40. Don't run expect based tests remotely. (details)
  41. [DA] Improve dump to show source and sink of the dependence (details)
  42. update TestThreadStepOut.py to expect correct source line on arm64. (details)
  43. [ELF][AArch64] Rename --force-bti to -z force-bti and --pac-plt to -z (details)
  44. Remove TypeValidators (NFC in terms of the testsuite) (details)
  45. [OPENMP50]Add if clause in teams distribute simd directive. (details)
  46. [VFS] Extend virtual working directory test (details)
  47. [profile] Delete stale profile in test/profile/instrprof-set-filename.c, (details)
  48. [profile] Delete stale profiles in (details)
  49. [profile] Avoid allocating a page on the stack, NFC (details)
  50. [OPENMP50]Fix capturing of if condition in target parallel for simd (details)
  51. [SDAG] remove use restriction in isNegatibleForFree() when called from (details)
  52. [StringRef] Test all default characters in unit test (details)
  53. [AArch64] Be more careful to skip debug operands in LdSt Optimizier. (details)
  54. [VFS] Disable check for ../foo on Windows (details)
  55. Add intrinsics for unary narrowing operations (details)
  56. Fix -Wunused-variable in -DLLVM_ENABLE_ASSERTIONS=Off builds after (details)
  57. [MergeFuncs] Remove incorrect attribute copying (details)
  58. [analyzer] CStringChecker: Improve warning messages. (details)
  59. [analyzer] CStringChecker: Fix overly eager assumption that memcmp args (details)
  60. [analyzer] LocalizationChecker: Fix a crash on synthesized accessor (details)
  61. [ValueTracking] Add tests for non-null check after load/store; NFC (details)
  62. [ValueTracking] Pointer is known nonnull after load/store (details)
  63. [analyzer] Escape symbols conjured into specific regions during a (details)
  64. [InstCombine] Optimize overflow check base on uadd.with.overflow result (details)
  65. [WebAssembly] Add new `export_name` clang attribute for controlling wasm (details)
  66. return-object-by-reference ("non trivial") xfail on arm64 in (details)
  67. [OpenMP] Introduce the OpenMP-IR-Builder (details)
  68. [ADT] Fix SmallDenseMap assertion with large InlineBuckets (details)
  69. [libc++] Add fuzzing tests for parts of <random>. (details)
  70. [LegalizeTypes] In SoftenFloatRes_FP_EXTEND, move the check for input (details)
  71. [TSan] Pacify flaky test on Darwin (details)
  72. [OPENMP50]Add if clause in teams distribute parallel for simd directive. (details)
  73. [libc++] Fix fuzzing unit tests with exceptions disabled. (details)
  74. Add resurrecting Type Validators to projects.rst (details)
  75. [libc++] Fix fuzzing tests with older GCC compilers. (details)
  76. [lldb][dotest] Improve libc++ detection (details)
  77. Revert "[SDAG] remove use restriction in isNegatibleForFree() when (details)
  78. Fix detection of __attribute__((may_alias)) to properly look through (details)
  79. [lldb][dotest] Add `#include <algorithm>` to libc++ detection (details)
  80. [lldb/Host] Use Host/Config.h for LibXML2 instead of a global define (details)
  81. Don't call export_symbols.py with duplicate libs (details)
  82. Suppress false-positive -Wuninitialized warnings in the constructor of a (details)
  83. [lldb/CMake] Simplify linking against curses (details)
  84. [lit] Improve formatting of error messages. NFC (details)
  85. [clang][clang-scan-deps] Aggregate the full dependency information. (details)
  86. [OpenMP] Use the OpenMP-IR-Builder (details)
  87. Revert "[DWARF] Allow cross-CU references of subprogram definitions" (details)
  88. Revert "[clang][clang-scan-deps] Aggregate the full dependency (details)
  89. [AArch64][x86] add tests for possible infinite loops in DAGCombiner; NFC (details)
  90. [analyzer] Do not cache out on some shared implicit AST nodes (details)
  91. [libc++] Require C++14 in all cases. (details)
  92. [libc++abi] Fix non-constant initialization of default terminate (details)
  93. gn build: (manually) merge d23c61490c (details)
  94. [Remarks][Driver] Ask for line tables when remarks are enabled (details)
  95. Rename TTI::getIntImmCost for instructions and intrinsics (details)
  96. [IR] Split out target specific intrinsic enums into separate headers (details)
  97. [AArch64][SVE] Add patterns for scalable vselect (details)
  98. [llvm][MIRVRegNamerUtils] Adding hashing on memoperands. (details)
  99. gn build: (manually) merge 5d986953c8b917bacfaa1f800fc1e242559f76be (details)
  100. [AutoFDO] Statistic for context sensitive profile guided inlining (details)
  101. [OpenMP][Docs] Mark 5.0 features worked on and list 5.1 features (details)
  102. [Syntax] Build nodes for simple cases of top level declarations (details)
  103. Fix an error in the block ABI documentation sample code (details)
  104. [ARM][MVE] Sink vector shift operand (details)
  105. [libc++] Fix -Wdeprecated-copy warnings in __bit_reference (details)
  106. Revert "[ARM][MVE] Sink vector shift operand" (details)
  107. [DWARF5][DWARFVerifier] Check that Skeleton compilation unit does not (details)
  108. Temporarily Revert "[libc++] Fix -Wdeprecated-copy warnings in (details)
  109. [compiler-rt] Add a critical section when flushing gcov counters (details)
  110. Revert unintentional change to compiler-rt as part of the (details)
  111. [NFC][llvm][MIRVRegNamerUtils] Moving methods around. Making some (details)
  112. [llvm-readobj][test] - Cleanup and split tests in tools/llvm-readobj (details)
  113. [libomptarget][nfc] Add missing header for amdgcn/target_impl (details)
  114. [AArch64][SVE] Remove nxv1f32 and nxv1f64 as legal types (details)
  115. [Tooling] Move raw string literal out of a macro call. NFC (details)
  116. [DataLayout] Fix occurrences that size and range of pointers are assumed (details)
  117. [lldb][NFC] Don't implement ClangASTContext::SetMetadata again as a (details)
  118. [NFC] - Typo fix in test/CodeGenCXX/runtime-dllstorage.cpp (details)
  119. Temporarily Revert "[DataLayout] Fix occurrences that size and range of (details)
  120. [Mips] Add support for min/max/umin/umax atomics (details)
  121. [clangd] Fix hover crashing on null types (details)
  122. [lldb] "See through" atomic types in ClangASTContext (details)
  123. [lldb] Remove ClangASTMetrics (details)
  124. [llvm-readobj][test] - Add a test for testing regular section flags and (details)
  125. [NFC] - Partially revert 9c48c2f9c477007234c (details)
  126. [clangd] Fix windows tests (details)
  127. [Tooling/Syntax] Helpers to find spelled tokens touching a location. (details)
  128. [Support] Extend TimeProfiler to support multiple threads (details)
  129. [clangd] Rename constructors and destructors in cross-file case (details)
  130. [Support] Try to fix bot failure after 8ddcd1dc26 (details)
  131. [DebugInfo] Prevent invalid fragments at ISel from dropping debug info (details)
  132. [Analyzer][Docs][NFC] Add CodeChecker to the command line tools (details)
  133. [Attributor][NFC] Refactoring `AANoFreeArgument::updateImpl` (details)
  134. [Attributor] [NFC] Use `checkForAllUses` helpr in (details)
  135. [Attributor][NFC] Fix comments and unnecessary comma (details)
  136. [NFC][ARM] Add some test triples (details)
  137. [Diagnsotics] Small Improvement on -Wmisleading-indentation (details)
  138. [clangd] Implement "textDocument/documentLink" protocol support (details)
  139. [llvm-dwarfdump] Add blank line after printing line table (details)
  140. [lldb/DWARF] Fix v5 location lists for dwo files (details)
  141. [ARM][MVE] Sink vector shift operand (details)
  142. [OpenMP][Test] Add check for aux-triple predefined macros (details)
  143. AMDGPU/SILoadStoreOptimizer: Simplify function (details)
  144. [ARM][CMSE] Add CMSE header and builtins (details)
  145. gn build: Merge 600d123c6ff (details)
  146. [Alignment][NFC] Adding Align compatible methods to (details)
  147. [ARM][MVE] findVCMPToFoldIntoVPS. NFC. (details)
  148. [Matrix] Add first set of matrix intrinsics and initial lowering pass. (details)
  149. gn build: Merge 526244b187d (details)
  150. Fix naming style. NFC. (details)
  151. [clang-tidy] Use early returns to make the code easier to read and (details)
  152. [clang] Turn -fno-builtin flag into an IR Attribute (details)
  153. [amdgpu] Fix `-Wenum-compare` warning. NFC. (details)
  154. [ASTImporter] Support functions with placeholder return types ... (details)
  155. [fuzzer] Add basic support for emscripten. (details)
  156. [lldb/CMake] Rename LLDB_DISABLE_CURSES to LLDB_ENABLE_CURSES (details)
  157. [BasicAA] Use GEP as context for computeKnownBits in aliasGEP. (details)
  158. [lldb/CMake] Rename LLDB_DISABLE_LIBEDIT to LLDB_ENABLE_LIBEDIT (details)
  159. [ELF] Add a comment to handleSectionGroup(). NFC (details)
  160. [lldb/Host] Use cmakedefine01 for LLDB_ENABLE_LIBXML2 (details)
  161. [lldb/Host] Use cmakedefine01 for LLDB_ENABLE_TERMIOS (details)
  162. [AArch64][PowerPC] add tests for shift sandwich; NFC (details)
  163. [lldb/Core] Add missing include (details)
  164. [lldb/Core] Add missing include (2/2) (details)
  165. [DAGCombiner] improve readability (details)
  166. [FormatEntity] Add mangled function name support (details)
  167. [SystemZ]  Implement the packed stack layout (details)
  168. Default to -fuse-init-array (details)
  169. [PS4] Predefine the __SCE__ macro for the x86_64-scei-ps4 triple (details)
  170. [compiler-rt] libFuzzer: update -merge_control_file= help message. (details)
  171. Rename LoopInfo::isRotated() to LoopInfo::isRotatedForm(). (details)
  172. Suppress -Wwarn-unused-variables when we don't know the constructor (details)
  173. TypeCategory: Initialize m_enabled to false (details)
  174. [AMDGPU] AMDGPUUsage clarify address space information and other typo (details)
  175. [Target] Remove Target::GetScratchClangASTContext (details)
  176. [OPENMP50]Improve checks for declare variant functions compatibility. (details)
  177. [LTO] Support for embedding bitcode section during LTO (details)
  178. [libc++] Add check to ensure oss-fuzz properly targets libc++. (details)
  179. [DAGCombiner] fold shift-trunc-shift to shift-mask-trunc (details)
  180. [OPENMP50]Fix possible conflict when emitting an alias for the functions (details)
  181. [sanitizers] Redirect stdout and stderr to TASK_LOG (details)
  182. [clang] [test] Disable the test exhausting stack on NetBSD (details)
  183. Revert "[DAGCombiner] fold shift-trunc-shift to shift-mask-trunc" (details)
  184. [NFC][InstSimplify] Refactoring ThreadCmpOverSelect function (details)
  185. [Attributor][FIX] Do treat byval arguments special (details)
  186. [libc++] Tolerate NaN returning random distributions for now (details)
  187. [clangd] Heuristically resolve dependent method calls (details)
  188. [AArch64][SVE] Add integer arithmetic with immediate instructions. (details)
  189. Update line number after previous patch added an additional unsupported (details)
  190. [libomptarget] Move resource id functions into target specific code, (details)
  191. [IR] Include target specific intrinsic headers (details)
  192. [libomptarget][nfc] Add declarations of atomic functions for amdgcn (details)
  193. hwasan: add tag_offset DWARF attribute to optimized debug info (details)
  194. __bit_reference: fix -Wdeprecated-copy warnings (details)
  195. NFC: DebugInfo: Refactor debug_loc/loclist emission into a common (details)
  196. NFC: DebugInfo: Refactor RangeSpanList to be a struct, like (details)
  197. Fix test to work correctly on 32-bit platforms. (details)
  198. [clangd] Fix Windows test failure by adding (details)
  199. [iOS sim] Simplify iossim_run.py script (details)
  200. Temporarily revert "NFC: DebugInfo: Refactor RangeSpanList to be a (details)
  201. [libc++] Cleanup and enable multiple warnings. (details)
  202. [libc++] Mark all fuzzing tests as unsupported in C++03 (details)
  203. [NFC][AArch64] Fix typo. (details)
  204. Remove extra character I added to test my changes that I forgot to (details)
  205. [libcxx] [test] Fix valarray UB and MSVC warnings. (details)
  206. Correct inf typo (details)
  207. temporary (details)
  208. Update the man page (details)
  209. Revert an accidental commit af5ca40b47b3e85c3add81ccdc0b787c4bc355ae (details)
  210. [lldb] Remove xpasses after pr44037 fix committed (details)
  211. Reapply [LVI] Normalize pointer behavior (details)
  212. [LegalizeTypes] Remove unnecessary if before calling ReplaceValueWith on (details)
  213. [llvm-readobj] - Fix letters used for dumping section types in GNU (details)
  214. [yaml2obj] - Add a way to override sh_flags section field. (details)
  215. [clangd] Introduce paragraph, the first part of new rendering structs (details)
  216. [clangd] Introduce codeblocks (details)
  217. [clangd] Add "inline" keyword to prevent ODR-violations in DefineInline (details)
  218. [lldb/cmake] Temporarily revive LLDB_DISABLE_CURSES (details)
  219. [clangd] Fix windows builds (details)
  220. [LiveDebugValues] Omit entry values for DBG_VALUEs with pre-existing (details)
  221. Recommit "[AArch64][SVE] Implement intrinsics for non-temporal loads & (details)
  222. [lldb][NFC] Make metadata tracking type safe (details)
  223. [lldb][NFC] Add reminder to TestSampleTest that setUp should be deleted (details)
  224. [Docs] Fix target feature matrix for PowerPC and SystemZ (details)
  225. [lldb][NFC] Remove 'from __future__ import print_function' from all (details)
  226. [lldb][NFC] Remove unused includes in Utility's source files (details)
  227. [lldb][NFC] Remove all `setUp` overrides that only call the parent (details)
  228. [ARM][MVE][Intrinsics] Add *_x() variants of my *_m() intrinsics. (details)
  229. Revert "[ARM][MVE] findVCMPToFoldIntoVPS. NFC." (details)
  230. [ELF] Allow getErrPlace() to work before Out::bufferStart is set (details)
  231. [NFC] Use EVT instead of bool for getSetCCInverse() (details)
  232. [Sema] Improve diagnostic about addr spaces for overload candidates (details)
  233. [llvm-locstats] Avoid the locstats when no scope bytes coverage found (details)
  234. Revert "AMDGPU: Try to commute sub of boolean ext" (details)
  235. [ARM] Add custom strict fp conversion lowering when non-strict is custom (details)
  236. [ARM][MVE] Add intrinsics for more immediate shifts. (details)
  237. [llvm-dwarfdump][Statistics] Change the coverage buckets representation. (details)
  238. [ARM][MVE] Add vector reduction intrinsics with two vector operands (details)
  239. [x86] add tests for shift-trunc-shift; NFC (details)
  240. [libomptarget][nfc] Add nop syncwarp function for amdgcn (details)
  241. Reland [DataLayout] Fix occurrences that size and range of pointers are (details)
  242. [llvm-dwarfdump][Statistics] Don't count coverage less than 1% as 0% (details)
  243. [ARM][MVE] Make VPT invalid for tail predication (details)
  244. [ARM][MVE][Intrinsics] remove extraneous intrinsics. (details)
  245. [Tooling/Syntax] Helpers to find spelled tokens touching a location. (details)
  246. [clangd] Fall back to selecting token-before-cursor if (details)
  247. [llvm-exegesis][mips] Add BenchmarkResultTest unit test (details)
  248. Revert "[ARM][MVE][Intrinsics] remove extraneous intrinsics." (details)
  249. gn build: Merge 84728e65e95 (details)
  250. [ARM][MVE][Intrinsics] remove extraneous intrinsics. (Reapply) (details)
  251. [Scudo] [GWP-ASan] Add GWP-ASan to Scudo Standalone. (details)
  252. [ELF] Update st_size when merging a common symbol with a shared symbol (details)
  253. [ARM][MVE] Fix -Wunused-variable in -DLLVM_ENABLE_ASSERTIONS=Off builds (details)
  254. [ARM][MVE][Intrinsics] All vqdmulhq/vqrdmulhq tests should be for signed (details)
  255. [MC][PowerPC] Fix a crash when redefining a symbol after .set (details)
  256. [AArch64] Emit PAC/BTI .note.gnu.property flags (details)
  257. Revert "[ELF] Allow getErrPlace() to work before Out::bufferStart is (details)
  258. [GWP-ASan] [Scudo] ifdef entire GWP-ASan tests. (details)
  259. [libomptarget] Build most of common/src for amdgcn (details)
  260. [lldb/Host] Use cmakedefine01 for LLDB_ENABLE_POSIX (details)
  261. [lldb/Test] C++ test should use CXXFLAGS_EXTRAS (details)
  262. gn docs: remove obsolete reference to monorepo (details)
  263. [ARM] Fix in ICE when retrieving the number of micro-ops for vlldm/vlstm (details)
  264. [NFC] Guard scudo_standalone's optional dependency on GWP-ASan behind (details)
  265. [PGO][PGSO] Enable size optimizations in code gen / target passes for (details)
  266. [DAGCombiner] fold shift-trunc-shift to shift-mask-trunc (2nd try) (details)
  267. [InstSimplify] improve test coverage for insert+splat; NFC (details)
  268. [profile] Fix a crash when -fprofile-remapping-file= triggers an error (details)
  269. Revert "[VectorUtils] Introduce the Vector Function Database (details)
  270. [RISCV] Move DebugLoc Copy into CompressInstEmitter (details)
  271. Correct gcc vector splat conversion from float to int-vector (details)
  272. LanguageRuntime: Simplify NSException::GetSummary() output (details)
  273. [libc++] Ensure __config always defines certain configuration macros. (details)
  274. Fix -Wswitch-coverage warning in clang-tidy after ak_addrspace (details)
  275. Call objc_retainBlock before passing a block as a variadic argument (details)
  276. Revert "[libomptarget] Move resource id functions into target specific (details)
  277. [NFC] Change SelectionDAG::getMemBasePlusOffset() to use int64_t (details)
  278. [NFC] Add a SDValue overload for SelectionDAG::getMemBasePlusOffset() (details)
  279. [NFC] Implement SelectionDAG::getObjectPtrOffset() using (details)
  280. [NFC] Use SelectionDAG::getMemBasePlusOffset() instead of (details)
  281. [LSAN] Increase stack space for guard-page.c test (details)
  282. [lldb/CMake] Rename LLDB_DISABLE_PYTHON to LLDB_ENABLE_PYTHON (details)
  283. [lldb/CMake] Initialize LLDB_ENABLE_POSIX based on the UNIX variable. (details)
  284. [OPENMP]Fix skipping of functions body. (details)
  285. [Driver] Use .init_array for all gcc installations and simplify (details)
  286. [lldb/SWIG] Modulerize lldb.swig so parts of it can be reused. (details)
  287. [ubsan] Enable testing of .m files (details)
  288. [Legalizer] More detailed debugging printing in main loop (details)
  289. [Legalizer] Refactoring out legalizeMachineFunction (details)
  290. [Legalizer] Making artifact combining order-independent (details)
  291. [Mips] Fix gcc -Wunused-but-set-variable in -DLLVM_ENABLE_ASSERTIONS=Off (details)
  292. [OpenMP][Docs] Claim loop tiling. (details)
  293. [lit] Small cleanups. NFCI (details)
  294. [PowerPC] Add Support for indirect calls on AIX. (details)
  295. [analyzer] CStringChecker: Fix a crash on unknown value passed to (details)
  296. [libcxx] [test] Include missing headers. (NFC) (details)
  297. [c++20] Improve phrasing of diagnostic for missing #include <compare>. (details)
  298. PR44268: Fix crash if __builtin_object_size is applied to a heap (details)
  299. [Driver] Default to -momit-leaf-frame-pointer for AArch64 (details)
  300. [AArch64] Save FP for leaf functions when disabling frame pointer (details)
  301. [clang] Move CLANG_BOOTSTRAP_CMAKE_ARGS above PASSTHROUGH_VARIABLES (details)
  302. gn build: add deps I failed to add in b2508ce85c1 (details)
  303. [Attributor] Reuse the IPConstantProp tests for the Attributor (details)
  304. [Attributor] Only replace instruction operands (details)
  305. [NFC] Rename ClangASTEmitters.h -> ASTTableGen.h (details)
  306. [NFC] Correct accidental use of tabs. (details)
  307. Introduce some types and functions to make it easier to work with the (details)
  308. Add a function to get the ExceptionSpecInfo of a function type; NFC. (details)
  309. Extract out WrappedRecord as a convenience base class; NFC. (details)
  310. Enable better node-hierarchy metaprogramming; NFC. (details)
  311. Extract the TypeClass <-> TypeCode map into a .def file; NFC. (details)
  312. Standardize the reader methods in ASTReader; NFC. (details)
  313. Abstract serialization: TableGen "basic" reader/writer CRTP classes that (details)
  314. Abstract serialization: TableGen the (de)serialization code for Types. (details)
  315. [Attributor][NFC] Simplify debug printing for abstract attributes (details)
  316. [Attributor][NFC] Reorder test functions (details)
  317. [Attributor][NFC] Add more simple test situations for callbacks (details)
  318. [Attributor] Annotate call sites of declarations with a callback (details)
  319. MSVC build fix: forget some unneeded and incorrect friends. (details)
  320. [ArgPromo][Tests] Run update_test_checks on all ArgumentPromotion tests (details)
  321. [Attributor][Tests] Copy & use the ArgumentPromotion tests (details)
  322. [NFC][llvm][MIRVRegNamerUtils] Refactoring GetHashableMO into (details)
  323. Move ASTRecordReader into its own header; NFC. (details)
  324. Move ASTRecordWriter into its own header; NFC. (details)
  325. gn build: (manually) merge 6404bd236 and d505e57cc2 (details)
  326. Revert "[clangd] Fall back to selecting token-before-cursor if (details)
  327. gn build: Merge 91dd67ef724 (details)
  328. Fix build with older (still supported) gcc versions. (details)
  329. [AArch64] add tests for fcvtl2; NFC (details)
  330. [clang] Fix modules build after addition of TypeBitCodes.def (details)
  331. [AArch64][test] Fix machine-outliner-size-info.mir after D71168 (details)
  332. [perf-training] Make training data location configurable (details)
  333. AArch64: Fix frame record chain (details)
  334. gn build: (manually and belatedly) merge ed153ef044fd (details)
  335. Revert "AArch64: Fix frame record chain" (details)
  336. [cxx_status] Fix paper number for "Concept auto" paper. (details)
  337. [LegalizeTypes] In PromoteFloatOp_SETCC, don't both querying for (details)
  338. [LegalizeTypes] Teach BitcastToInt_ATOMIC_SWAP to only create FP16_TO_FP (details)
  339. [IR] Include more target specific intrinsic headers (details)

Started by upstream project relay-test-suite-verify-machineinstrs build number 6869
originally caused by:

This run spent:

  • 1 hr 44 min waiting;
  • 2 hr 11 min build duration;
  • 2 hr 11 min total from scheduled to completion.
Revision: 0133dc3983c2ed477a198d414d5d7ad4b95db549
  • detached

Identified problems

Ninja target failed

Below is a link to the first failed ninja target.
Indication 1

Compile Error

This build failed because of a compile error. Below is a list of all errors in the build log:
Indication 2

Link error

A link command has failed:
Indication 3