AbortedConsole Output

Skipping 4,163 KB.. Full Log
of 1699)
******************** TEST 'lldb-Unit :: ScriptInterpreter/Python/./ScriptInterpreterPythonTests/PythonDataObjectsTest.TestPythonTupleValues' FAILED ********************

Hide Details

******************** FAIL: lldb-Unit :: ScriptInterpreter/Python/./ScriptInterpreterPythonTests/PythonDataObjectsTest.TestResetting (1166 of 1699) ******************** TEST 'lldb-Unit :: ScriptInterpreter/Python/./ScriptInterpreterPythonTests/PythonDataObjectsTest.TestResetting' FAILED ********************

Hide Details

******************** FAIL: lldb-Unit :: ScriptInterpreter/Python/./ScriptInterpreterPythonTests/PythonDataObjectsTest.TestTypeNameResolutionNoDot (1167 of 1699) ******************** TEST 'lldb-Unit :: ScriptInterpreter/Python/./ScriptInterpreterPythonTests/PythonDataObjectsTest.TestTypeNameResolutionNoDot' FAILED ********************

Hide Details

******************** FAIL: lldb-Unit :: ScriptInterpreter/Python/./ScriptInterpreterPythonTests/PythonExceptionStateTest.TestAcquisitionSemantics (1168 of 1699) ******************** TEST 'lldb-Unit :: ScriptInterpreter/Python/./ScriptInterpreterPythonTests/PythonExceptionStateTest.TestAcquisitionSemantics' FAILED ********************

Hide Details

******************** FAIL: lldb-Unit :: ScriptInterpreter/Python/./ScriptInterpreterPythonTests/PythonExceptionStateTest.TestAutoRestoreChanged (1169 of 1699) ******************** TEST 'lldb-Unit :: ScriptInterpreter/Python/./ScriptInterpreterPythonTests/PythonExceptionStateTest.TestAutoRestoreChanged' FAILED ********************

Hide Details

******************** FAIL: lldb-Unit :: ScriptInterpreter/Python/./ScriptInterpreterPythonTests/PythonExceptionStateTest.TestAutoRestoreSemantics (1170 of 1699) ******************** TEST 'lldb-Unit :: ScriptInterpreter/Python/./ScriptInterpreterPythonTests/PythonExceptionStateTest.TestAutoRestoreSemantics' FAILED ********************

Hide Details

******************** FAIL: lldb-Unit :: ScriptInterpreter/Python/./ScriptInterpreterPythonTests/PythonExceptionStateTest.TestDiscardSemantics (1171 of 1699) ******************** TEST 'lldb-Unit :: ScriptInterpreter/Python/./ScriptInterpreterPythonTests/PythonExceptionStateTest.TestDiscardSemantics' FAILED ********************

Hide Details

******************** FAIL: lldb-Unit :: ScriptInterpreter/Python/./ScriptInterpreterPythonTests/PythonExceptionStateTest.TestExceptionStateChecking (1172 of 1699) ******************** TEST 'lldb-Unit :: ScriptInterpreter/Python/./ScriptInterpreterPythonTests/PythonExceptionStateTest.TestExceptionStateChecking' FAILED ********************

Hide Details

******************** FAIL: lldb-Unit :: ScriptInterpreter/Python/./ScriptInterpreterPythonTests/PythonExceptionStateTest.TestManualRestoreSemantics (1173 of 1699) ******************** TEST 'lldb-Unit :: ScriptInterpreter/Python/./ScriptInterpreterPythonTests/PythonExceptionStateTest.TestManualRestoreSemantics' FAILED ********************

Hide Details

******************** FAIL: lldb-Unit :: ScriptInterpreter/Python/./ScriptInterpreterPythonTests/PythonExceptionStateTest.TestResetSemantics (1174 of 1699) ******************** TEST 'lldb-Unit :: ScriptInterpreter/Python/./ScriptInterpreterPythonTests/PythonExceptionStateTest.TestResetSemantics' FAILED ********************

Hide Details

******************** FAIL: lldb-Unit :: Signals/./SignalsTests/UnixSignalsTest.GetFilteredSignals (1175 of 1699) ******************** TEST 'lldb-Unit :: Signals/./SignalsTests/UnixSignalsTest.GetFilteredSignals' FAILED ********************

Hide Details

******************** FAIL: lldb-Unit :: Signals/./SignalsTests/UnixSignalsTest.GetInfo (1176 of 1699) ******************** TEST 'lldb-Unit :: Signals/./SignalsTests/UnixSignalsTest.GetInfo' FAILED ********************

Hide Details

******************** FAIL: lldb-Unit :: Signals/./SignalsTests/UnixSignalsTest.Iteration (1177 of 1699) ******************** TEST 'lldb-Unit :: Signals/./SignalsTests/UnixSignalsTest.Iteration' FAILED ********************

Hide Details

******************** FAIL: lldb-Unit :: Signals/./SignalsTests/UnixSignalsTest.VersionChange (1178 of 1699) ******************** TEST 'lldb-Unit :: Signals/./SignalsTests/UnixSignalsTest.VersionChange' FAILED ********************

Hide Details

******************** FAIL: lldb-Unit :: Symbol/./SymbolTests/DWARFCallFrameInfoTest.Basic_dwarf3 (1179 of 1699) ******************** TEST 'lldb-Unit :: Symbol/./SymbolTests/DWARFCallFrameInfoTest.Basic_dwarf3' FAILED ********************

Hide Details

******************** FAIL: lldb-Unit :: Symbol/./SymbolTests/DWARFCallFrameInfoTest.Basic_eh (1180 of 1699) ******************** TEST 'lldb-Unit :: Symbol/./SymbolTests/DWARFCallFrameInfoTest.Basic_eh' FAILED ********************

Hide Details

******************** FAIL: lldb-Unit :: Symbol/./SymbolTests/DWARFCallFrameInfoTest.Basic_dwarf4 (1181 of 1699) ******************** TEST 'lldb-Unit :: Symbol/./SymbolTests/DWARFCallFrameInfoTest.Basic_dwarf4' FAILED ********************

Hide Details

******************** FAIL: lldb-Unit :: Symbol/./SymbolTests/LineEntryTest.GetSameLineContiguousAddressRangeNoInlines (1182 of 1699) ******************** TEST 'lldb-Unit :: Symbol/./SymbolTests/LineEntryTest.GetSameLineContiguousAddressRangeNoInlines' FAILED ********************

Hide Details

******************** FAIL: lldb-Unit :: Symbol/./SymbolTests/LineEntryTest.GetSameLineContiguousAddressRangeNestedInline (1183 of 1699) ******************** TEST 'lldb-Unit :: Symbol/./SymbolTests/LineEntryTest.GetSameLineContiguousAddressRangeNestedInline' FAILED ********************

Hide Details

******************** FAIL: lldb-Unit :: Symbol/./SymbolTests/LineEntryTest.GetSameLineContiguousAddressRangeOneInline (1184 of 1699) ******************** TEST 'lldb-Unit :: Symbol/./SymbolTests/LineEntryTest.GetSameLineContiguousAddressRangeOneInline' FAILED ********************

Hide Details

******************** FAIL: lldb-Unit :: Symbol/./SymbolTests/PostfixExpression.Parse (1185 of 1699) ******************** TEST 'lldb-Unit :: Symbol/./SymbolTests/PostfixExpression.Parse' FAILED ********************

Hide Details

******************** FAIL: lldb-Unit :: Symbol/./SymbolTests/PostfixExpression.ToDWARF (1186 of 1699) ******************** TEST 'lldb-Unit :: Symbol/./SymbolTests/PostfixExpression.ToDWARF' FAILED ********************

Hide Details

******************** FAIL: lldb-Unit :: Symbol/./SymbolTests/TestClangASTContext.TemplateArguments (1187 of 1699) ******************** TEST 'lldb-Unit :: Symbol/./SymbolTests/TestClangASTContext.TemplateArguments' FAILED ********************

Hide Details

******************** FAIL: lldb-Unit :: Symbol/./SymbolTests/SymbolsTest.LocateExecutableSymbolFileForUnknownExecutableAndMissingSymbolFile (1188 of 1699) ******************** TEST 'lldb-Unit :: Symbol/./SymbolTests/SymbolsTest.LocateExecutableSymbolFileForUnknownExecutableAndMissingSymbolFile' FAILED ********************

Hide Details

******************** FAIL: lldb-Unit :: Symbol/./SymbolTests/SymbolsTest.TerminateLocateExecutableSymbolFileForUnknownExecutableAndUnknownSymbolFile (1189 of 1699) ******************** TEST 'lldb-Unit :: Symbol/./SymbolTests/SymbolsTest.TerminateLocateExecutableSymbolFileForUnknownExecutableAndUnknownSymbolFile' FAILED ********************

Hide Details

******************** FAIL: lldb-Unit :: Symbol/./SymbolTests/TestClangASTContext.TestBuiltinTypeForEncodingAndBitSize (1190 of 1699) ******************** TEST 'lldb-Unit :: Symbol/./SymbolTests/TestClangASTContext.TestBuiltinTypeForEncodingAndBitSize' FAILED ********************

Hide Details

******************** FAIL: lldb-Unit :: Symbol/./SymbolTests/TestClangASTContext.TestConvertAccessTypeToAccessSpecifier (1191 of 1699) ******************** TEST 'lldb-Unit :: Symbol/./SymbolTests/TestClangASTContext.TestConvertAccessTypeToAccessSpecifier' FAILED ********************

Hide Details

******************** FAIL: lldb-Unit :: Symbol/./SymbolTests/TestClangASTContext.TestGetBasicTypeFromEnum (1192 of 1699) ******************** TEST 'lldb-Unit :: Symbol/./SymbolTests/TestClangASTContext.TestGetBasicTypeFromEnum' FAILED ********************

Hide Details

******************** FAIL: lldb-Unit :: Symbol/./SymbolTests/TestClangASTContext.TestIsClangType (1193 of 1699) ******************** TEST 'lldb-Unit :: Symbol/./SymbolTests/TestClangASTContext.TestIsClangType' FAILED ********************

Hide Details

******************** FAIL: lldb-Unit :: Symbol/./SymbolTests/TestClangASTContext.TestGetBasicTypeFromName (1194 of 1699) ******************** TEST 'lldb-Unit :: Symbol/./SymbolTests/TestClangASTContext.TestGetBasicTypeFromName' FAILED ********************

Hide Details

******************** FAIL: lldb-Unit :: Symbol/./SymbolTests/TestClangASTContext.TestUnifyAccessSpecifiers (1195 of 1699) ******************** TEST 'lldb-Unit :: Symbol/./SymbolTests/TestClangASTContext.TestUnifyAccessSpecifiers' FAILED ********************

Hide Details

******************** FAIL: lldb-Unit :: Symbol/./SymbolTests/TestClangASTContext.TestRemoveFastQualifiers (1196 of 1699) ******************** TEST 'lldb-Unit :: Symbol/./SymbolTests/TestClangASTContext.TestRemoveFastQualifiers' FAILED ********************

Hide Details

******************** FAIL: lldb-Unit :: Symbol/./SymbolTests/TestClangASTContext.TestRecordHasFields (1197 of 1699) ******************** TEST 'lldb-Unit :: Symbol/./SymbolTests/TestClangASTContext.TestRecordHasFields' FAILED ********************

Hide Details

******************** FAIL: lldb-Unit :: Symbol/./SymbolTests/Type.GetTypeScopeAndBasename (1198 of 1699) ******************** TEST 'lldb-Unit :: Symbol/./SymbolTests/Type.GetTypeScopeAndBasename' FAILED ********************

Hide Details

******************** FAIL: lldb-Unit :: SymbolFile/DWARF/./SymbolFileDWARFTests/SymbolFileDWARFTests.TestAbbrevMissingTerminator (1199 of 1699) ******************** TEST 'lldb-Unit :: SymbolFile/DWARF/./SymbolFileDWARFTests/SymbolFileDWARFTests.TestAbbrevMissingTerminator' FAILED ********************

Hide Details

******************** FAIL: lldb-Unit :: SymbolFile/DWARF/./SymbolFileDWARFTests/SymbolFileDWARFTests.TestAbbrevInvalidNULLTag (1200 of 1699) ******************** TEST 'lldb-Unit :: SymbolFile/DWARF/./SymbolFileDWARFTests/SymbolFileDWARFTests.TestAbbrevInvalidNULLTag' FAILED ********************

Hide Details

******************** FAIL: lldb-Unit :: SymbolFile/DWARF/./SymbolFileDWARFTests/SymbolFileDWARFTests.TestAbbrevOrder1Start1 (1201 of 1699) ******************** TEST 'lldb-Unit :: SymbolFile/DWARF/./SymbolFileDWARFTests/SymbolFileDWARFTests.TestAbbrevOrder1Start1' FAILED ********************

Hide Details

******************** FAIL: lldb-Unit :: SymbolFile/DWARF/./SymbolFileDWARFTests/SymbolFileDWARFTests.TestAbbrevNullAttrValidForm (1202 of 1699) ******************** TEST 'lldb-Unit :: SymbolFile/DWARF/./SymbolFileDWARFTests/SymbolFileDWARFTests.TestAbbrevNullAttrValidForm' FAILED ********************

Hide Details

******************** FAIL: lldb-Unit :: SymbolFile/DWARF/./SymbolFileDWARFTests/SymbolFileDWARFTests.TestAbbrevOutOfOrder (1203 of 1699) ******************** TEST 'lldb-Unit :: SymbolFile/DWARF/./SymbolFileDWARFTests/SymbolFileDWARFTests.TestAbbrevOutOfOrder' FAILED ********************

Hide Details

******************** FAIL: lldb-Unit :: SymbolFile/DWARF/./SymbolFileDWARFTests/SymbolFileDWARFTests.TestAbbrevOrder1Start5 (1204 of 1699) ******************** TEST 'lldb-Unit :: SymbolFile/DWARF/./SymbolFileDWARFTests/SymbolFileDWARFTests.TestAbbrevOrder1Start5' FAILED ********************

Hide Details

******************** FAIL: lldb-Unit :: SymbolFile/DWARF/./SymbolFileDWARFTests/SymbolFileDWARFTests.TestAbilitiesForDWARF (1205 of 1699) ******************** TEST 'lldb-Unit :: SymbolFile/DWARF/./SymbolFileDWARFTests/SymbolFileDWARFTests.TestAbilitiesForDWARF' FAILED ********************

Hide Details

******************** FAIL: lldb-Unit :: SymbolFile/DWARF/./SymbolFileDWARFTests/SymbolFileDWARFTests.TestAbbrevValidAttrNullForm (1206 of 1699) ******************** TEST 'lldb-Unit :: SymbolFile/DWARF/./SymbolFileDWARFTests/SymbolFileDWARFTests.TestAbbrevValidAttrNullForm' FAILED ********************

Hide Details

******************** FAIL: lldb-Unit :: SymbolFile/NativePDB/./SymbolFileNativePDBTests/PDBFPOProgramToDWARFExpressionTests.InvalidAssignmentMultiple (1207 of 1699) ******************** TEST 'lldb-Unit :: SymbolFile/NativePDB/./SymbolFileNativePDBTests/PDBFPOProgramToDWARFExpressionTests.InvalidAssignmentMultiple' FAILED ********************

Hide Details

******************** FAIL: lldb-Unit :: SymbolFile/NativePDB/./SymbolFileNativePDBTests/PDBFPOProgramToDWARFExpressionTests.DependencyChain (1208 of 1699) ******************** TEST 'lldb-Unit :: SymbolFile/NativePDB/./SymbolFileNativePDBTests/PDBFPOProgramToDWARFExpressionTests.DependencyChain' FAILED ********************

Hide Details

******************** FAIL: lldb-Unit :: SymbolFile/NativePDB/./SymbolFileNativePDBTests/PDBFPOProgramToDWARFExpressionTests.InvalidAssignmentSingle (1209 of 1699) ******************** TEST 'lldb-Unit :: SymbolFile/NativePDB/./SymbolFileNativePDBTests/PDBFPOProgramToDWARFExpressionTests.InvalidAssignmentSingle' FAILED ********************

Hide Details

******************** FAIL: lldb-Unit :: SymbolFile/NativePDB/./SymbolFileNativePDBTests/PDBFPOProgramToDWARFExpressionTests.InvalidOpBinary (1210 of 1699) ******************** TEST 'lldb-Unit :: SymbolFile/NativePDB/./SymbolFileNativePDBTests/PDBFPOProgramToDWARFExpressionTests.InvalidOpBinary' FAILED ********************

Hide Details

******************** FAIL: lldb-Unit :: SymbolFile/NativePDB/./SymbolFileNativePDBTests/PDBFPOProgramToDWARFExpressionTests.MissingTargetRegister (1211 of 1699) ******************** TEST 'lldb-Unit :: SymbolFile/NativePDB/./SymbolFileNativePDBTests/PDBFPOProgramToDWARFExpressionTests.MissingTargetRegister' FAILED ********************

Hide Details

******************** FAIL: lldb-Unit :: SymbolFile/NativePDB/./SymbolFileNativePDBTests/PDBFPOProgramToDWARFExpressionTests.InvalidOpUnary (1212 of 1699) ******************** TEST 'lldb-Unit :: SymbolFile/NativePDB/./SymbolFileNativePDBTests/PDBFPOProgramToDWARFExpressionTests.InvalidOpUnary' FAILED ********************

Hide Details

******************** FAIL: lldb-Unit :: SymbolFile/NativePDB/./SymbolFileNativePDBTests/PDBFPOProgramToDWARFExpressionTests.MultipleDependentAssignments (1213 of 1699) ******************** TEST 'lldb-Unit :: SymbolFile/NativePDB/./SymbolFileNativePDBTests/PDBFPOProgramToDWARFExpressionTests.MultipleDependentAssignments' FAILED ********************

Hide Details

******************** FAIL: lldb-Unit :: SymbolFile/NativePDB/./SymbolFileNativePDBTests/PDBFPOProgramToDWARFExpressionTests.MultipleIndependentAssignments (1214 of 1699) ******************** TEST 'lldb-Unit :: SymbolFile/NativePDB/./SymbolFileNativePDBTests/PDBFPOProgramToDWARFExpressionTests.MultipleIndependentAssignments' FAILED ********************

Hide Details

******************** FAIL: lldb-Unit :: SymbolFile/NativePDB/./SymbolFileNativePDBTests/PDBFPOProgramToDWARFExpressionTests.SingleAssignmentRegisterRef (1215 of 1699) ******************** TEST 'lldb-Unit :: SymbolFile/NativePDB/./SymbolFileNativePDBTests/PDBFPOProgramToDWARFExpressionTests.SingleAssignmentRegisterRef' FAILED ********************

Hide Details

******************** FAIL: lldb-Unit :: SymbolFile/NativePDB/./SymbolFileNativePDBTests/PDBFPOProgramToDWARFExpressionTests.UnknownOp (1216 of 1699) ******************** TEST 'lldb-Unit :: SymbolFile/NativePDB/./SymbolFileNativePDBTests/PDBFPOProgramToDWARFExpressionTests.UnknownOp' FAILED ********************

Hide Details

******************** FAIL: lldb-Unit :: SymbolFile/NativePDB/./SymbolFileNativePDBTests/PDBFPOProgramToDWARFExpressionTests.UnresolvedCyclicRegisterAssignmentReference (1217 of 1699) ******************** TEST 'lldb-Unit :: SymbolFile/NativePDB/./SymbolFileNativePDBTests/PDBFPOProgramToDWARFExpressionTests.UnresolvedCyclicRegisterAssignmentReference' FAILED ********************

Hide Details

******************** FAIL: lldb-Unit :: SymbolFile/NativePDB/./SymbolFileNativePDBTests/PDBFPOProgramToDWARFExpressionTests.UnresolvedDependentCyclicRegisterAssignmentReference (1218 of 1699) ******************** TEST 'lldb-Unit :: SymbolFile/NativePDB/./SymbolFileNativePDBTests/PDBFPOProgramToDWARFExpressionTests.UnresolvedDependentCyclicRegisterAssignmentReference' FAILED ********************

Hide Details

******************** FAIL: lldb-Unit :: SymbolFile/NativePDB/./SymbolFileNativePDBTests/PDBFPOProgramToDWARFExpressionTests.UnresolvedRegisterAssignmentReference (1219 of 1699) ******************** TEST 'lldb-Unit :: SymbolFile/NativePDB/./SymbolFileNativePDBTests/PDBFPOProgramToDWARFExpressionTests.UnresolvedRegisterAssignmentReference' FAILED ********************

Hide Details

******************** FAIL: lldb-Unit :: SymbolFile/NativePDB/./SymbolFileNativePDBTests/PDBFPOProgramToDWARFExpressionTests.UnsupportedRASearch (1220 of 1699) ******************** TEST 'lldb-Unit :: SymbolFile/NativePDB/./SymbolFileNativePDBTests/PDBFPOProgramToDWARFExpressionTests.UnsupportedRASearch' FAILED ********************

Hide Details

******************** FAIL: lldb-Unit :: SymbolFile/NativePDB/./SymbolFileNativePDBTests/PDBFPOProgramToDWARFExpressionTests.UnresolvedRegisterReference (1221 of 1699) ******************** TEST 'lldb-Unit :: SymbolFile/NativePDB/./SymbolFileNativePDBTests/PDBFPOProgramToDWARFExpressionTests.UnresolvedRegisterReference' FAILED ********************

Hide Details

******************** FAIL: lldb-Unit :: Target/./TargetTests/ExecutionContextTest.GetByteOrder (1222 of 1699) ******************** TEST 'lldb-Unit :: Target/./TargetTests/ExecutionContextTest.GetByteOrder' FAILED ********************

Hide Details

******************** FAIL: lldb-Unit :: Target/./TargetTests/ExecutionContextTest.GetByteOrderProcess (1223 of 1699) ******************** TEST 'lldb-Unit :: Target/./TargetTests/ExecutionContextTest.GetByteOrderProcess' FAILED ********************

Hide Details

******************** FAIL: lldb-Unit :: Target/./TargetTests/ExecutionContextTest.GetByteOrderTarget (1224 of 1699) ******************** TEST 'lldb-Unit :: Target/./TargetTests/ExecutionContextTest.GetByteOrderTarget' FAILED ********************

Hide Details

******************** FAIL: lldb-Unit :: Target/./TargetTests/ModuleCacheTest.GetAndPut (1225 of 1699) ******************** TEST 'lldb-Unit :: Target/./TargetTests/ModuleCacheTest.GetAndPut' FAILED ********************

Hide Details

******************** FAIL: lldb-Unit :: Target/./TargetTests/MemoryRegionInfoTest.Formatv (1226 of 1699) ******************** TEST 'lldb-Unit :: Target/./TargetTests/MemoryRegionInfoTest.Formatv' FAILED ********************

Hide Details

******************** FAIL: lldb-Unit :: Target/./TargetTests/ModuleCacheTest.GetAndPutStrangeHostname (1227 of 1699) ******************** TEST 'lldb-Unit :: Target/./TargetTests/ModuleCacheTest.GetAndPutStrangeHostname' FAILED ********************

Hide Details

******************** FAIL: lldb-Unit :: Target/./TargetTests/ModuleCacheTest.GetAndPutUuidExists (1228 of 1699) ******************** TEST 'lldb-Unit :: Target/./TargetTests/ModuleCacheTest.GetAndPutUuidExists' FAILED ********************

Hide Details

******************** FAIL: lldb-Unit :: Target/./TargetTests/PathMappingListTest.AbsoluteTests (1229 of 1699) ******************** TEST 'lldb-Unit :: Target/./TargetTests/PathMappingListTest.AbsoluteTests' FAILED ********************

Hide Details

******************** FAIL: lldb-Unit :: Target/./TargetTests/PathMappingListTest.RemapRoot (1230 of 1699) ******************** TEST 'lldb-Unit :: Target/./TargetTests/PathMappingListTest.RemapRoot' FAILED ********************

Hide Details

******************** FAIL: lldb-Unit :: Target/./TargetTests/PathMappingListTest.RelativeTests (1231 of 1699) ******************** TEST 'lldb-Unit :: Target/./TargetTests/PathMappingListTest.RelativeTests' FAILED ********************

Hide Details

******************** FAIL: lldb-Unit :: Target/./TargetTests/ProcessInstanceInfo.Dump (1232 of 1699) ******************** TEST 'lldb-Unit :: Target/./TargetTests/ProcessInstanceInfo.Dump' FAILED ********************

Hide Details

******************** FAIL: lldb-Unit :: Target/./TargetTests/ProcessInstanceInfo.DumpTable (1233 of 1699) ******************** TEST 'lldb-Unit :: Target/./TargetTests/ProcessInstanceInfo.DumpTable' FAILED ********************

Hide Details

******************** FAIL: lldb-Unit :: UnwindAssembly/ARM64/./Arm64InstEmulationTests/TestArm64InstEmulation.TestFramelessThreeEpilogueFunction (1234 of 1699) ******************** TEST 'lldb-Unit :: UnwindAssembly/ARM64/./Arm64InstEmulationTests/TestArm64InstEmulation.TestFramelessThreeEpilogueFunction' FAILED ********************

Hide Details

******************** FAIL: lldb-Unit :: UnwindAssembly/ARM64/./Arm64InstEmulationTests/TestArm64InstEmulation.TestMediumDarwinFunction (1235 of 1699) ******************** TEST 'lldb-Unit :: UnwindAssembly/ARM64/./Arm64InstEmulationTests/TestArm64InstEmulation.TestMediumDarwinFunction' FAILED ********************

Hide Details

******************** FAIL: lldb-Unit :: UnwindAssembly/ARM64/./Arm64InstEmulationTests/TestArm64InstEmulation.TestRegisterDoubleSpills (1236 of 1699) ******************** TEST 'lldb-Unit :: UnwindAssembly/ARM64/./Arm64InstEmulationTests/TestArm64InstEmulation.TestRegisterDoubleSpills' FAILED ********************

Hide Details

******************** FAIL: lldb-Unit :: UnwindAssembly/ARM64/./Arm64InstEmulationTests/TestArm64InstEmulation.TestSimpleDarwinFunction (1237 of 1699) ******************** TEST 'lldb-Unit :: UnwindAssembly/ARM64/./Arm64InstEmulationTests/TestArm64InstEmulation.TestSimpleDarwinFunction' FAILED ********************

Hide Details

******************** FAIL: lldb-Unit :: UnwindAssembly/ARM64/./Arm64InstEmulationTests/TestArm64InstEmulation.TestRegisterSavedTwice (1238 of 1699) ******************** TEST 'lldb-Unit :: UnwindAssembly/ARM64/./Arm64InstEmulationTests/TestArm64InstEmulation.TestRegisterSavedTwice' FAILED ********************

Hide Details

******************** FAIL: lldb-Unit :: UnwindAssembly/PPC64/./PPC64InstEmulationTests/TestPPC64InstEmulation.TestMediumFunction (1239 of 1699) ******************** TEST 'lldb-Unit :: UnwindAssembly/PPC64/./PPC64InstEmulationTests/TestPPC64InstEmulation.TestMediumFunction' FAILED ********************

Hide Details

******************** FAIL: lldb-Unit :: UnwindAssembly/PPC64/./PPC64InstEmulationTests/TestPPC64InstEmulation.TestSimpleFunction (1240 of 1699) ******************** TEST 'lldb-Unit :: UnwindAssembly/PPC64/./PPC64InstEmulationTests/TestPPC64InstEmulation.TestSimpleFunction' FAILED ********************

Hide Details

******************** FAIL: lldb-Unit :: UnwindAssembly/x86/./UnwindAssemblyx86Tests/Testx86AssemblyInspectionEngine.Test32BitOnlyInstruction (1241 of 1699) ******************** TEST 'lldb-Unit :: UnwindAssembly/x86/./UnwindAssemblyx86Tests/Testx86AssemblyInspectionEngine.Test32BitOnlyInstruction' FAILED ********************

Hide Details

******************** FAIL: lldb-Unit :: UnwindAssembly/x86/./UnwindAssemblyx86Tests/Testx86AssemblyInspectionEngine.Test32bitFramelessSmallStackFrame (1242 of 1699) ******************** TEST 'lldb-Unit :: UnwindAssembly/x86/./UnwindAssemblyx86Tests/Testx86AssemblyInspectionEngine.Test32bitFramelessSmallStackFrame' FAILED ********************

Hide Details

******************** FAIL: lldb-Unit :: UnwindAssembly/x86/./UnwindAssemblyx86Tests/Testx86AssemblyInspectionEngine.Test32bitFramelessBigStackFrame (1243 of 1699) ******************** TEST 'lldb-Unit :: UnwindAssembly/x86/./UnwindAssemblyx86Tests/Testx86AssemblyInspectionEngine.Test32bitFramelessBigStackFrame' FAILED ********************

Hide Details

******************** FAIL: lldb-Unit :: UnwindAssembly/x86/./UnwindAssemblyx86Tests/Testx86AssemblyInspectionEngine.TestAddESP (1244 of 1699) ******************** TEST 'lldb-Unit :: UnwindAssembly/x86/./UnwindAssemblyx86Tests/Testx86AssemblyInspectionEngine.TestAddESP' FAILED ********************

Hide Details

******************** FAIL: lldb-Unit :: UnwindAssembly/x86/./UnwindAssemblyx86Tests/Testx86AssemblyInspectionEngine.Test64bitFramelessBigStackFrame (1245 of 1699) ******************** TEST 'lldb-Unit :: UnwindAssembly/x86/./UnwindAssemblyx86Tests/Testx86AssemblyInspectionEngine.Test64bitFramelessBigStackFrame' FAILED ********************

Hide Details

******************** FAIL: lldb-Unit :: UnwindAssembly/x86/./UnwindAssemblyx86Tests/Testx86AssemblyInspectionEngine.Test64bitFramelessSmallStackFrame (1246 of 1699) ******************** TEST 'lldb-Unit :: UnwindAssembly/x86/./UnwindAssemblyx86Tests/Testx86AssemblyInspectionEngine.Test64bitFramelessSmallStackFrame' FAILED ********************

Hide Details

******************** FAIL: lldb-Unit :: UnwindAssembly/x86/./UnwindAssemblyx86Tests/Testx86AssemblyInspectionEngine.TestAddRSP (1247 of 1699) ******************** TEST 'lldb-Unit :: UnwindAssembly/x86/./UnwindAssemblyx86Tests/Testx86AssemblyInspectionEngine.TestAddRSP' FAILED ********************

Hide Details

******************** FAIL: lldb-Unit :: UnwindAssembly/x86/./UnwindAssemblyx86Tests/Testx86AssemblyInspectionEngine.TestCALLNextInsn (1248 of 1699) ******************** TEST 'lldb-Unit :: UnwindAssembly/x86/./UnwindAssemblyx86Tests/Testx86AssemblyInspectionEngine.TestCALLNextInsn' FAILED ********************

Hide Details

******************** FAIL: lldb-Unit :: UnwindAssembly/x86/./UnwindAssemblyx86Tests/Testx86AssemblyInspectionEngine.TestDisassemblyJunkBytes (1249 of 1699) ******************** TEST 'lldb-Unit :: UnwindAssembly/x86/./UnwindAssemblyx86Tests/Testx86AssemblyInspectionEngine.TestDisassemblyJunkBytes' FAILED ********************

Hide Details

******************** FAIL: lldb-Unit :: UnwindAssembly/x86/./UnwindAssemblyx86Tests/Testx86AssemblyInspectionEngine.TestLEAVE (1250 of 1699) ******************** TEST 'lldb-Unit :: UnwindAssembly/x86/./UnwindAssemblyx86Tests/Testx86AssemblyInspectionEngine.TestLEAVE' FAILED ********************

Hide Details

******************** FAIL: lldb-Unit :: UnwindAssembly/x86/./UnwindAssemblyx86Tests/Testx86AssemblyInspectionEngine.TestDisassemblyMidFunctionEpilogues (1251 of 1699) ******************** TEST 'lldb-Unit :: UnwindAssembly/x86/./UnwindAssemblyx86Tests/Testx86AssemblyInspectionEngine.TestDisassemblyMidFunctionEpilogues' FAILED ********************

Hide Details

******************** FAIL: lldb-Unit :: UnwindAssembly/x86/./UnwindAssemblyx86Tests/Testx86AssemblyInspectionEngine.TestPopEBP (1252 of 1699) ******************** TEST 'lldb-Unit :: UnwindAssembly/x86/./UnwindAssemblyx86Tests/Testx86AssemblyInspectionEngine.TestPopEBP' FAILED ********************

Hide Details

******************** FAIL: lldb-Unit :: UnwindAssembly/x86/./UnwindAssemblyx86Tests/Testx86AssemblyInspectionEngine.TestMovRSPtoRBP (1253 of 1699) ******************** TEST 'lldb-Unit :: UnwindAssembly/x86/./UnwindAssemblyx86Tests/Testx86AssemblyInspectionEngine.TestMovRSPtoRBP' FAILED ********************

Hide Details

******************** FAIL: lldb-Unit :: UnwindAssembly/x86/./UnwindAssemblyx86Tests/Testx86AssemblyInspectionEngine.TestPopEBX (1254 of 1699) ******************** TEST 'lldb-Unit :: UnwindAssembly/x86/./UnwindAssemblyx86Tests/Testx86AssemblyInspectionEngine.TestPopEBX' FAILED ********************

Hide Details

******************** FAIL: lldb-Unit :: UnwindAssembly/x86/./UnwindAssemblyx86Tests/Testx86AssemblyInspectionEngine.TestPopEDI (1255 of 1699) ******************** TEST 'lldb-Unit :: UnwindAssembly/x86/./UnwindAssemblyx86Tests/Testx86AssemblyInspectionEngine.TestPopEDI' FAILED ********************

Hide Details

******************** FAIL: lldb-Unit :: UnwindAssembly/x86/./UnwindAssemblyx86Tests/Testx86AssemblyInspectionEngine.TestPopESI (1256 of 1699) ******************** TEST 'lldb-Unit :: UnwindAssembly/x86/./UnwindAssemblyx86Tests/Testx86AssemblyInspectionEngine.TestPopESI' FAILED ********************

Hide Details

******************** FAIL: lldb-Unit :: UnwindAssembly/x86/./UnwindAssemblyx86Tests/Testx86AssemblyInspectionEngine.TestPopR13 (1257 of 1699) ******************** TEST 'lldb-Unit :: UnwindAssembly/x86/./UnwindAssemblyx86Tests/Testx86AssemblyInspectionEngine.TestPopR13' FAILED ********************

Hide Details

******************** FAIL: lldb-Unit :: UnwindAssembly/x86/./UnwindAssemblyx86Tests/Testx86AssemblyInspectionEngine.TestPopR12 (1258 of 1699) ******************** TEST 'lldb-Unit :: UnwindAssembly/x86/./UnwindAssemblyx86Tests/Testx86AssemblyInspectionEngine.TestPopR12' FAILED ********************

Hide Details

******************** FAIL: lldb-Unit :: UnwindAssembly/x86/./UnwindAssemblyx86Tests/Testx86AssemblyInspectionEngine.TestPopR14 (1259 of 1699) ******************** TEST 'lldb-Unit :: UnwindAssembly/x86/./UnwindAssemblyx86Tests/Testx86AssemblyInspectionEngine.TestPopR14' FAILED ********************

Hide Details

******************** FAIL: lldb-Unit :: UnwindAssembly/x86/./UnwindAssemblyx86Tests/Testx86AssemblyInspectionEngine.TestPopRBP (1260 of 1699) ******************** TEST 'lldb-Unit :: UnwindAssembly/x86/./UnwindAssemblyx86Tests/Testx86AssemblyInspectionEngine.TestPopRBP' FAILED ********************

Hide Details

******************** FAIL: lldb-Unit :: UnwindAssembly/x86/./UnwindAssemblyx86Tests/Testx86AssemblyInspectionEngine.TestPopR15 (1261 of 1699) ******************** TEST 'lldb-Unit :: UnwindAssembly/x86/./UnwindAssemblyx86Tests/Testx86AssemblyInspectionEngine.TestPopR15' FAILED ********************

Hide Details

******************** FAIL: lldb-Unit :: UnwindAssembly/x86/./UnwindAssemblyx86Tests/Testx86AssemblyInspectionEngine.TestPopRBPWithREX (1262 of 1699) ******************** TEST 'lldb-Unit :: UnwindAssembly/x86/./UnwindAssemblyx86Tests/Testx86AssemblyInspectionEngine.TestPopRBPWithREX' FAILED ********************

Hide Details

******************** FAIL: lldb-Unit :: UnwindAssembly/x86/./UnwindAssemblyx86Tests/Testx86AssemblyInspectionEngine.TestPopRBX (1263 of 1699) ******************** TEST 'lldb-Unit :: UnwindAssembly/x86/./UnwindAssemblyx86Tests/Testx86AssemblyInspectionEngine.TestPopRBX' FAILED ********************

Hide Details

******************** FAIL: lldb-Unit :: UnwindAssembly/x86/./UnwindAssemblyx86Tests/Testx86AssemblyInspectionEngine.TestPush0 (1264 of 1699) ******************** TEST 'lldb-Unit :: UnwindAssembly/x86/./UnwindAssemblyx86Tests/Testx86AssemblyInspectionEngine.TestPush0' FAILED ********************

Hide Details

******************** FAIL: lldb-Unit :: UnwindAssembly/x86/./UnwindAssemblyx86Tests/Testx86AssemblyInspectionEngine.TestPushEBX (1265 of 1699) ******************** TEST 'lldb-Unit :: UnwindAssembly/x86/./UnwindAssemblyx86Tests/Testx86AssemblyInspectionEngine.TestPushEBX' FAILED ********************

Hide Details

******************** FAIL: lldb-Unit :: UnwindAssembly/x86/./UnwindAssemblyx86Tests/Testx86AssemblyInspectionEngine.TestPushEAX (1266 of 1699) ******************** TEST 'lldb-Unit :: UnwindAssembly/x86/./UnwindAssemblyx86Tests/Testx86AssemblyInspectionEngine.TestPushEAX' FAILED ********************

Hide Details

******************** FAIL: lldb-Unit :: UnwindAssembly/x86/./UnwindAssemblyx86Tests/Testx86AssemblyInspectionEngine.TestPushEBP (1267 of 1699) ******************** TEST 'lldb-Unit :: UnwindAssembly/x86/./UnwindAssemblyx86Tests/Testx86AssemblyInspectionEngine.TestPushEBP' FAILED ********************

Hide Details

******************** FAIL: lldb-Unit :: UnwindAssembly/x86/./UnwindAssemblyx86Tests/Testx86AssemblyInspectionEngine.TestPushEDI (1268 of 1699) ******************** TEST 'lldb-Unit :: UnwindAssembly/x86/./UnwindAssemblyx86Tests/Testx86AssemblyInspectionEngine.TestPushEDI' FAILED ********************

Hide Details

******************** FAIL: lldb-Unit :: UnwindAssembly/x86/./UnwindAssemblyx86Tests/Testx86AssemblyInspectionEngine.TestPushECX (1269 of 1699) ******************** TEST 'lldb-Unit :: UnwindAssembly/x86/./UnwindAssemblyx86Tests/Testx86AssemblyInspectionEngine.TestPushECX' FAILED ********************

Hide Details

******************** FAIL: lldb-Unit :: UnwindAssembly/x86/./UnwindAssemblyx86Tests/Testx86AssemblyInspectionEngine.TestPushEDX (1270 of 1699) ******************** TEST 'lldb-Unit :: UnwindAssembly/x86/./UnwindAssemblyx86Tests/Testx86AssemblyInspectionEngine.TestPushEDX' FAILED ********************

Hide Details

******************** FAIL: lldb-Unit :: UnwindAssembly/x86/./UnwindAssemblyx86Tests/Testx86AssemblyInspectionEngine.TestPushESI (1271 of 1699) ******************** TEST 'lldb-Unit :: UnwindAssembly/x86/./UnwindAssemblyx86Tests/Testx86AssemblyInspectionEngine.TestPushESI' FAILED ********************

Hide Details

******************** FAIL: lldb-Unit :: UnwindAssembly/x86/./UnwindAssemblyx86Tests/Testx86AssemblyInspectionEngine.TestPushExtended (1272 of 1699) ******************** TEST 'lldb-Unit :: UnwindAssembly/x86/./UnwindAssemblyx86Tests/Testx86AssemblyInspectionEngine.TestPushExtended' FAILED ********************

Hide Details

******************** FAIL: lldb-Unit :: UnwindAssembly/x86/./UnwindAssemblyx86Tests/Testx86AssemblyInspectionEngine.TestPushR13 (1273 of 1699) ******************** TEST 'lldb-Unit :: UnwindAssembly/x86/./UnwindAssemblyx86Tests/Testx86AssemblyInspectionEngine.TestPushR13' FAILED ********************

Hide Details

******************** FAIL: lldb-Unit :: UnwindAssembly/x86/./UnwindAssemblyx86Tests/Testx86AssemblyInspectionEngine.TestPushR12 (1274 of 1699) ******************** TEST 'lldb-Unit :: UnwindAssembly/x86/./UnwindAssemblyx86Tests/Testx86AssemblyInspectionEngine.TestPushR12' FAILED ********************

Hide Details

******************** FAIL: lldb-Unit :: UnwindAssembly/x86/./UnwindAssemblyx86Tests/Testx86AssemblyInspectionEngine.TestPushImm (1275 of 1699) ******************** TEST 'lldb-Unit :: UnwindAssembly/x86/./UnwindAssemblyx86Tests/Testx86AssemblyInspectionEngine.TestPushImm' FAILED ********************

Hide Details

******************** FAIL: lldb-Unit :: UnwindAssembly/x86/./UnwindAssemblyx86Tests/Testx86AssemblyInspectionEngine.TestPushR14 (1276 of 1699) ******************** TEST 'lldb-Unit :: UnwindAssembly/x86/./UnwindAssemblyx86Tests/Testx86AssemblyInspectionEngine.TestPushR14' FAILED ********************

Hide Details

******************** FAIL: lldb-Unit :: UnwindAssembly/x86/./UnwindAssemblyx86Tests/Testx86AssemblyInspectionEngine.TestPushR15 (1277 of 1699) ******************** TEST 'lldb-Unit :: UnwindAssembly/x86/./UnwindAssemblyx86Tests/Testx86AssemblyInspectionEngine.TestPushR15' FAILED ********************

Hide Details

******************** FAIL: lldb-Unit :: UnwindAssembly/x86/./UnwindAssemblyx86Tests/Testx86AssemblyInspectionEngine.TestPushRBPWithREX (1278 of 1699) ******************** TEST 'lldb-Unit :: UnwindAssembly/x86/./UnwindAssemblyx86Tests/Testx86AssemblyInspectionEngine.TestPushRBPWithREX' FAILED ********************

Hide Details

******************** FAIL: lldb-Unit :: UnwindAssembly/x86/./UnwindAssemblyx86Tests/Testx86AssemblyInspectionEngine.TestPushRBP (1279 of 1699) ******************** TEST 'lldb-Unit :: UnwindAssembly/x86/./UnwindAssemblyx86Tests/Testx86AssemblyInspectionEngine.TestPushRBP' FAILED ********************

Hide Details

******************** FAIL: lldb-Unit :: UnwindAssembly/x86/./UnwindAssemblyx86Tests/Testx86AssemblyInspectionEngine.TestPushRBX (1280 of 1699) ******************** TEST 'lldb-Unit :: UnwindAssembly/x86/./UnwindAssemblyx86Tests/Testx86AssemblyInspectionEngine.TestPushRBX' FAILED ********************

Hide Details

******************** FAIL: lldb-Unit :: UnwindAssembly/x86/./UnwindAssemblyx86Tests/Testx86AssemblyInspectionEngine.TestSimplex86_64Augmented (1281 of 1699) ******************** TEST 'lldb-Unit :: UnwindAssembly/x86/./UnwindAssemblyx86Tests/Testx86AssemblyInspectionEngine.TestSimplex86_64Augmented' FAILED ********************

Hide Details

******************** FAIL: lldb-Unit :: UnwindAssembly/x86/./UnwindAssemblyx86Tests/Testx86AssemblyInspectionEngine.TestSimplei386ugmented (1282 of 1699) ******************** TEST 'lldb-Unit :: UnwindAssembly/x86/./UnwindAssemblyx86Tests/Testx86AssemblyInspectionEngine.TestSimplei386ugmented' FAILED ********************

Hide Details

******************** FAIL: lldb-Unit :: UnwindAssembly/x86/./UnwindAssemblyx86Tests/Testx86AssemblyInspectionEngine.TestSimple32bitFrameFunction (1283 of 1699) ******************** TEST 'lldb-Unit :: UnwindAssembly/x86/./UnwindAssemblyx86Tests/Testx86AssemblyInspectionEngine.TestSimple32bitFrameFunction' FAILED ********************

Hide Details

******************** FAIL: lldb-Unit :: UnwindAssembly/x86/./UnwindAssemblyx86Tests/Testx86AssemblyInspectionEngine.TestReturnDetect (1284 of 1699) ******************** TEST 'lldb-Unit :: UnwindAssembly/x86/./UnwindAssemblyx86Tests/Testx86AssemblyInspectionEngine.TestReturnDetect' FAILED ********************

Hide Details

******************** FAIL: lldb-Unit :: UnwindAssembly/x86/./UnwindAssemblyx86Tests/Testx86AssemblyInspectionEngine.TestSimple64bitFrameFunction (1285 of 1699) ******************** TEST 'lldb-Unit :: UnwindAssembly/x86/./UnwindAssemblyx86Tests/Testx86AssemblyInspectionEngine.TestSimple64bitFrameFunction' FAILED ********************

Hide Details

******************** FAIL: lldb-Unit :: UnwindAssembly/x86/./UnwindAssemblyx86Tests/Testx86AssemblyInspectionEngine.TestSpillRegToStackViaMOVi386 (1286 of 1699) ******************** TEST 'lldb-Unit :: UnwindAssembly/x86/./UnwindAssemblyx86Tests/Testx86AssemblyInspectionEngine.TestSpillRegToStackViaMOVi386' FAILED ********************

Hide Details

******************** FAIL: lldb-Unit :: UnwindAssembly/x86/./UnwindAssemblyx86Tests/Testx86AssemblyInspectionEngine.TestSpillRegToStackViaMOVx86_64 (1287 of 1699) ******************** TEST 'lldb-Unit :: UnwindAssembly/x86/./UnwindAssemblyx86Tests/Testx86AssemblyInspectionEngine.TestSpillRegToStackViaMOVx86_64' FAILED ********************

Hide Details

******************** FAIL: lldb-Unit :: UnwindAssembly/x86/./UnwindAssemblyx86Tests/Testx86AssemblyInspectionEngine.TestStackRealign32BitDisp_x86_64 (1288 of 1699) ******************** TEST 'lldb-Unit :: UnwindAssembly/x86/./UnwindAssemblyx86Tests/Testx86AssemblyInspectionEngine.TestStackRealign32BitDisp_x86_64' FAILED ********************

Hide Details

******************** FAIL: lldb-Unit :: Utility/./UtilityTests/AnsiTerminal.AtEnd (1289 of 1699) ******************** TEST 'lldb-Unit :: Utility/./UtilityTests/AnsiTerminal.AtEnd' FAILED ********************

Hide Details

******************** FAIL: lldb-Unit :: Utility/./UtilityTests/AnsiTerminal.AtStart (1290 of 1699) ******************** TEST 'lldb-Unit :: Utility/./UtilityTests/AnsiTerminal.AtStart' FAILED ********************

Hide Details

******************** FAIL: lldb-Unit :: UnwindAssembly/x86/./UnwindAssemblyx86Tests/Testx86AssemblyInspectionEngine.TestStackRealignMSVC_i386 (1291 of 1699) ******************** TEST 'lldb-Unit :: UnwindAssembly/x86/./UnwindAssemblyx86Tests/Testx86AssemblyInspectionEngine.TestStackRealignMSVC_i386' FAILED ********************

Hide Details

******************** FAIL: lldb-Unit :: UnwindAssembly/x86/./UnwindAssemblyx86Tests/Testx86AssemblyInspectionEngine.Testi386IgnoredRegisters (1292 of 1699) ******************** TEST 'lldb-Unit :: UnwindAssembly/x86/./UnwindAssemblyx86Tests/Testx86AssemblyInspectionEngine.Testi386IgnoredRegisters' FAILED ********************

Hide Details

******************** FAIL: lldb-Unit :: UnwindAssembly/x86/./UnwindAssemblyx86Tests/Testx86AssemblyInspectionEngine.TestStackRealign8BitDisp_i386 (1293 of 1699) ******************** TEST 'lldb-Unit :: UnwindAssembly/x86/./UnwindAssemblyx86Tests/Testx86AssemblyInspectionEngine.TestStackRealign8BitDisp_i386' FAILED ********************

Hide Details

******************** FAIL: lldb-Unit :: Utility/./UtilityTests/AnsiTerminal.Basic (1294 of 1699) ******************** TEST 'lldb-Unit :: Utility/./UtilityTests/AnsiTerminal.Basic' FAILED ********************

Hide Details

******************** FAIL: lldb-Unit :: UnwindAssembly/x86/./UnwindAssemblyx86Tests/Testx86AssemblyInspectionEngine.TestSubESP (1295 of 1699) ******************** TEST 'lldb-Unit :: UnwindAssembly/x86/./UnwindAssemblyx86Tests/Testx86AssemblyInspectionEngine.TestSubESP' FAILED ********************

Hide Details

******************** FAIL: lldb-Unit :: UnwindAssembly/x86/./UnwindAssemblyx86Tests/Testx86AssemblyInspectionEngine.TestSubRSP (1296 of 1699) ******************** TEST 'lldb-Unit :: UnwindAssembly/x86/./UnwindAssemblyx86Tests/Testx86AssemblyInspectionEngine.TestSubRSP' FAILED ********************

Hide Details

******************** FAIL: lldb-Unit :: Utility/./UtilityTests/AnsiTerminal.Empty (1297 of 1699) ******************** TEST 'lldb-Unit :: Utility/./UtilityTests/AnsiTerminal.Empty' FAILED ********************

Hide Details

******************** FAIL: lldb-Unit :: Utility/./UtilityTests/AnsiTerminal.Incomplete (1298 of 1699) ******************** TEST 'lldb-Unit :: Utility/./UtilityTests/AnsiTerminal.Incomplete' FAILED ********************

Hide Details

******************** FAIL: lldb-Unit :: Utility/./UtilityTests/AnsiTerminal.KnownPrefix (1299 of 1699) ******************** TEST 'lldb-Unit :: Utility/./UtilityTests/AnsiTerminal.KnownPrefix' FAILED ********************

Hide Details

******************** FAIL: lldb-Unit :: Utility/./UtilityTests/AnsiTerminal.WhiteSpace (1300 of 1699) ******************** TEST 'lldb-Unit :: Utility/./UtilityTests/AnsiTerminal.WhiteSpace' FAILED ********************

Hide Details

******************** FAIL: lldb-Unit :: Utility/./UtilityTests/AnsiTerminal.Twice (1301 of 1699) ******************** TEST 'lldb-Unit :: Utility/./UtilityTests/AnsiTerminal.Twice' FAILED ********************

Hide Details

******************** FAIL: lldb-Unit :: Utility/./UtilityTests/ArchSpecTest.Compatibility (1302 of 1699) ******************** TEST 'lldb-Unit :: Utility/./UtilityTests/ArchSpecTest.Compatibility' FAILED ********************

Hide Details

******************** FAIL: lldb-Unit :: Utility/./UtilityTests/AnsiTerminal.Unknown (1303 of 1699) ******************** TEST 'lldb-Unit :: Utility/./UtilityTests/AnsiTerminal.Unknown' FAILED ********************

Hide Details

******************** FAIL: lldb-Unit :: Utility/./UtilityTests/ArchSpecTest.MergeFrom (1304 of 1699) ******************** TEST 'lldb-Unit :: Utility/./UtilityTests/ArchSpecTest.MergeFrom' FAILED ********************

Hide Details

******************** FAIL: lldb-Unit :: Utility/./UtilityTests/ArchSpecTest.OperatorBool (1305 of 1699) ******************** TEST 'lldb-Unit :: Utility/./UtilityTests/ArchSpecTest.OperatorBool' FAILED ********************

Hide Details

******************** FAIL: lldb-Unit :: Utility/./UtilityTests/ArchSpecTest.MergeFromMachOUnknown (1306 of 1699) ******************** TEST 'lldb-Unit :: Utility/./UtilityTests/ArchSpecTest.MergeFromMachOUnknown' FAILED ********************

Hide Details

******************** FAIL: lldb-Unit :: Utility/./UtilityTests/ArchSpecTest.TestParseMachCPUDashSubtypeTripleExtra (1307 of 1699) ******************** TEST 'lldb-Unit :: Utility/./UtilityTests/ArchSpecTest.TestParseMachCPUDashSubtypeTripleExtra' FAILED ********************

Hide Details

******************** FAIL: lldb-Unit :: Utility/./UtilityTests/ArchSpecTest.TestParseMachCPUDashSubtypeTripleSimple (1308 of 1699) ******************** TEST 'lldb-Unit :: Utility/./UtilityTests/ArchSpecTest.TestParseMachCPUDashSubtypeTripleSimple' FAILED ********************

Hide Details

******************** FAIL: lldb-Unit :: Utility/./UtilityTests/ArchSpecTest.TripleComponentsWereSpecified (1309 of 1699) ******************** TEST 'lldb-Unit :: Utility/./UtilityTests/ArchSpecTest.TripleComponentsWereSpecified' FAILED ********************

Hide Details

******************** FAIL: lldb-Unit :: Utility/./UtilityTests/ArchSpecTest.TestSetTriple (1310 of 1699) ******************** TEST 'lldb-Unit :: Utility/./UtilityTests/ArchSpecTest.TestSetTriple' FAILED ********************

Hide Details

******************** FAIL: lldb-Unit :: Utility/./UtilityTests/ArgsTest.AppendArguments (1311 of 1699) ******************** TEST 'lldb-Unit :: Utility/./UtilityTests/ArgsTest.AppendArguments' FAILED ********************

Hide Details

******************** FAIL: lldb-Unit :: Utility/./UtilityTests/ArgsTest.BareSingleQuote (1312 of 1699) ******************** TEST 'lldb-Unit :: Utility/./UtilityTests/ArgsTest.BareSingleQuote' FAILED ********************

Hide Details

******************** FAIL: lldb-Unit :: Utility/./UtilityTests/ArgsTest.EscapeLLDBCommandArgument (1313 of 1699) ******************** TEST 'lldb-Unit :: Utility/./UtilityTests/ArgsTest.EscapeLLDBCommandArgument' FAILED ********************

Hide Details

******************** FAIL: lldb-Unit :: Utility/./UtilityTests/ArgsTest.DoubleQuotedItem (1314 of 1699) ******************** TEST 'lldb-Unit :: Utility/./UtilityTests/ArgsTest.DoubleQuotedItem' FAILED ********************

Hide Details

******************** FAIL: lldb-Unit :: Utility/./UtilityTests/ArgsTest.GetArgumentArrayRef (1315 of 1699) ******************** TEST 'lldb-Unit :: Utility/./UtilityTests/ArgsTest.GetArgumentArrayRef' FAILED ********************

Hide Details

******************** FAIL: lldb-Unit :: Utility/./UtilityTests/ArgsTest.GetQuotedCommandString (1316 of 1699) ******************** TEST 'lldb-Unit :: Utility/./UtilityTests/ArgsTest.GetQuotedCommandString' FAILED ********************

Hide Details

******************** FAIL: lldb-Unit :: Utility/./UtilityTests/ArgsTest.StringListConstructor (1317 of 1699) ******************** TEST 'lldb-Unit :: Utility/./UtilityTests/ArgsTest.StringListConstructor' FAILED ********************

Hide Details

******************** FAIL: lldb-Unit :: Utility/./UtilityTests/ArgsTest.TestAppendArg (1318 of 1699) ******************** TEST 'lldb-Unit :: Utility/./UtilityTests/ArgsTest.TestAppendArg' FAILED ********************

Hide Details

******************** FAIL: lldb-Unit :: Utility/./UtilityTests/ArgsTest.TestArgv (1319 of 1699) ******************** TEST 'lldb-Unit :: Utility/./UtilityTests/ArgsTest.TestArgv' FAILED ********************

Hide Details

******************** FAIL: lldb-Unit :: Utility/./UtilityTests/ArgsTest.TestInsertArg (1320 of 1699) ******************** TEST 'lldb-Unit :: Utility/./UtilityTests/ArgsTest.TestInsertArg' FAILED ********************

Hide Details

******************** FAIL: lldb-Unit :: Utility/./UtilityTests/ArgsTest.TestOverwriteArgs (1321 of 1699) ******************** TEST 'lldb-Unit :: Utility/./UtilityTests/ArgsTest.TestOverwriteArgs' FAILED ********************

Hide Details

******************** FAIL: lldb-Unit :: Utility/./UtilityTests/ArgsTest.TestSingleArg (1322 of 1699) ******************** TEST 'lldb-Unit :: Utility/./UtilityTests/ArgsTest.TestSingleArg' FAILED ********************

Hide Details

******************** FAIL: lldb-Unit :: Utility/./UtilityTests/ArgsTest.TestMultipleArgs (1323 of 1699) ******************** TEST 'lldb-Unit :: Utility/./UtilityTests/ArgsTest.TestMultipleArgs' FAILED ********************

Hide Details

******************** FAIL: lldb-Unit :: Utility/./UtilityTests/ArgsTest.TestSingleArgWithQuotedSpace (1324 of 1699) ******************** TEST 'lldb-Unit :: Utility/./UtilityTests/ArgsTest.TestSingleArgWithQuotedSpace' FAILED ********************

Hide Details

******************** FAIL: lldb-Unit :: Utility/./UtilityTests/ArgsTest.TestSingleQuotedArgWithSpace (1325 of 1699) ******************** TEST 'lldb-Unit :: Utility/./UtilityTests/ArgsTest.TestSingleQuotedArgWithSpace' FAILED ********************

Hide Details

******************** FAIL: lldb-Unit :: Utility/./UtilityTests/BinaryStreamTest.PutSLEB128EightBytes (1326 of 1699) ******************** TEST 'lldb-Unit :: Utility/./UtilityTests/BinaryStreamTest.PutSLEB128EightBytes' FAILED ********************

Hide Details

******************** FAIL: lldb-Unit :: Utility/./UtilityTests/BinaryStreamTest.PutSLEB128FiveBytes (1327 of 1699) ******************** TEST 'lldb-Unit :: Utility/./UtilityTests/BinaryStreamTest.PutSLEB128FiveBytes' FAILED ********************

Hide Details

******************** FAIL: lldb-Unit :: Utility/./UtilityTests/BinaryStreamTest.PutSLEB128FourBytes (1328 of 1699) ******************** TEST 'lldb-Unit :: Utility/./UtilityTests/BinaryStreamTest.PutSLEB128FourBytes' FAILED ********************

Hide Details

******************** FAIL: lldb-Unit :: Utility/./UtilityTests/BinaryStreamTest.PutSLEB128NineBytes (1329 of 1699) ******************** TEST 'lldb-Unit :: Utility/./UtilityTests/BinaryStreamTest.PutSLEB128NineBytes' FAILED ********************

Hide Details

******************** FAIL: lldb-Unit :: Utility/./UtilityTests/BinaryStreamTest.PutSLEB128MaxValue (1330 of 1699) ******************** TEST 'lldb-Unit :: Utility/./UtilityTests/BinaryStreamTest.PutSLEB128MaxValue' FAILED ********************

Hide Details

******************** FAIL: lldb-Unit :: Utility/./UtilityTests/BinaryStreamTest.PutSLEB128OneByte (1331 of 1699) ******************** TEST 'lldb-Unit :: Utility/./UtilityTests/BinaryStreamTest.PutSLEB128OneByte' FAILED ********************

Hide Details

******************** FAIL: lldb-Unit :: Utility/./UtilityTests/BinaryStreamTest.PutSLEB128One (1332 of 1699) ******************** TEST 'lldb-Unit :: Utility/./UtilityTests/BinaryStreamTest.PutSLEB128One' FAILED ********************

Hide Details

******************** FAIL: lldb-Unit :: Utility/./UtilityTests/BinaryStreamTest.PutSLEB128SevenBytes (1333 of 1699) ******************** TEST 'lldb-Unit :: Utility/./UtilityTests/BinaryStreamTest.PutSLEB128SevenBytes' FAILED ********************

Hide Details

******************** FAIL: lldb-Unit :: Utility/./UtilityTests/BinaryStreamTest.PutSLEB128SixBytes (1334 of 1699) ******************** TEST 'lldb-Unit :: Utility/./UtilityTests/BinaryStreamTest.PutSLEB128SixBytes' FAILED ********************

Hide Details

******************** FAIL: lldb-Unit :: Utility/./UtilityTests/BinaryStreamTest.PutSLEB128ThreeBytes (1335 of 1699) ******************** TEST 'lldb-Unit :: Utility/./UtilityTests/BinaryStreamTest.PutSLEB128ThreeBytes' FAILED ********************

Hide Details

******************** FAIL: lldb-Unit :: Utility/./UtilityTests/BinaryStreamTest.PutSLEB128TwoBytes (1336 of 1699) ******************** TEST 'lldb-Unit :: Utility/./UtilityTests/BinaryStreamTest.PutSLEB128TwoBytes' FAILED ********************

Hide Details

******************** FAIL: lldb-Unit :: Utility/./UtilityTests/BinaryStreamTest.PutSLEB128Zero (1337 of 1699) ******************** TEST 'lldb-Unit :: Utility/./UtilityTests/BinaryStreamTest.PutSLEB128Zero' FAILED ********************

Hide Details

******************** FAIL: lldb-Unit :: Utility/./UtilityTests/BinaryStreamTest.PutULEB128EightBytes (1338 of 1699) ******************** TEST 'lldb-Unit :: Utility/./UtilityTests/BinaryStreamTest.PutULEB128EightBytes' FAILED ********************

Hide Details

******************** FAIL: lldb-Unit :: Utility/./UtilityTests/BinaryStreamTest.PutULEB128FiveBytes (1339 of 1699) ******************** TEST 'lldb-Unit :: Utility/./UtilityTests/BinaryStreamTest.PutULEB128FiveBytes' FAILED ********************

Hide Details

******************** FAIL: lldb-Unit :: Utility/./UtilityTests/BinaryStreamTest.PutULEB128FourBytes (1340 of 1699) ******************** TEST 'lldb-Unit :: Utility/./UtilityTests/BinaryStreamTest.PutULEB128FourBytes' FAILED ********************

Hide Details

******************** FAIL: lldb-Unit :: Utility/./UtilityTests/BinaryStreamTest.PutULEB128NineBytes (1341 of 1699) ******************** TEST 'lldb-Unit :: Utility/./UtilityTests/BinaryStreamTest.PutULEB128NineBytes' FAILED ********************

Hide Details

******************** FAIL: lldb-Unit :: Utility/./UtilityTests/BinaryStreamTest.PutULEB128MaxValue (1342 of 1699) ******************** TEST 'lldb-Unit :: Utility/./UtilityTests/BinaryStreamTest.PutULEB128MaxValue' FAILED ********************

Hide Details

******************** FAIL: lldb-Unit :: Utility/./UtilityTests/BinaryStreamTest.PutULEB128OneByte (1343 of 1699) ******************** TEST 'lldb-Unit :: Utility/./UtilityTests/BinaryStreamTest.PutULEB128OneByte' FAILED ********************

Hide Details

******************** FAIL: lldb-Unit :: Utility/./UtilityTests/BinaryStreamTest.PutULEB128One (1344 of 1699) ******************** TEST 'lldb-Unit :: Utility/./UtilityTests/BinaryStreamTest.PutULEB128One' FAILED ********************

Hide Details

******************** FAIL: lldb-Unit :: Utility/./UtilityTests/BinaryStreamTest.PutULEB128SevenBytes (1345 of 1699) ******************** TEST 'lldb-Unit :: Utility/./UtilityTests/BinaryStreamTest.PutULEB128SevenBytes' FAILED ********************

Hide Details

******************** FAIL: lldb-Unit :: Utility/./UtilityTests/BinaryStreamTest.PutULEB128SixBytes (1346 of 1699) ******************** TEST 'lldb-Unit :: Utility/./UtilityTests/BinaryStreamTest.PutULEB128SixBytes' FAILED ********************

Hide Details

******************** FAIL: lldb-Unit :: Utility/./UtilityTests/BinaryStreamTest.PutULEB128ThreeBytes (1347 of 1699) ******************** TEST 'lldb-Unit :: Utility/./UtilityTests/BinaryStreamTest.PutULEB128ThreeBytes' FAILED ********************

Hide Details

******************** FAIL: lldb-Unit :: Utility/./UtilityTests/BinaryStreamTest.PutULEB128Zero (1348 of 1699) ******************** TEST 'lldb-Unit :: Utility/./UtilityTests/BinaryStreamTest.PutULEB128Zero' FAILED ********************

Hide Details

******************** FAIL: lldb-Unit :: Utility/./UtilityTests/BinaryStreamTest.PutULEB128TwoBytes (1349 of 1699) ******************** TEST 'lldb-Unit :: Utility/./UtilityTests/BinaryStreamTest.PutULEB128TwoBytes' FAILED ********************

Hide Details

******************** FAIL: lldb-Unit :: Utility/./UtilityTests/BroadcasterTest.BroadcastEvent (1350 of 1699) ******************** TEST 'lldb-Unit :: Utility/./UtilityTests/BroadcasterTest.BroadcastEvent' FAILED ********************

Hide Details

******************** FAIL: lldb-Unit :: Utility/./UtilityTests/BroadcasterTest.EventTypeHasListeners (1351 of 1699) ******************** TEST 'lldb-Unit :: Utility/./UtilityTests/BroadcasterTest.EventTypeHasListeners' FAILED ********************

Hide Details

******************** FAIL: lldb-Unit :: Utility/./UtilityTests/CleanUpTest.disable (1352 of 1699) ******************** TEST 'lldb-Unit :: Utility/./UtilityTests/CleanUpTest.disable' FAILED ********************

Hide Details

******************** FAIL: lldb-Unit :: Utility/./UtilityTests/CleanUpTest.multiple_args (1353 of 1699) ******************** TEST 'lldb-Unit :: Utility/./UtilityTests/CleanUpTest.multiple_args' FAILED ********************

Hide Details

******************** FAIL: lldb-Unit :: Utility/./UtilityTests/CleanUpTest.no_args (1354 of 1699) ******************** TEST 'lldb-Unit :: Utility/./UtilityTests/CleanUpTest.no_args' FAILED ********************

Hide Details

******************** FAIL: lldb-Unit :: Utility/./UtilityTests/CompletionRequest.Constructor (1355 of 1699) ******************** TEST 'lldb-Unit :: Utility/./UtilityTests/CompletionRequest.Constructor' FAILED ********************

Hide Details

******************** FAIL: lldb-Unit :: Utility/./UtilityTests/CompletionRequest.DuplicateFiltering (1356 of 1699) ******************** TEST 'lldb-Unit :: Utility/./UtilityTests/CompletionRequest.DuplicateFiltering' FAILED ********************

Hide Details

******************** FAIL: lldb-Unit :: Utility/./UtilityTests/ConstStringTest.CompareConstString (1357 of 1699) ******************** TEST 'lldb-Unit :: Utility/./UtilityTests/ConstStringTest.CompareConstString' FAILED ********************

Hide Details

******************** FAIL: lldb-Unit :: Utility/./UtilityTests/CompletionRequest.TestCompletionOwnership (1358 of 1699) ******************** TEST 'lldb-Unit :: Utility/./UtilityTests/CompletionRequest.TestCompletionOwnership' FAILED ********************

Hide Details

******************** FAIL: lldb-Unit :: Utility/./UtilityTests/CompletionRequest.DuplicateFilteringWithComments (1359 of 1699) ******************** TEST 'lldb-Unit :: Utility/./UtilityTests/CompletionRequest.DuplicateFilteringWithComments' FAILED ********************

Hide Details

******************** FAIL: lldb-Unit :: Utility/./UtilityTests/ConstStringTest.CompareStringRef (1360 of 1699) ******************** TEST 'lldb-Unit :: Utility/./UtilityTests/ConstStringTest.CompareStringRef' FAILED ********************

Hide Details

******************** FAIL: lldb-Unit :: Utility/./UtilityTests/ConstStringTest.FromMidOfBufferStringRef (1361 of 1699) ******************** TEST 'lldb-Unit :: Utility/./UtilityTests/ConstStringTest.FromMidOfBufferStringRef' FAILED ********************

Hide Details

******************** FAIL: lldb-Unit :: Utility/./UtilityTests/ConstStringTest.NullAndEmptyStates (1362 of 1699) ******************** TEST 'lldb-Unit :: Utility/./UtilityTests/ConstStringTest.NullAndEmptyStates' FAILED ********************

Hide Details

******************** FAIL: lldb-Unit :: Utility/./UtilityTests/ConstStringTest.MangledCounterpart (1363 of 1699) ******************** TEST 'lldb-Unit :: Utility/./UtilityTests/ConstStringTest.MangledCounterpart' FAILED ********************

Hide Details

******************** FAIL: lldb-Unit :: Utility/./UtilityTests/ConstStringTest.format_provider (1364 of 1699) ******************** TEST 'lldb-Unit :: Utility/./UtilityTests/ConstStringTest.format_provider' FAILED ********************

Hide Details

******************** FAIL: lldb-Unit :: Utility/./UtilityTests/ConstStringTest.UpdateMangledCounterpart (1365 of 1699) ******************** TEST 'lldb-Unit :: Utility/./UtilityTests/ConstStringTest.UpdateMangledCounterpart' FAILED ********************

Hide Details

******************** FAIL: lldb-Unit :: Utility/./UtilityTests/DataExtractorTest.GetBitfield (1366 of 1699) ******************** TEST 'lldb-Unit :: Utility/./UtilityTests/DataExtractorTest.GetBitfield' FAILED ********************

Hide Details

******************** FAIL: lldb-Unit :: Utility/./UtilityTests/DataExtractorTest.GetMaxS64 (1367 of 1699) ******************** TEST 'lldb-Unit :: Utility/./UtilityTests/DataExtractorTest.GetMaxS64' FAILED ********************

Hide Details

******************** FAIL: lldb-Unit :: Utility/./UtilityTests/DataExtractorTest.GetMaxU64 (1368 of 1699) ******************** TEST 'lldb-Unit :: Utility/./UtilityTests/DataExtractorTest.GetMaxU64' FAILED ********************

Hide Details

******************** FAIL: lldb-Unit :: Utility/./UtilityTests/DataExtractorTest.GetMaxU64_unchecked (1369 of 1699) ******************** TEST 'lldb-Unit :: Utility/./UtilityTests/DataExtractorTest.GetMaxU64_unchecked' FAILED ********************

Hide Details

******************** FAIL: lldb-Unit :: Utility/./UtilityTests/DataExtractorTest.PeekData (1370 of 1699) ******************** TEST 'lldb-Unit :: Utility/./UtilityTests/DataExtractorTest.PeekData' FAILED ********************

Hide Details

******************** FAIL: lldb-Unit :: Utility/./UtilityTests/DeserializerTest.HasData (1371 of 1699) ******************** TEST 'lldb-Unit :: Utility/./UtilityTests/DeserializerTest.HasData' FAILED ********************

Hide Details

******************** FAIL: lldb-Unit :: Utility/./UtilityTests/EnvironmentTest.EnvpConstruction (1372 of 1699) ******************** TEST 'lldb-Unit :: Utility/./UtilityTests/EnvironmentTest.EnvpConstruction' FAILED ********************

Hide Details

******************** FAIL: lldb-Unit :: Utility/./UtilityTests/EnvironmentTest.EnvpConversion (1373 of 1699) ******************** TEST 'lldb-Unit :: Utility/./UtilityTests/EnvironmentTest.EnvpConversion' FAILED ********************

Hide Details

******************** FAIL: lldb-Unit :: Utility/./UtilityTests/EventTest.DumpEventDataBytes (1374 of 1699) ******************** TEST 'lldb-Unit :: Utility/./UtilityTests/EventTest.DumpEventDataBytes' FAILED ********************

Hide Details

******************** FAIL: lldb-Unit :: Utility/./UtilityTests/FileSpecTest.AppendPathComponent (1375 of 1699) ******************** TEST 'lldb-Unit :: Utility/./UtilityTests/FileSpecTest.AppendPathComponent' FAILED ********************

Hide Details

******************** FAIL: lldb-Unit :: Utility/./UtilityTests/FileSpecTest.CopyByAppendingPathComponent (1376 of 1699) ******************** TEST 'lldb-Unit :: Utility/./UtilityTests/FileSpecTest.CopyByAppendingPathComponent' FAILED ********************

Hide Details

******************** FAIL: lldb-Unit :: Utility/./UtilityTests/FileSpecTest.EqualDotsPosix (1377 of 1699) ******************** TEST 'lldb-Unit :: Utility/./UtilityTests/FileSpecTest.EqualDotsPosix' FAILED ********************

Hide Details

******************** FAIL: lldb-Unit :: Utility/./UtilityTests/FileSpecTest.EqualDotsPosixRoot (1378 of 1699) ******************** TEST 'lldb-Unit :: Utility/./UtilityTests/FileSpecTest.EqualDotsPosixRoot' FAILED ********************

Hide Details

******************** FAIL: lldb-Unit :: Utility/./UtilityTests/FileSpecTest.EqualDotsWindows (1379 of 1699) ******************** TEST 'lldb-Unit :: Utility/./UtilityTests/FileSpecTest.EqualDotsWindows' FAILED ********************

Hide Details

******************** FAIL: lldb-Unit :: Utility/./UtilityTests/FileSpecTest.EqualSeparator (1380 of 1699) ******************** TEST 'lldb-Unit :: Utility/./UtilityTests/FileSpecTest.EqualSeparator' FAILED ********************

Hide Details

******************** FAIL: lldb-Unit :: Utility/./UtilityTests/FileSpecTest.FileAndDirectoryComponents (1381 of 1699) ******************** TEST 'lldb-Unit :: Utility/./UtilityTests/FileSpecTest.FileAndDirectoryComponents' FAILED ********************

Hide Details

******************** FAIL: lldb-Unit :: Utility/./UtilityTests/FileSpecTest.FormatFileSpec (1382 of 1699) ******************** TEST 'lldb-Unit :: Utility/./UtilityTests/FileSpecTest.FormatFileSpec' FAILED ********************

Hide Details

******************** FAIL: lldb-Unit :: Utility/./UtilityTests/FileSpecTest.GuessPathStyle (1383 of 1699) ******************** TEST 'lldb-Unit :: Utility/./UtilityTests/FileSpecTest.GuessPathStyle' FAILED ********************

Hide Details

******************** FAIL: lldb-Unit :: Utility/./UtilityTests/FileSpecTest.GetNormalizedPath (1384 of 1699) ******************** TEST 'lldb-Unit :: Utility/./UtilityTests/FileSpecTest.GetNormalizedPath' FAILED ********************

Hide Details

******************** FAIL: lldb-Unit :: Utility/./UtilityTests/FileSpecTest.IsRelative (1385 of 1699) ******************** TEST 'lldb-Unit :: Utility/./UtilityTests/FileSpecTest.IsRelative' FAILED ********************

Hide Details

******************** FAIL: lldb-Unit :: Utility/./UtilityTests/FileSpecTest.RemoveLastPathComponent (1386 of 1699) ******************** TEST 'lldb-Unit :: Utility/./UtilityTests/FileSpecTest.RemoveLastPathComponent' FAILED ********************

Hide Details

******************** FAIL: lldb-Unit :: Utility/./UtilityTests/FileSpecTest.PrependPathComponent (1387 of 1699) ******************** TEST 'lldb-Unit :: Utility/./UtilityTests/FileSpecTest.PrependPathComponent' FAILED ********************

Hide Details

******************** FAIL: lldb-Unit :: Utility/./UtilityTests/Flags.AllClear (1388 of 1699) ******************** TEST 'lldb-Unit :: Utility/./UtilityTests/Flags.AllClear' FAILED ********************

Hide Details

******************** FAIL: lldb-Unit :: Utility/./UtilityTests/Flags.AllSet (1389 of 1699) ******************** TEST 'lldb-Unit :: Utility/./UtilityTests/Flags.AllSet' FAILED ********************

Hide Details

******************** FAIL: lldb-Unit :: Utility/./UtilityTests/Flags.AnyClear (1390 of 1699) ******************** TEST 'lldb-Unit :: Utility/./UtilityTests/Flags.AnyClear' FAILED ********************

Hide Details

******************** FAIL: lldb-Unit :: Utility/./UtilityTests/Flags.AnySet (1391 of 1699) ******************** TEST 'lldb-Unit :: Utility/./UtilityTests/Flags.AnySet' FAILED ********************

Hide Details

******************** FAIL: lldb-Unit :: Utility/./UtilityTests/Flags.Clear (1392 of 1699) ******************** TEST 'lldb-Unit :: Utility/./UtilityTests/Flags.Clear' FAILED ********************

Hide Details

******************** FAIL: lldb-Unit :: Utility/./UtilityTests/Flags.ClearCount (1393 of 1699) ******************** TEST 'lldb-Unit :: Utility/./UtilityTests/Flags.ClearCount' FAILED ********************

Hide Details

******************** FAIL: lldb-Unit :: Utility/./UtilityTests/Flags.GetBitSize (1394 of 1699) ******************** TEST 'lldb-Unit :: Utility/./UtilityTests/Flags.GetBitSize' FAILED ********************

Hide Details

******************** FAIL: lldb-Unit :: Utility/./UtilityTests/Flags.IsClear (1395 of 1699) ******************** TEST 'lldb-Unit :: Utility/./UtilityTests/Flags.IsClear' FAILED ********************

Hide Details

******************** FAIL: lldb-Unit :: Utility/./UtilityTests/Flags.SetCount (1396 of 1699) ******************** TEST 'lldb-Unit :: Utility/./UtilityTests/Flags.SetCount' FAILED ********************

Hide Details

******************** FAIL: lldb-Unit :: Utility/./UtilityTests/Flags.Reset (1397 of 1699) ******************** TEST 'lldb-Unit :: Utility/./UtilityTests/Flags.Reset' FAILED ********************

Hide Details

******************** FAIL: lldb-Unit :: Utility/./UtilityTests/Flags.Test (1398 of 1699) ******************** TEST 'lldb-Unit :: Utility/./UtilityTests/Flags.Test' FAILED ********************

Hide Details

******************** FAIL: lldb-Unit :: Utility/./UtilityTests/GeneratorTest.Create (1399 of 1699) ******************** TEST 'lldb-Unit :: Utility/./UtilityTests/GeneratorTest.Create' FAILED ********************

Hide Details

******************** FAIL: lldb-Unit :: Utility/./UtilityTests/GeneratorTest.Get (1400 of 1699) ******************** TEST 'lldb-Unit :: Utility/./UtilityTests/GeneratorTest.Get' FAILED ********************

Hide Details

******************** FAIL: lldb-Unit :: Utility/./UtilityTests/GeneratorTest.GetOrCreate (1401 of 1699) ******************** TEST 'lldb-Unit :: Utility/./UtilityTests/GeneratorTest.GetOrCreate' FAILED ********************

Hide Details

******************** FAIL: lldb-Unit :: Utility/./UtilityTests/IndexToObjectTest.ObjectForIndex (1402 of 1699) ******************** TEST 'lldb-Unit :: Utility/./UtilityTests/IndexToObjectTest.ObjectForIndex' FAILED ********************

Hide Details

******************** FAIL: lldb-Unit :: Utility/./UtilityTests/JSONTest.Dictionary (1403 of 1699) ******************** TEST 'lldb-Unit :: Utility/./UtilityTests/JSONTest.Dictionary' FAILED ********************

Hide Details

******************** FAIL: lldb-Unit :: Utility/./UtilityTests/JSONTest.Newlines (1404 of 1699) ******************** TEST 'lldb-Unit :: Utility/./UtilityTests/JSONTest.Newlines' FAILED ********************

Hide Details

******************** FAIL: lldb-Unit :: Utility/./UtilityTests/ListenerTest.GetEventImmediate (1405 of 1699) ******************** TEST 'lldb-Unit :: Utility/./UtilityTests/ListenerTest.GetEventImmediate' FAILED ********************

Hide Details

******************** FAIL: lldb-Unit :: Utility/./UtilityTests/ListenerTest.GetEventWait (1406 of 1699) ******************** TEST 'lldb-Unit :: Utility/./UtilityTests/ListenerTest.GetEventWait' FAILED ********************

Hide Details

******************** FAIL: lldb-Unit :: Utility/./UtilityTests/LogChannelEnabledTest.LLDB_LOG_ERROR (1407 of 1699) ******************** TEST 'lldb-Unit :: Utility/./UtilityTests/LogChannelEnabledTest.LLDB_LOG_ERROR' FAILED ********************

Hide Details

******************** FAIL: lldb-Unit :: Utility/./UtilityTests/LogChannelEnabledTest.LogGetLogThread (1408 of 1699) ******************** TEST 'lldb-Unit :: Utility/./UtilityTests/LogChannelEnabledTest.LogGetLogThread' FAILED ********************

Hide Details

******************** FAIL: lldb-Unit :: Utility/./UtilityTests/LogChannelEnabledTest.LogThread (1409 of 1699) ******************** TEST 'lldb-Unit :: Utility/./UtilityTests/LogChannelEnabledTest.LogThread' FAILED ********************

Hide Details

******************** FAIL: lldb-Unit :: Utility/./UtilityTests/LogChannelEnabledTest.LogVerboseThread (1410 of 1699) ******************** TEST 'lldb-Unit :: Utility/./UtilityTests/LogChannelEnabledTest.LogVerboseThread' FAILED ********************

Hide Details

******************** FAIL: lldb-Unit :: Utility/./UtilityTests/LogChannelEnabledTest.log_options (1411 of 1699) ******************** TEST 'lldb-Unit :: Utility/./UtilityTests/LogChannelEnabledTest.log_options' FAILED ********************

Hide Details

******************** FAIL: lldb-Unit :: Utility/./UtilityTests/LogChannelTest.Disable (1412 of 1699) ******************** TEST 'lldb-Unit :: Utility/./UtilityTests/LogChannelTest.Disable' FAILED ********************

Hide Details

******************** FAIL: lldb-Unit :: Utility/./UtilityTests/LogChannelTest.Enable (1413 of 1699) ******************** TEST 'lldb-Unit :: Utility/./UtilityTests/LogChannelTest.Enable' FAILED ********************

Hide Details

******************** FAIL: lldb-Unit :: Utility/./UtilityTests/LogChannelTest.List (1414 of 1699) ******************** TEST 'lldb-Unit :: Utility/./UtilityTests/LogChannelTest.List' FAILED ********************

Hide Details

******************** FAIL: lldb-Unit :: Utility/./UtilityTests/LogTest.LLDB_LOG_nullptr (1415 of 1699) ******************** TEST 'lldb-Unit :: Utility/./UtilityTests/LogTest.LLDB_LOG_nullptr' FAILED ********************

Hide Details

******************** FAIL: lldb-Unit :: Utility/./UtilityTests/LogChannelTest.EnableOptions (1416 of 1699) ******************** TEST 'lldb-Unit :: Utility/./UtilityTests/LogChannelTest.EnableOptions' FAILED ********************

Hide Details

******************** FAIL: lldb-Unit :: Utility/./UtilityTests/LogTest.Register (1417 of 1699) ******************** TEST 'lldb-Unit :: Utility/./UtilityTests/LogTest.Register' FAILED ********************

Hide Details

******************** FAIL: lldb-Unit :: Utility/./UtilityTests/LogTest.Unregister (1418 of 1699) ******************** TEST 'lldb-Unit :: Utility/./UtilityTests/LogTest.Unregister' FAILED ********************

Hide Details

******************** FAIL: lldb-Unit :: Utility/./UtilityTests/NameMatchesTest.Contains (1419 of 1699) ******************** TEST 'lldb-Unit :: Utility/./UtilityTests/NameMatchesTest.Contains' FAILED ********************

Hide Details

******************** FAIL: lldb-Unit :: Utility/./UtilityTests/NameMatchesTest.EndsWith (1420 of 1699) ******************** TEST 'lldb-Unit :: Utility/./UtilityTests/NameMatchesTest.EndsWith' FAILED ********************

Hide Details

******************** FAIL: lldb-Unit :: Utility/./UtilityTests/NameMatchesTest.Equals (1421 of 1699) ******************** TEST 'lldb-Unit :: Utility/./UtilityTests/NameMatchesTest.Equals' FAILED ********************

Hide Details

******************** FAIL: lldb-Unit :: Utility/./UtilityTests/NameMatchesTest.Ignore (1422 of 1699) ******************** TEST 'lldb-Unit :: Utility/./UtilityTests/NameMatchesTest.Ignore' FAILED ********************

Hide Details

******************** FAIL: lldb-Unit :: Utility/./UtilityTests/NameMatchesTest.RegularExpression (1423 of 1699) ******************** TEST 'lldb-Unit :: Utility/./UtilityTests/NameMatchesTest.RegularExpression' FAILED ********************

Hide Details

******************** FAIL: lldb-Unit :: Utility/./UtilityTests/NameMatchesTest.StartsWith (1424 of 1699) ******************** TEST 'lldb-Unit :: Utility/./UtilityTests/NameMatchesTest.StartsWith' FAILED ********************

Hide Details

******************** FAIL: lldb-Unit :: Utility/./UtilityTests/OptionsWithRawTest.ArgsButNoDelimiter (1425 of 1699) ******************** TEST 'lldb-Unit :: Utility/./UtilityTests/OptionsWithRawTest.ArgsButNoDelimiter' FAILED ********************

Hide Details

******************** FAIL: lldb-Unit :: Utility/./UtilityTests/OptionsWithRawTest.ArgsButNoLeadingDash (1426 of 1699) ******************** TEST 'lldb-Unit :: Utility/./UtilityTests/OptionsWithRawTest.ArgsButNoLeadingDash' FAILED ********************

Hide Details

******************** FAIL: lldb-Unit :: Utility/./UtilityTests/OptionsWithRawTest.EmptyInput (1427 of 1699) ******************** TEST 'lldb-Unit :: Utility/./UtilityTests/OptionsWithRawTest.EmptyInput' FAILED ********************

Hide Details

******************** FAIL: lldb-Unit :: Utility/./UtilityTests/OptionsWithRawTest.EmptyArgsOnlySuffix (1428 of 1699) ******************** TEST 'lldb-Unit :: Utility/./UtilityTests/OptionsWithRawTest.EmptyArgsOnlySuffix' FAILED ********************

Hide Details

******************** FAIL: lldb-Unit :: Utility/./UtilityTests/OptionsWithRawTest.EmptySuffix (1429 of 1699) ******************** TEST 'lldb-Unit :: Utility/./UtilityTests/OptionsWithRawTest.EmptySuffix' FAILED ********************

Hide Details

******************** FAIL: lldb-Unit :: Utility/./UtilityTests/OptionsWithRawTest.EmptySuffixSingleWhitespace (1430 of 1699) ******************** TEST 'lldb-Unit :: Utility/./UtilityTests/OptionsWithRawTest.EmptySuffixSingleWhitespace' FAILED ********************

Hide Details

******************** FAIL: lldb-Unit :: Utility/./UtilityTests/OptionsWithRawTest.LeadingSpaceArgs (1431 of 1699) ******************** TEST 'lldb-Unit :: Utility/./UtilityTests/OptionsWithRawTest.LeadingSpaceArgs' FAILED ********************

Hide Details

******************** FAIL: lldb-Unit :: Utility/./UtilityTests/OptionsWithRawTest.MultiWordSuffix (1432 of 1699) ******************** TEST 'lldb-Unit :: Utility/./UtilityTests/OptionsWithRawTest.MultiWordSuffix' FAILED ********************

Hide Details

******************** FAIL: lldb-Unit :: Utility/./UtilityTests/OptionsWithRawTest.SingleWhitespaceInput (1433 of 1699) ******************** TEST 'lldb-Unit :: Utility/./UtilityTests/OptionsWithRawTest.SingleWhitespaceInput' FAILED ********************

Hide Details

******************** FAIL: lldb-Unit :: Utility/./UtilityTests/OptionsWithRawTest.QuotedSuffix (1434 of 1699) ******************** TEST 'lldb-Unit :: Utility/./UtilityTests/OptionsWithRawTest.QuotedSuffix' FAILED ********************

Hide Details

******************** FAIL: lldb-Unit :: Utility/./UtilityTests/OptionsWithRawTest.UnterminatedQuote (1435 of 1699) ******************** TEST 'lldb-Unit :: Utility/./UtilityTests/OptionsWithRawTest.UnterminatedQuote' FAILED ********************

Hide Details

******************** FAIL: lldb-Unit :: Utility/./UtilityTests/OptionsWithRawTest.SingleWordSuffix (1436 of 1699) ******************** TEST 'lldb-Unit :: Utility/./UtilityTests/OptionsWithRawTest.SingleWordSuffix' FAILED ********************

Hide Details

******************** FAIL: lldb-Unit :: Utility/./UtilityTests/OptionsWithRawTest.TerminatedQuote (1437 of 1699) ******************** TEST 'lldb-Unit :: Utility/./UtilityTests/OptionsWithRawTest.TerminatedQuote' FAILED ********************

Hide Details

******************** FAIL: lldb-Unit :: Utility/./UtilityTests/OptionsWithRawTest.WhitespaceInput (1438 of 1699) ******************** TEST 'lldb-Unit :: Utility/./UtilityTests/OptionsWithRawTest.WhitespaceInput' FAILED ********************

Hide Details

******************** FAIL: lldb-Unit :: Utility/./UtilityTests/OptionsWithRawTest.WhitespaceSuffix (1439 of 1699) ******************** TEST 'lldb-Unit :: Utility/./UtilityTests/OptionsWithRawTest.WhitespaceSuffix' FAILED ********************

Hide Details

******************** FAIL: lldb-Unit :: Utility/./UtilityTests/Predicate.WaitForValueEqualTo (1440 of 1699) ******************** TEST 'lldb-Unit :: Utility/./UtilityTests/Predicate.WaitForValueEqualTo' FAILED ********************

Hide Details

******************** FAIL: lldb-Unit :: Utility/./UtilityTests/Predicate.WaitForValueNotEqualTo (1441 of 1699) ******************** TEST 'lldb-Unit :: Utility/./UtilityTests/Predicate.WaitForValueNotEqualTo' FAILED ********************

Hide Details

******************** FAIL: lldb-Unit :: Utility/./UtilityTests/ProcessInfoTest.Constructor (1442 of 1699) ******************** TEST 'lldb-Unit :: Utility/./UtilityTests/ProcessInfoTest.Constructor' FAILED ********************

Hide Details

******************** FAIL: lldb-Unit :: Utility/./UtilityTests/RangeDataVector.FindEntryThatContains (1443 of 1699) ******************** TEST 'lldb-Unit :: Utility/./UtilityTests/RangeDataVector.FindEntryThatContains' FAILED ********************

Hide Details

******************** FAIL: lldb-Unit :: Utility/./UtilityTests/RangeTest.Clear (1444 of 1699) ******************** TEST 'lldb-Unit :: Utility/./UtilityTests/RangeTest.Clear' FAILED ********************

Hide Details

******************** FAIL: lldb-Unit :: Utility/./UtilityTests/RangeDataVector.FindEntryThatContains_Overlap (1445 of 1699) ******************** TEST 'lldb-Unit :: Utility/./UtilityTests/RangeDataVector.FindEntryThatContains_Overlap' FAILED ********************

Hide Details

******************** FAIL: lldb-Unit :: Utility/./UtilityTests/RangeTest.ClearWithStarAddress (1446 of 1699) ******************** TEST 'lldb-Unit :: Utility/./UtilityTests/RangeTest.ClearWithStarAddress' FAILED ********************

Hide Details

******************** FAIL: lldb-Unit :: Utility/./UtilityTests/RangeTest.Constructor (1447 of 1699) ******************** TEST 'lldb-Unit :: Utility/./UtilityTests/RangeTest.Constructor' FAILED ********************

Hide Details

******************** FAIL: lldb-Unit :: Utility/./UtilityTests/RangeTest.ContainsAddr (1448 of 1699) ******************** TEST 'lldb-Unit :: Utility/./UtilityTests/RangeTest.ContainsAddr' FAILED ********************

Hide Details

******************** FAIL: lldb-Unit :: Utility/./UtilityTests/RangeTest.ContainsAddrInvalid (1449 of 1699) ******************** TEST 'lldb-Unit :: Utility/./UtilityTests/RangeTest.ContainsAddrInvalid' FAILED ********************

Hide Details

******************** FAIL: lldb-Unit :: Utility/./UtilityTests/RangeTest.ContainsEndInclusive (1450 of 1699) ******************** TEST 'lldb-Unit :: Utility/./UtilityTests/RangeTest.ContainsEndInclusive' FAILED ********************

Hide Details

******************** FAIL: lldb-Unit :: Utility/./UtilityTests/RangeTest.ContainsRange (1451 of 1699) ******************** TEST 'lldb-Unit :: Utility/./UtilityTests/RangeTest.ContainsRange' FAILED ********************

Hide Details

******************** FAIL: lldb-Unit :: Utility/./UtilityTests/RangeTest.ContainsEndInclusiveInvalid (1452 of 1699) ******************** TEST 'lldb-Unit :: Utility/./UtilityTests/RangeTest.ContainsEndInclusiveInvalid' FAILED ********************

Hide Details

******************** FAIL: lldb-Unit :: Utility/./UtilityTests/RangeTest.ContainsRangeStartingFromZero (1453 of 1699) ******************** TEST 'lldb-Unit :: Utility/./UtilityTests/RangeTest.ContainsRangeStartingFromZero' FAILED ********************

Hide Details

******************** FAIL: lldb-Unit :: Utility/./UtilityTests/RangeTest.DefaultConstructor (1454 of 1699) ******************** TEST 'lldb-Unit :: Utility/./UtilityTests/RangeTest.DefaultConstructor' FAILED ********************

Hide Details

******************** FAIL: lldb-Unit :: Utility/./UtilityTests/RangeTest.Copy (1455 of 1699) ******************** TEST 'lldb-Unit :: Utility/./UtilityTests/RangeTest.Copy' FAILED ********************

Hide Details

******************** FAIL: lldb-Unit :: Utility/./UtilityTests/RangeTest.DoesAdjoinOrIntersect (1456 of 1699) ******************** TEST 'lldb-Unit :: Utility/./UtilityTests/RangeTest.DoesAdjoinOrIntersect' FAILED ********************

Hide Details

******************** FAIL: lldb-Unit :: Utility/./UtilityTests/RangeTest.DoesIntersect (1457 of 1699) ******************** TEST 'lldb-Unit :: Utility/./UtilityTests/RangeTest.DoesIntersect' FAILED ********************

Hide Details

******************** FAIL: lldb-Unit :: Utility/./UtilityTests/RangeTest.Equal (1458 of 1699) ******************** TEST 'lldb-Unit :: Utility/./UtilityTests/RangeTest.Equal' FAILED ********************

Hide Details

******************** FAIL: lldb-Unit :: Utility/./UtilityTests/RangeTest.EqualInvalid (1459 of 1699) ******************** TEST 'lldb-Unit :: Utility/./UtilityTests/RangeTest.EqualInvalid' FAILED ********************

Hide Details

******************** FAIL: lldb-Unit :: Utility/./UtilityTests/RangeTest.LessThanInvalid (1460 of 1699) ******************** TEST 'lldb-Unit :: Utility/./UtilityTests/RangeTest.LessThanInvalid' FAILED ********************

Hide Details

******************** FAIL: lldb-Unit :: Utility/./UtilityTests/RangeTest.NotEqual (1461 of 1699) ******************** TEST 'lldb-Unit :: Utility/./UtilityTests/RangeTest.NotEqual' FAILED ********************

Hide Details

******************** FAIL: lldb-Unit :: Utility/./UtilityTests/RangeTest.LessThan (1462 of 1699) ******************** TEST 'lldb-Unit :: Utility/./UtilityTests/RangeTest.LessThan' FAILED ********************

Hide Details

******************** FAIL: lldb-Unit :: Utility/./UtilityTests/RangeTest.NotEqualInvalid (1463 of 1699) ******************** TEST 'lldb-Unit :: Utility/./UtilityTests/RangeTest.NotEqualInvalid' FAILED ********************

Hide Details

******************** FAIL: lldb-Unit :: Utility/./UtilityTests/RangeTest.SetRangeBase (1464 of 1699) ******************** TEST 'lldb-Unit :: Utility/./UtilityTests/RangeTest.SetRangeBase' FAILED ********************

Hide Details

******************** FAIL: lldb-Unit :: Utility/./UtilityTests/RangeTest.SizeTypes (1465 of 1699) ******************** TEST 'lldb-Unit :: Utility/./UtilityTests/RangeTest.SizeTypes' FAILED ********************

Hide Details

******************** FAIL: lldb-Unit :: Utility/./UtilityTests/RangeTest.Slide (1466 of 1699) ******************** TEST 'lldb-Unit :: Utility/./UtilityTests/RangeTest.Slide' FAILED ********************

Hide Details

******************** FAIL: lldb-Unit :: Utility/./UtilityTests/RangeTest.SlideZero (1467 of 1699) ******************** TEST 'lldb-Unit :: Utility/./UtilityTests/RangeTest.SlideZero' FAILED ********************

Hide Details

******************** FAIL: lldb-Unit :: Utility/./UtilityTests/RangeTest.Union (1468 of 1699) ******************** TEST 'lldb-Unit :: Utility/./UtilityTests/RangeTest.Union' FAILED ********************

Hide Details

******************** FAIL: lldb-Unit :: Utility/./UtilityTests/RecordReplayTest.InstrumentedBar (1469 of 1699) ******************** TEST 'lldb-Unit :: Utility/./UtilityTests/RecordReplayTest.InstrumentedBar' FAILED ********************

Hide Details

******************** FAIL: lldb-Unit :: Utility/./UtilityTests/RecordReplayTest.InstrumentedFoo (1470 of 1699) ******************** TEST 'lldb-Unit :: Utility/./UtilityTests/RecordReplayTest.InstrumentedFoo' FAILED ********************

Hide Details

******************** FAIL: lldb-Unit :: Utility/./UtilityTests/RecordReplayTest.InstrumentedBarRef (1471 of 1699) ******************** TEST 'lldb-Unit :: Utility/./UtilityTests/RecordReplayTest.InstrumentedBarRef' FAILED ********************

Hide Details

******************** FAIL: lldb-Unit :: Utility/./UtilityTests/RecordReplayTest.InstrumentedBarPtr (1472 of 1699) ******************** TEST 'lldb-Unit :: Utility/./UtilityTests/RecordReplayTest.InstrumentedBarPtr' FAILED ********************

Hide Details

******************** FAIL: lldb-Unit :: Utility/./UtilityTests/RecordReplayTest.InstrumentedFooSameThis (1473 of 1699) ******************** TEST 'lldb-Unit :: Utility/./UtilityTests/RecordReplayTest.InstrumentedFooSameThis' FAILED ********************

Hide Details

******************** FAIL: lldb-Unit :: Utility/./UtilityTests/RegisterValueTest.GetSet8 (1474 of 1699) ******************** TEST 'lldb-Unit :: Utility/./UtilityTests/RegisterValueTest.GetSet8' FAILED ********************

Hide Details

******************** FAIL: lldb-Unit :: Utility/./UtilityTests/RegularExpression.CopyAssignment (1475 of 1699) ******************** TEST 'lldb-Unit :: Utility/./UtilityTests/RegularExpression.CopyAssignment' FAILED ********************

Hide Details

******************** FAIL: lldb-Unit :: Utility/./UtilityTests/RegularExpression.Empty (1476 of 1699) ******************** TEST 'lldb-Unit :: Utility/./UtilityTests/RegularExpression.Empty' FAILED ********************

Hide Details

******************** FAIL: lldb-Unit :: Utility/./UtilityTests/RegularExpression.Invalid (1477 of 1699) ******************** TEST 'lldb-Unit :: Utility/./UtilityTests/RegularExpression.Invalid' FAILED ********************

Hide Details

******************** FAIL: lldb-Unit :: Utility/./UtilityTests/RegularExpression.Match (1478 of 1699) ******************** TEST 'lldb-Unit :: Utility/./UtilityTests/RegularExpression.Match' FAILED ********************

Hide Details

******************** FAIL: lldb-Unit :: Utility/./UtilityTests/RegularExpression.Valid (1479 of 1699) ******************** TEST 'lldb-Unit :: Utility/./UtilityTests/RegularExpression.Valid' FAILED ********************

Hide Details

******************** FAIL: lldb-Unit :: Utility/./UtilityTests/ReproducerTest.SetCapture (1480 of 1699) ******************** TEST 'lldb-Unit :: Utility/./UtilityTests/ReproducerTest.SetCapture' FAILED ********************

Hide Details

******************** FAIL: lldb-Unit :: Utility/./UtilityTests/ReproducerTest.SetReplay (1481 of 1699) ******************** TEST 'lldb-Unit :: Utility/./UtilityTests/ReproducerTest.SetReplay' FAILED ********************

Hide Details

******************** FAIL: lldb-Unit :: Utility/./UtilityTests/ScalarTest.APIntConstructor (1482 of 1699) ******************** TEST 'lldb-Unit :: Utility/./UtilityTests/ScalarTest.APIntConstructor' FAILED ********************

Hide Details

******************** FAIL: lldb-Unit :: Utility/./UtilityTests/ScalarTest.CastOperations (1483 of 1699) ******************** TEST 'lldb-Unit :: Utility/./UtilityTests/ScalarTest.CastOperations' FAILED ********************

Hide Details

******************** FAIL: lldb-Unit :: Utility/./UtilityTests/ScalarTest.ComparisonFloat (1484 of 1699) ******************** TEST 'lldb-Unit :: Utility/./UtilityTests/ScalarTest.ComparisonFloat' FAILED ********************

Hide Details

******************** FAIL: lldb-Unit :: Utility/./UtilityTests/ScalarTest.Comparison (1485 of 1699) ******************** TEST 'lldb-Unit :: Utility/./UtilityTests/ScalarTest.Comparison' FAILED ********************

Hide Details

******************** FAIL: lldb-Unit :: Utility/./UtilityTests/ScalarTest.Division (1486 of 1699) ******************** TEST 'lldb-Unit :: Utility/./UtilityTests/ScalarTest.Division' FAILED ********************

Hide Details

******************** FAIL: lldb-Unit :: Utility/./UtilityTests/ScalarTest.Equality (1487 of 1699) ******************** TEST 'lldb-Unit :: Utility/./UtilityTests/ScalarTest.Equality' FAILED ********************

Hide Details

******************** FAIL: lldb-Unit :: Utility/./UtilityTests/ScalarTest.ExtractBitfield (1488 of 1699) ******************** TEST 'lldb-Unit :: Utility/./UtilityTests/ScalarTest.ExtractBitfield' FAILED ********************

Hide Details

******************** FAIL: lldb-Unit :: Utility/./UtilityTests/ScalarTest.GetBytes (1489 of 1699) ******************** TEST 'lldb-Unit :: Utility/./UtilityTests/ScalarTest.GetBytes' FAILED ********************

Hide Details

******************** FAIL: lldb-Unit :: Utility/./UtilityTests/ScalarTest.GetValue (1490 of 1699) ******************** TEST 'lldb-Unit :: Utility/./UtilityTests/ScalarTest.GetValue' FAILED ********************

Hide Details

******************** FAIL: lldb-Unit :: Utility/./UtilityTests/ScalarTest.Scalar_512 (1491 of 1699) ******************** TEST 'lldb-Unit :: Utility/./UtilityTests/ScalarTest.Scalar_512' FAILED ********************

Hide Details

******************** FAIL: lldb-Unit :: Utility/./UtilityTests/ScalarTest.Promotion (1492 of 1699) ******************** TEST 'lldb-Unit :: Utility/./UtilityTests/ScalarTest.Promotion' FAILED ********************

Hide Details

******************** FAIL: lldb-Unit :: Utility/./UtilityTests/ScalarTest.RightShiftOperator (1493 of 1699) ******************** TEST 'lldb-Unit :: Utility/./UtilityTests/ScalarTest.RightShiftOperator' FAILED ********************

Hide Details

******************** FAIL: lldb-Unit :: Utility/./UtilityTests/SerializationRountripTest.SerializeDeserializeCString (1494 of 1699) ******************** TEST 'lldb-Unit :: Utility/./UtilityTests/SerializationRountripTest.SerializeDeserializeCString' FAILED ********************

Hide Details

******************** FAIL: lldb-Unit :: Utility/./UtilityTests/ScalarTest.SetValueFromCString (1495 of 1699) ******************** TEST 'lldb-Unit :: Utility/./UtilityTests/ScalarTest.SetValueFromCString' FAILED ********************

Hide Details

******************** FAIL: lldb-Unit :: Utility/./UtilityTests/SerializationRountripTest.SerializeDeserializeObjectPointer (1496 of 1699) ******************** TEST 'lldb-Unit :: Utility/./UtilityTests/SerializationRountripTest.SerializeDeserializeObjectPointer' FAILED ********************

Hide Details

******************** FAIL: lldb-Unit :: Utility/./UtilityTests/SerializationRountripTest.SerializeDeserializeObjectReference (1497 of 1699) ******************** TEST 'lldb-Unit :: Utility/./UtilityTests/SerializationRountripTest.SerializeDeserializeObjectReference' FAILED ********************

Hide Details

******************** FAIL: lldb-Unit :: Utility/./UtilityTests/SerializationRountripTest.SerializeDeserializePod (1498 of 1699) ******************** TEST 'lldb-Unit :: Utility/./UtilityTests/SerializationRountripTest.SerializeDeserializePod' FAILED ********************

Hide Details

******************** FAIL: lldb-Unit :: Utility/./UtilityTests/SerializationRountripTest.SerializeDeserializePodPointers (1499 of 1699) ******************** TEST 'lldb-Unit :: Utility/./UtilityTests/SerializationRountripTest.SerializeDeserializePodPointers' FAILED ********************

Hide Details

******************** FAIL: lldb-Unit :: Utility/./UtilityTests/StateTest.Formatv (1500 of 1699) ******************** TEST 'lldb-Unit :: Utility/./UtilityTests/StateTest.Formatv' FAILED ********************

Hide Details

******************** FAIL: lldb-Unit :: Utility/./UtilityTests/SerializationRountripTest.SerializeDeserializePodReferences (1501 of 1699) ******************** TEST 'lldb-Unit :: Utility/./UtilityTests/SerializationRountripTest.SerializeDeserializePodReferences' FAILED ********************

Hide Details

******************** FAIL: lldb-Unit :: Utility/./UtilityTests/StatusTest.ErrorConversion (1502 of 1699) ******************** TEST 'lldb-Unit :: Utility/./UtilityTests/StatusTest.ErrorConversion' FAILED ********************

Hide Details

******************** FAIL: lldb-Unit :: Utility/./UtilityTests/StatusTest.ErrorConstructor (1503 of 1699) ******************** TEST 'lldb-Unit :: Utility/./UtilityTests/StatusTest.ErrorConstructor' FAILED ********************

Hide Details

******************** FAIL: lldb-Unit :: Utility/./UtilityTests/StatusTest.Formatv (1504 of 1699) ******************** TEST 'lldb-Unit :: Utility/./UtilityTests/StatusTest.Formatv' FAILED ********************

Hide Details

******************** FAIL: lldb-Unit :: Utility/./UtilityTests/StreamTeeTest.AppendStream (1505 of 1699) ******************** TEST 'lldb-Unit :: Utility/./UtilityTests/StreamTeeTest.AppendStream' FAILED ********************

Hide Details

******************** FAIL: lldb-Unit :: Utility/./UtilityTests/StreamTeeTest.Assignment (1506 of 1699) ******************** TEST 'lldb-Unit :: Utility/./UtilityTests/StreamTeeTest.Assignment' FAILED ********************

Hide Details

******************** FAIL: lldb-Unit :: Utility/./UtilityTests/StreamTeeTest.Constructor1Stream (1507 of 1699) ******************** TEST 'lldb-Unit :: Utility/./UtilityTests/StreamTeeTest.Constructor1Stream' FAILED ********************

Hide Details

******************** FAIL: lldb-Unit :: Utility/./UtilityTests/StreamTeeTest.Constructor2Streams (1508 of 1699) ******************** TEST 'lldb-Unit :: Utility/./UtilityTests/StreamTeeTest.Constructor2Streams' FAILED ********************

Hide Details

******************** FAIL: lldb-Unit :: Utility/./UtilityTests/StreamTeeTest.CopyConstructor (1509 of 1699) ******************** TEST 'lldb-Unit :: Utility/./UtilityTests/StreamTeeTest.CopyConstructor' FAILED ********************

Hide Details

******************** FAIL: lldb-Unit :: Utility/./UtilityTests/StreamTeeTest.Flush (1510 of 1699) ******************** TEST 'lldb-Unit :: Utility/./UtilityTests/StreamTeeTest.Flush' FAILED ********************

Hide Details

******************** FAIL: lldb-Unit :: Utility/./UtilityTests/StreamTeeTest.GetStreamAtIndexOutOfBounds (1511 of 1699) ******************** TEST 'lldb-Unit :: Utility/./UtilityTests/StreamTeeTest.GetStreamAtIndexOutOfBounds' FAILED ********************

Hide Details

******************** FAIL: lldb-Unit :: Utility/./UtilityTests/StreamTeeTest.DefaultConstructor (1512 of 1699) ******************** TEST 'lldb-Unit :: Utility/./UtilityTests/StreamTeeTest.DefaultConstructor' FAILED ********************

Hide Details

******************** FAIL: lldb-Unit :: Utility/./UtilityTests/StreamTeeTest.GetStreamAtIndexOutOfBoundsEmpty (1513 of 1699) ******************** TEST 'lldb-Unit :: Utility/./UtilityTests/StreamTeeTest.GetStreamAtIndexOutOfBoundsEmpty' FAILED ********************

Hide Details

******************** FAIL: lldb-Unit :: Utility/./UtilityTests/StreamTeeTest.SetStreamAtIndexOutOfBounds (1514 of 1699) ******************** TEST 'lldb-Unit :: Utility/./UtilityTests/StreamTeeTest.SetStreamAtIndexOutOfBounds' FAILED ********************

Hide Details

******************** FAIL: lldb-Unit :: Utility/./UtilityTests/StreamTeeTest.SetStreamAtIndexOverwrite (1515 of 1699) ******************** TEST 'lldb-Unit :: Utility/./UtilityTests/StreamTeeTest.SetStreamAtIndexOverwrite' FAILED ********************

Hide Details

******************** FAIL: lldb-Unit :: Utility/./UtilityTests/StreamTeeTest.Write (1516 of 1699) ******************** TEST 'lldb-Unit :: Utility/./UtilityTests/StreamTeeTest.Write' FAILED ********************

Hide Details

******************** FAIL: lldb-Unit :: Utility/./UtilityTests/StreamTest.ChangingByteOrder (1517 of 1699) ******************** TEST 'lldb-Unit :: Utility/./UtilityTests/StreamTest.ChangingByteOrder' FAILED ********************

Hide Details

******************** FAIL: lldb-Unit :: Utility/./UtilityTests/StreamTest.PutBytesAsRawHex8ToLittleEndian (1518 of 1699) ******************** TEST 'lldb-Unit :: Utility/./UtilityTests/StreamTest.PutBytesAsRawHex8ToLittleEndian' FAILED ********************

Hide Details

******************** FAIL: lldb-Unit :: Utility/./UtilityTests/StreamTest.PutBytesAsRawHex8ToBigEndian (1519 of 1699) ******************** TEST 'lldb-Unit :: Utility/./UtilityTests/StreamTest.PutBytesAsRawHex8ToBigEndian' FAILED ********************

Hide Details

******************** FAIL: lldb-Unit :: Utility/./UtilityTests/StreamTest.PutBytesAsRawHex8ToMixedEndian (1520 of 1699) ******************** TEST 'lldb-Unit :: Utility/./UtilityTests/StreamTest.PutBytesAsRawHex8ToMixedEndian' FAILED ********************

Hide Details

******************** FAIL: lldb-Unit :: Utility/./UtilityTests/StreamTest.PutCString (1521 of 1699) ******************** TEST 'lldb-Unit :: Utility/./UtilityTests/StreamTest.PutCString' FAILED ********************

Hide Details

******************** FAIL: lldb-Unit :: Utility/./UtilityTests/StreamTest.PutCStringWithStringRef (1522 of 1699) ******************** TEST 'lldb-Unit :: Utility/./UtilityTests/StreamTest.PutCStringWithStringRef' FAILED ********************

Hide Details

******************** FAIL: lldb-Unit :: Utility/./UtilityTests/StreamTest.PutChar (1523 of 1699) ******************** TEST 'lldb-Unit :: Utility/./UtilityTests/StreamTest.PutChar' FAILED ********************

Hide Details

******************** FAIL: lldb-Unit :: Utility/./UtilityTests/StreamTest.PutCharNull (1524 of 1699) ******************** TEST 'lldb-Unit :: Utility/./UtilityTests/StreamTest.PutCharNull' FAILED ********************

Hide Details

******************** FAIL: lldb-Unit :: Utility/./UtilityTests/StreamTest.PutCharWhitespace (1525 of 1699) ******************** TEST 'lldb-Unit :: Utility/./UtilityTests/StreamTest.PutCharWhitespace' FAILED ********************

Hide Details

******************** FAIL: lldb-Unit :: Utility/./UtilityTests/StreamTest.PutHex16ByteOrderBig (1526 of 1699) ******************** TEST 'lldb-Unit :: Utility/./UtilityTests/StreamTest.PutHex16ByteOrderBig' FAILED ********************

Hide Details

******************** FAIL: lldb-Unit :: Utility/./UtilityTests/StreamTest.PutHex16ByteOrderLittle (1527 of 1699) ******************** TEST 'lldb-Unit :: Utility/./UtilityTests/StreamTest.PutHex16ByteOrderLittle' FAILED ********************

Hide Details

******************** FAIL: lldb-Unit :: Utility/./UtilityTests/StreamTest.PutHex32ByteOrderBig (1528 of 1699) ******************** TEST 'lldb-Unit :: Utility/./UtilityTests/StreamTest.PutHex32ByteOrderBig' FAILED ********************

Hide Details

******************** FAIL: lldb-Unit :: Utility/./UtilityTests/StreamTest.PutHex32ByteOrderLittle (1529 of 1699) ******************** TEST 'lldb-Unit :: Utility/./UtilityTests/StreamTest.PutHex32ByteOrderLittle' FAILED ********************

Hide Details

******************** FAIL: lldb-Unit :: Utility/./UtilityTests/StreamTest.PutHex64ByteOrderBig (1530 of 1699) ******************** TEST 'lldb-Unit :: Utility/./UtilityTests/StreamTest.PutHex64ByteOrderBig' FAILED ********************

Hide Details

******************** FAIL: lldb-Unit :: Utility/./UtilityTests/StreamTest.PutHex64ByteOrderLittle (1531 of 1699) ******************** TEST 'lldb-Unit :: Utility/./UtilityTests/StreamTest.PutHex64ByteOrderLittle' FAILED ********************

Hide Details

******************** FAIL: lldb-Unit :: Utility/./UtilityTests/StreamTest.PutMaxHex64ByteOrderBig (1532 of 1699) ******************** TEST 'lldb-Unit :: Utility/./UtilityTests/StreamTest.PutMaxHex64ByteOrderBig' FAILED ********************

Hide Details

******************** FAIL: lldb-Unit :: Utility/./UtilityTests/StreamTest.PutMaxHex64ByteOrderLittle (1533 of 1699) ******************** TEST 'lldb-Unit :: Utility/./UtilityTests/StreamTest.PutMaxHex64ByteOrderLittle' FAILED ********************

Hide Details

******************** FAIL: lldb-Unit :: Utility/./UtilityTests/StreamTest.PutHex8 (1534 of 1699) ******************** TEST 'lldb-Unit :: Utility/./UtilityTests/StreamTest.PutHex8' FAILED ********************

Hide Details

******************** FAIL: lldb-Unit :: Utility/./UtilityTests/StreamTest.PutPtr (1535 of 1699) ******************** TEST 'lldb-Unit :: Utility/./UtilityTests/StreamTest.PutPtr' FAILED ********************

Hide Details

******************** FAIL: lldb-Unit :: Utility/./UtilityTests/StreamTest.PutNHex8 (1536 of 1699) ******************** TEST 'lldb-Unit :: Utility/./UtilityTests/StreamTest.PutNHex8' FAILED ********************

Hide Details

******************** FAIL: lldb-Unit :: Utility/./UtilityTests/StreamTest.PutRawBytesToBigEndian (1537 of 1699) ******************** TEST 'lldb-Unit :: Utility/./UtilityTests/StreamTest.PutRawBytesToBigEndian' FAILED ********************

Hide Details

******************** FAIL: lldb-Unit :: Utility/./UtilityTests/StreamTest.PutRawBytesToLittleEndian (1538 of 1699) ******************** TEST 'lldb-Unit :: Utility/./UtilityTests/StreamTest.PutRawBytesToLittleEndian' FAILED ********************

Hide Details

******************** FAIL: lldb-Unit :: Utility/./UtilityTests/StreamTest.PutRawBytesToMixedEndian (1539 of 1699) ******************** TEST 'lldb-Unit :: Utility/./UtilityTests/StreamTest.PutRawBytesToMixedEndian' FAILED ********************

Hide Details

******************** FAIL: lldb-Unit :: Utility/./UtilityTests/StreamTest.PutSLEB128 (1540 of 1699) ******************** TEST 'lldb-Unit :: Utility/./UtilityTests/StreamTest.PutSLEB128' FAILED ********************

Hide Details

******************** FAIL: lldb-Unit :: Utility/./UtilityTests/StreamTest.PutStringAsRawHex8 (1541 of 1699) ******************** TEST 'lldb-Unit :: Utility/./UtilityTests/StreamTest.PutStringAsRawHex8' FAILED ********************

Hide Details

******************** FAIL: lldb-Unit :: Utility/./UtilityTests/StreamTest.PutULEB128 (1542 of 1699) ******************** TEST 'lldb-Unit :: Utility/./UtilityTests/StreamTest.PutULEB128' FAILED ********************

Hide Details

******************** FAIL: lldb-Unit :: Utility/./UtilityTests/StreamTest.QuotedCString (1543 of 1699) ******************** TEST 'lldb-Unit :: Utility/./UtilityTests/StreamTest.QuotedCString' FAILED ********************

Hide Details

******************** FAIL: lldb-Unit :: Utility/./UtilityTests/StreamTest.ShiftOperatorChars (1544 of 1699) ******************** TEST 'lldb-Unit :: Utility/./UtilityTests/StreamTest.ShiftOperatorChars' FAILED ********************

Hide Details

******************** FAIL: lldb-Unit :: Utility/./UtilityTests/StreamTest.ShiftOperatorInts (1545 of 1699) ******************** TEST 'lldb-Unit :: Utility/./UtilityTests/StreamTest.ShiftOperatorInts' FAILED ********************

Hide Details

******************** FAIL: lldb-Unit :: Utility/./UtilityTests/StreamTest.ShiftOperatorPtr (1546 of 1699) ******************** TEST 'lldb-Unit :: Utility/./UtilityTests/StreamTest.ShiftOperatorPtr' FAILED ********************

Hide Details

******************** FAIL: lldb-Unit :: Utility/./UtilityTests/StreamTest.ShiftOperatorStrings (1547 of 1699) ******************** TEST 'lldb-Unit :: Utility/./UtilityTests/StreamTest.ShiftOperatorStrings' FAILED ********************

Hide Details

******************** FAIL: lldb-Unit :: Utility/./UtilityTests/StreamTest.ShiftOperatorUInts (1548 of 1699) ******************** TEST 'lldb-Unit :: Utility/./UtilityTests/StreamTest.ShiftOperatorUInts' FAILED ********************

Hide Details

******************** FAIL: lldb-Unit :: Utility/./UtilityTests/StringExtractorTest.DecodeHexU8_Extra (1549 of 1699) ******************** TEST 'lldb-Unit :: Utility/./UtilityTests/StringExtractorTest.DecodeHexU8_Extra' FAILED ********************

Hide Details

******************** FAIL: lldb-Unit :: Utility/./UtilityTests/StringExtractorTest.DecodeHexU8_Exact (1550 of 1699) ******************** TEST 'lldb-Unit :: Utility/./UtilityTests/StringExtractorTest.DecodeHexU8_Exact' FAILED ********************

Hide Details

******************** FAIL: lldb-Unit :: Utility/./UtilityTests/StringExtractorTest.DecodeHexU8_InvalidHex (1551 of 1699) ******************** TEST 'lldb-Unit :: Utility/./UtilityTests/StringExtractorTest.DecodeHexU8_InvalidHex' FAILED ********************

Hide Details

******************** FAIL: lldb-Unit :: Utility/./UtilityTests/StringExtractorTest.DecodeHexU8_InvalidHex2 (1552 of 1699) ******************** TEST 'lldb-Unit :: Utility/./UtilityTests/StringExtractorTest.DecodeHexU8_InvalidHex2' FAILED ********************

Hide Details

******************** FAIL: lldb-Unit :: Utility/./UtilityTests/StringExtractorTest.DecodeHexU8_Underflow (1553 of 1699) ******************** TEST 'lldb-Unit :: Utility/./UtilityTests/StringExtractorTest.DecodeHexU8_Underflow' FAILED ********************

Hide Details

******************** FAIL: lldb-Unit :: Utility/./UtilityTests/StringExtractorTest.DecodeHexU8_Underflow2 (1554 of 1699) ******************** TEST 'lldb-Unit :: Utility/./UtilityTests/StringExtractorTest.DecodeHexU8_Underflow2' FAILED ********************

Hide Details

******************** FAIL: lldb-Unit :: Utility/./UtilityTests/StringExtractorTest.GetHexBytes (1555 of 1699) ******************** TEST 'lldb-Unit :: Utility/./UtilityTests/StringExtractorTest.GetHexBytes' FAILED ********************

Hide Details

******************** FAIL: lldb-Unit :: Utility/./UtilityTests/StringExtractorTest.GetHexBytesAvail (1556 of 1699) ******************** TEST 'lldb-Unit :: Utility/./UtilityTests/StringExtractorTest.GetHexBytesAvail' FAILED ********************

Hide Details

******************** FAIL: lldb-Unit :: Utility/./UtilityTests/StringExtractorTest.GetHexBytesAvail_FullString (1557 of 1699) ******************** TEST 'lldb-Unit :: Utility/./UtilityTests/StringExtractorTest.GetHexBytesAvail_FullString' FAILED ********************

Hide Details

******************** FAIL: lldb-Unit :: Utility/./UtilityTests/StringExtractorTest.GetHexBytesAvail_OddPair (1558 of 1699) ******************** TEST 'lldb-Unit :: Utility/./UtilityTests/StringExtractorTest.GetHexBytesAvail_OddPair' FAILED ********************

Hide Details

******************** FAIL: lldb-Unit :: Utility/./UtilityTests/StringExtractorTest.GetHexBytesAvail_OddPair2 (1559 of 1699) ******************** TEST 'lldb-Unit :: Utility/./UtilityTests/StringExtractorTest.GetHexBytesAvail_OddPair2' FAILED ********************

Hide Details

******************** FAIL: lldb-Unit :: Utility/./UtilityTests/StringExtractorTest.GetHexBytesAvail_Partial (1560 of 1699) ******************** TEST 'lldb-Unit :: Utility/./UtilityTests/StringExtractorTest.GetHexBytesAvail_Partial' FAILED ********************

Hide Details

******************** FAIL: lldb-Unit :: Utility/./UtilityTests/StringExtractorTest.GetHexBytesAvail_Underflow (1561 of 1699) ******************** TEST 'lldb-Unit :: Utility/./UtilityTests/StringExtractorTest.GetHexBytesAvail_Underflow' FAILED ********************

Hide Details

******************** FAIL: lldb-Unit :: Utility/./UtilityTests/StringExtractorTest.GetHexBytes_FullString (1562 of 1699) ******************** TEST 'lldb-Unit :: Utility/./UtilityTests/StringExtractorTest.GetHexBytes_FullString' FAILED ********************

Hide Details

******************** FAIL: lldb-Unit :: Utility/./UtilityTests/StringExtractorTest.GetHexBytes_OddPair (1563 of 1699) ******************** TEST 'lldb-Unit :: Utility/./UtilityTests/StringExtractorTest.GetHexBytes_OddPair' FAILED ********************

Hide Details

******************** FAIL: lldb-Unit :: Utility/./UtilityTests/StringExtractorTest.GetHexBytes_OddPair2 (1564 of 1699) ******************** TEST 'lldb-Unit :: Utility/./UtilityTests/StringExtractorTest.GetHexBytes_OddPair2' FAILED ********************

Hide Details

******************** FAIL: lldb-Unit :: Utility/./UtilityTests/StringExtractorTest.GetHexBytes_Partial (1565 of 1699) ******************** TEST 'lldb-Unit :: Utility/./UtilityTests/StringExtractorTest.GetHexBytes_Partial' FAILED ********************

Hide Details

******************** FAIL: lldb-Unit :: Utility/./UtilityTests/StringExtractorTest.GetHexBytes_Underflow (1566 of 1699) ******************** TEST 'lldb-Unit :: Utility/./UtilityTests/StringExtractorTest.GetHexBytes_Underflow' FAILED ********************

Hide Details

******************** FAIL: lldb-Unit :: Utility/./UtilityTests/StringExtractorTest.GetHexU8_Exact (1567 of 1699) ******************** TEST 'lldb-Unit :: Utility/./UtilityTests/StringExtractorTest.GetHexU8_Exact' FAILED ********************

Hide Details

******************** FAIL: lldb-Unit :: Utility/./UtilityTests/StringExtractorTest.GetHexU8_Exact_NoEof (1568 of 1699) ******************** TEST 'lldb-Unit :: Utility/./UtilityTests/StringExtractorTest.GetHexU8_Exact_NoEof' FAILED ********************

Hide Details

******************** FAIL: lldb-Unit :: Utility/./UtilityTests/StringExtractorTest.GetHexU8_Extra (1569 of 1699) ******************** TEST 'lldb-Unit :: Utility/./UtilityTests/StringExtractorTest.GetHexU8_Extra' FAILED ********************

Hide Details

******************** FAIL: lldb-Unit :: Utility/./UtilityTests/StringExtractorTest.GetHexU8_Extra_NoEof (1570 of 1699) ******************** TEST 'lldb-Unit :: Utility/./UtilityTests/StringExtractorTest.GetHexU8_Extra_NoEof' FAILED ********************

Hide Details

******************** FAIL: lldb-Unit :: Utility/./UtilityTests/StringExtractorTest.GetHexU8_InvalidHex (1571 of 1699) ******************** TEST 'lldb-Unit :: Utility/./UtilityTests/StringExtractorTest.GetHexU8_InvalidHex' FAILED ********************

Hide Details

******************** FAIL: lldb-Unit :: Utility/./UtilityTests/StringExtractorTest.GetHexU8_InvalidHex_NoEof (1572 of 1699) ******************** TEST 'lldb-Unit :: Utility/./UtilityTests/StringExtractorTest.GetHexU8_InvalidHex_NoEof' FAILED ********************

Hide Details

******************** FAIL: lldb-Unit :: Utility/./UtilityTests/StringExtractorTest.GetHexU8_Underflow (1573 of 1699) ******************** TEST 'lldb-Unit :: Utility/./UtilityTests/StringExtractorTest.GetHexU8_Underflow' FAILED ********************

Hide Details

******************** FAIL: lldb-Unit :: Utility/./UtilityTests/StringExtractorTest.GetHexU8_Underflow2 (1574 of 1699) ******************** TEST 'lldb-Unit :: Utility/./UtilityTests/StringExtractorTest.GetHexU8_Underflow2' FAILED ********************

Hide Details

******************** FAIL: lldb-Unit :: Utility/./UtilityTests/StringExtractorTest.GetHexU8_Underflow2_NoEof (1575 of 1699) ******************** TEST 'lldb-Unit :: Utility/./UtilityTests/StringExtractorTest.GetHexU8_Underflow2_NoEof' FAILED ********************

Hide Details

******************** FAIL: lldb-Unit :: Utility/./UtilityTests/StringExtractorTest.GetHexU8_Underflow_NoEof (1576 of 1699) ******************** TEST 'lldb-Unit :: Utility/./UtilityTests/StringExtractorTest.GetHexU8_Underflow_NoEof' FAILED ********************

Hide Details

******************** FAIL: lldb-Unit :: Utility/./UtilityTests/StringExtractorTest.GetNameColonValueContainsColon (1577 of 1699) ******************** TEST 'lldb-Unit :: Utility/./UtilityTests/StringExtractorTest.GetNameColonValueContainsColon' FAILED ********************

Hide Details

******************** FAIL: lldb-Unit :: Utility/./UtilityTests/StringExtractorTest.GetNameColonValueNoColon (1578 of 1699) ******************** TEST 'lldb-Unit :: Utility/./UtilityTests/StringExtractorTest.GetNameColonValueNoColon' FAILED ********************

Hide Details

******************** FAIL: lldb-Unit :: Utility/./UtilityTests/StringExtractorTest.GetNameColonValueNoSemicolon (1579 of 1699) ******************** TEST 'lldb-Unit :: Utility/./UtilityTests/StringExtractorTest.GetNameColonValueNoSemicolon' FAILED ********************

Hide Details

******************** FAIL: lldb-Unit :: Utility/./UtilityTests/StringExtractorTest.GetNameColonValueSuccess (1580 of 1699) ******************** TEST 'lldb-Unit :: Utility/./UtilityTests/StringExtractorTest.GetNameColonValueSuccess' FAILED ********************

Hide Details

******************** FAIL: lldb-Unit :: Utility/./UtilityTests/StringExtractorTest.GetU32BigEndian (1581 of 1699) ******************** TEST 'lldb-Unit :: Utility/./UtilityTests/StringExtractorTest.GetU32BigEndian' FAILED ********************

Hide Details

******************** FAIL: lldb-Unit :: Utility/./UtilityTests/StringExtractorTest.GetU32LittleEndian (1582 of 1699) ******************** TEST 'lldb-Unit :: Utility/./UtilityTests/StringExtractorTest.GetU32LittleEndian' FAILED ********************

Hide Details

******************** FAIL: lldb-Unit :: Utility/./UtilityTests/StringExtractorTest.GetU64BigEndian (1583 of 1699) ******************** TEST 'lldb-Unit :: Utility/./UtilityTests/StringExtractorTest.GetU64BigEndian' FAILED ********************

Hide Details

******************** FAIL: lldb-Unit :: Utility/./UtilityTests/StringExtractorTest.GetU64LittleEndian (1584 of 1699) ******************** TEST 'lldb-Unit :: Utility/./UtilityTests/StringExtractorTest.GetU64LittleEndian' FAILED ********************

Hide Details

******************** FAIL: lldb-Unit :: Utility/./UtilityTests/StringExtractorTest.InitEmpty (1585 of 1699) ******************** TEST 'lldb-Unit :: Utility/./UtilityTests/StringExtractorTest.InitEmpty' FAILED ********************

Hide Details

******************** FAIL: lldb-Unit :: Utility/./UtilityTests/StringExtractorTest.InitMisc (1586 of 1699) ******************** TEST 'lldb-Unit :: Utility/./UtilityTests/StringExtractorTest.InitMisc' FAILED ********************

Hide Details

******************** FAIL: lldb-Unit :: Utility/./UtilityTests/StringLexerTest.AdvanceIf (1587 of 1699) ******************** TEST 'lldb-Unit :: Utility/./UtilityTests/StringLexerTest.AdvanceIf' FAILED ********************

Hide Details

******************** FAIL: lldb-Unit :: Utility/./UtilityTests/StringLexerTest.GetUnlexed (1588 of 1699) ******************** TEST 'lldb-Unit :: Utility/./UtilityTests/StringLexerTest.GetUnlexed' FAILED ********************

Hide Details

******************** FAIL: lldb-Unit :: Utility/./UtilityTests/StringLexerTest.HasAtLeast (1589 of 1699) ******************** TEST 'lldb-Unit :: Utility/./UtilityTests/StringLexerTest.HasAtLeast' FAILED ********************

Hide Details

******************** FAIL: lldb-Unit :: Utility/./UtilityTests/StringLexerTest.Next (1590 of 1699) ******************** TEST 'lldb-Unit :: Utility/./UtilityTests/StringLexerTest.Next' FAILED ********************

Hide Details

******************** FAIL: lldb-Unit :: Utility/./UtilityTests/StringLexerTest.NextIf (1591 of 1699) ******************** TEST 'lldb-Unit :: Utility/./UtilityTests/StringLexerTest.NextIf' FAILED ********************

Hide Details

******************** FAIL: lldb-Unit :: Utility/./UtilityTests/StringLexerTest.NextIfList (1592 of 1699) ******************** TEST 'lldb-Unit :: Utility/./UtilityTests/StringLexerTest.NextIfList' FAILED ********************

Hide Details

******************** FAIL: lldb-Unit :: Utility/./UtilityTests/StringLexerTest.Peek (1593 of 1699) ******************** TEST 'lldb-Unit :: Utility/./UtilityTests/StringLexerTest.Peek' FAILED ********************

Hide Details

******************** FAIL: lldb-Unit :: Utility/./UtilityTests/StringLexerTest.PutBack (1594 of 1699) ******************** TEST 'lldb-Unit :: Utility/./UtilityTests/StringLexerTest.PutBack' FAILED ********************

Hide Details

******************** FAIL: lldb-Unit :: Utility/./UtilityTests/StringListTest.AppendList (1595 of 1699) ******************** TEST 'lldb-Unit :: Utility/./UtilityTests/StringListTest.AppendList' FAILED ********************

Hide Details

******************** FAIL: lldb-Unit :: Utility/./UtilityTests/StringListTest.AppendListCStringArray (1596 of 1699) ******************** TEST 'lldb-Unit :: Utility/./UtilityTests/StringListTest.AppendListCStringArray' FAILED ********************

Hide Details

******************** FAIL: lldb-Unit :: Utility/./UtilityTests/StringListTest.AppendListCStringArrayEmpty (1597 of 1699) ******************** TEST 'lldb-Unit :: Utility/./UtilityTests/StringListTest.AppendListCStringArrayEmpty' FAILED ********************

Hide Details

******************** FAIL: lldb-Unit :: Utility/./UtilityTests/StringListTest.AppendStringCString (1598 of 1699) ******************** TEST 'lldb-Unit :: Utility/./UtilityTests/StringListTest.AppendStringCString' FAILED ********************

Hide Details

******************** FAIL: lldb-Unit :: Utility/./UtilityTests/StringListTest.AppendStringStdString (1599 of 1699) ******************** TEST 'lldb-Unit :: Utility/./UtilityTests/StringListTest.AppendStringStdString' FAILED ********************

Hide Details

******************** FAIL: lldb-Unit :: Utility/./UtilityTests/StringListTest.AppendStringMove (1600 of 1699) ******************** TEST 'lldb-Unit :: Utility/./UtilityTests/StringListTest.AppendStringMove' FAILED ********************

Hide Details

******************** FAIL: lldb-Unit :: Utility/./UtilityTests/StringListTest.Assignment (1601 of 1699) ******************** TEST 'lldb-Unit :: Utility/./UtilityTests/StringListTest.Assignment' FAILED ********************

Hide Details

******************** FAIL: lldb-Unit :: Utility/./UtilityTests/StringListTest.Clear (1602 of 1699) ******************** TEST 'lldb-Unit :: Utility/./UtilityTests/StringListTest.Clear' FAILED ********************

Hide Details

******************** FAIL: lldb-Unit :: Utility/./UtilityTests/StringListTest.CopyList (1603 of 1699) ******************** TEST 'lldb-Unit :: Utility/./UtilityTests/StringListTest.CopyList' FAILED ********************

Hide Details

******************** FAIL: lldb-Unit :: Utility/./UtilityTests/StringListTest.CopyListEmpty (1604 of 1699) ******************** TEST 'lldb-Unit :: Utility/./UtilityTests/StringListTest.CopyListEmpty' FAILED ********************

Hide Details

******************** FAIL: lldb-Unit :: Utility/./UtilityTests/StringListTest.CopyListSingle (1605 of 1699) ******************** TEST 'lldb-Unit :: Utility/./UtilityTests/StringListTest.CopyListSingle' FAILED ********************

Hide Details

******************** FAIL: lldb-Unit :: Utility/./UtilityTests/StringListTest.DefaultConstructor (1606 of 1699) ******************** TEST 'lldb-Unit :: Utility/./UtilityTests/StringListTest.DefaultConstructor' FAILED ********************

Hide Details

******************** FAIL: lldb-Unit :: Utility/./UtilityTests/StringListTest.ForRange (1607 of 1699) ******************** TEST 'lldb-Unit :: Utility/./UtilityTests/StringListTest.ForRange' FAILED ********************

Hide Details

******************** FAIL: lldb-Unit :: Utility/./UtilityTests/StringListTest.ForRangeEmpty (1608 of 1699) ******************** TEST 'lldb-Unit :: Utility/./UtilityTests/StringListTest.ForRangeEmpty' FAILED ********************

Hide Details

******************** FAIL: lldb-Unit :: Utility/./UtilityTests/StringListTest.GetMaxStringLengthDecreasingSize (1609 of 1699) ******************** TEST 'lldb-Unit :: Utility/./UtilityTests/StringListTest.GetMaxStringLengthDecreasingSize' FAILED ********************

Hide Details

******************** FAIL: lldb-Unit :: Utility/./UtilityTests/StringListTest.GetMaxStringLengthEmpty (1610 of 1699) ******************** TEST 'lldb-Unit :: Utility/./UtilityTests/StringListTest.GetMaxStringLengthEmpty' FAILED ********************

Hide Details

******************** FAIL: lldb-Unit :: Utility/./UtilityTests/StringListTest.GetMaxStringLengthEqualSize (1611 of 1699) ******************** TEST 'lldb-Unit :: Utility/./UtilityTests/StringListTest.GetMaxStringLengthEqualSize' FAILED ********************

Hide Details

******************** FAIL: lldb-Unit :: Utility/./UtilityTests/StringListTest.GetMaxStringLengthMixed (1612 of 1699) ******************** TEST 'lldb-Unit :: Utility/./UtilityTests/StringListTest.GetMaxStringLengthMixed' FAILED ********************

Hide Details

******************** FAIL: lldb-Unit :: Utility/./UtilityTests/StringListTest.GetMaxStringLengthIncreasingSize (1613 of 1699) ******************** TEST 'lldb-Unit :: Utility/./UtilityTests/StringListTest.GetMaxStringLengthIncreasingSize' FAILED ********************

Hide Details

******************** FAIL: lldb-Unit :: Utility/./UtilityTests/StringListTest.GetSize (1614 of 1699) ******************** TEST 'lldb-Unit :: Utility/./UtilityTests/StringListTest.GetSize' FAILED ********************

Hide Details

******************** FAIL: lldb-Unit :: Utility/./UtilityTests/StringListTest.InsertStringAtIndexEnd (1615 of 1699) ******************** TEST 'lldb-Unit :: Utility/./UtilityTests/StringListTest.InsertStringAtIndexEnd' FAILED ********************

Hide Details

******************** FAIL: lldb-Unit :: Utility/./UtilityTests/StringListTest.InsertStringAtIndexMove (1616 of 1699) ******************** TEST 'lldb-Unit :: Utility/./UtilityTests/StringListTest.InsertStringAtIndexMove' FAILED ********************

Hide Details

******************** FAIL: lldb-Unit :: Utility/./UtilityTests/StringListTest.InsertStringAtIndexOutOfBounds (1617 of 1699) ******************** TEST 'lldb-Unit :: Utility/./UtilityTests/StringListTest.InsertStringAtIndexOutOfBounds' FAILED ********************

Hide Details

******************** FAIL: lldb-Unit :: Utility/./UtilityTests/StringListTest.InsertStringAtIndexStart (1618 of 1699) ******************** TEST 'lldb-Unit :: Utility/./UtilityTests/StringListTest.InsertStringAtIndexStart' FAILED ********************

Hide Details

******************** FAIL: lldb-Unit :: Utility/./UtilityTests/StringListTest.InsertStringAtIndexStdString (1619 of 1699) ******************** TEST 'lldb-Unit :: Utility/./UtilityTests/StringListTest.InsertStringAtIndexStdString' FAILED ********************

Hide Details

******************** FAIL: lldb-Unit :: Utility/./UtilityTests/StringListTest.Join (1620 of 1699) ******************** TEST 'lldb-Unit :: Utility/./UtilityTests/StringListTest.Join' FAILED ********************

Hide Details

******************** FAIL: lldb-Unit :: Utility/./UtilityTests/StringListTest.JoinEmpty (1621 of 1699) ******************** TEST 'lldb-Unit :: Utility/./UtilityTests/StringListTest.JoinEmpty' FAILED ********************

Hide Details

******************** FAIL: lldb-Unit :: Utility/./UtilityTests/StringListTest.JoinMultiCharSeparator (1622 of 1699) ******************** TEST 'lldb-Unit :: Utility/./UtilityTests/StringListTest.JoinMultiCharSeparator' FAILED ********************

Hide Details

******************** FAIL: lldb-Unit :: Utility/./UtilityTests/StringListTest.JoinNonSpace (1623 of 1699) ******************** TEST 'lldb-Unit :: Utility/./UtilityTests/StringListTest.JoinNonSpace' FAILED ********************

Hide Details

******************** FAIL: lldb-Unit :: Utility/./UtilityTests/StringListTest.JoinSingle (1624 of 1699) ******************** TEST 'lldb-Unit :: Utility/./UtilityTests/StringListTest.JoinSingle' FAILED ********************

Hide Details

******************** FAIL: lldb-Unit :: Utility/./UtilityTests/StringListTest.JoinThree (1625 of 1699) ******************** TEST 'lldb-Unit :: Utility/./UtilityTests/StringListTest.JoinThree' FAILED ********************

Hide Details

******************** FAIL: lldb-Unit :: Utility/./UtilityTests/StringListTest.LongestCommonPrefix (1626 of 1699) ******************** TEST 'lldb-Unit :: Utility/./UtilityTests/StringListTest.LongestCommonPrefix' FAILED ********************

Hide Details

******************** FAIL: lldb-Unit :: Utility/./UtilityTests/StringListTest.LongestCommonPrefixDuplicateElement (1627 of 1699) ******************** TEST 'lldb-Unit :: Utility/./UtilityTests/StringListTest.LongestCommonPrefixDuplicateElement' FAILED ********************

Hide Details

******************** FAIL: lldb-Unit :: Utility/./UtilityTests/StringListTest.LongestCommonPrefixEmpty (1628 of 1699) ******************** TEST 'lldb-Unit :: Utility/./UtilityTests/StringListTest.LongestCommonPrefixEmpty' FAILED ********************

Hide Details

******************** FAIL: lldb-Unit :: Utility/./UtilityTests/StringListTest.LongestCommonPrefixNoPrefix (1629 of 1699) ******************** TEST 'lldb-Unit :: Utility/./UtilityTests/StringListTest.LongestCommonPrefixNoPrefix' FAILED ********************

Hide Details

******************** FAIL: lldb-Unit :: Utility/./UtilityTests/StringListTest.LongestCommonPrefixSingleElement (1630 of 1699) ******************** TEST 'lldb-Unit :: Utility/./UtilityTests/StringListTest.LongestCommonPrefixSingleElement' FAILED ********************

Hide Details

******************** FAIL: lldb-Unit :: Utility/./UtilityTests/StringListTest.PopBack (1631 of 1699) ******************** TEST 'lldb-Unit :: Utility/./UtilityTests/StringListTest.PopBack' FAILED ********************

Hide Details

******************** FAIL: lldb-Unit :: Utility/./UtilityTests/StringListTest.RemoveBlankLines (1632 of 1699) ******************** TEST 'lldb-Unit :: Utility/./UtilityTests/StringListTest.RemoveBlankLines' FAILED ********************

Hide Details

******************** FAIL: lldb-Unit :: Utility/./UtilityTests/StringListTest.SetSize (1633 of 1699) ******************** TEST 'lldb-Unit :: Utility/./UtilityTests/StringListTest.SetSize' FAILED ********************

Hide Details

******************** FAIL: lldb-Unit :: Utility/./UtilityTests/StringListTest.ShiftCString (1634 of 1699) ******************** TEST 'lldb-Unit :: Utility/./UtilityTests/StringListTest.ShiftCString' FAILED ********************

Hide Details

******************** FAIL: lldb-Unit :: Utility/./UtilityTests/StringListTest.ShiftMove (1635 of 1699) ******************** TEST 'lldb-Unit :: Utility/./UtilityTests/StringListTest.ShiftMove' FAILED ********************

Hide Details

******************** FAIL: lldb-Unit :: Utility/./UtilityTests/StringListTest.ShiftStdString (1636 of 1699) ******************** TEST 'lldb-Unit :: Utility/./UtilityTests/StringListTest.ShiftStdString' FAILED ********************

Hide Details

******************** FAIL: lldb-Unit :: Utility/./UtilityTests/StringListTest.SplitIntoLines (1637 of 1699) ******************** TEST 'lldb-Unit :: Utility/./UtilityTests/StringListTest.SplitIntoLines' FAILED ********************

Hide Details

******************** FAIL: lldb-Unit :: Utility/./UtilityTests/StringListTest.SplitIntoLinesEmpty (1638 of 1699) ******************** TEST 'lldb-Unit :: Utility/./UtilityTests/StringListTest.SplitIntoLinesEmpty' FAILED ********************

Hide Details

******************** FAIL: lldb-Unit :: Utility/./UtilityTests/StructuredDataTest.ParseJSONFromFile (1639 of 1699) ******************** TEST 'lldb-Unit :: Utility/./UtilityTests/StructuredDataTest.ParseJSONFromFile' FAILED ********************

Hide Details

******************** FAIL: lldb-Unit :: Utility/./UtilityTests/StringListTest.SplitIntoLinesSingleTrailingCR (1640 of 1699) ******************** TEST 'lldb-Unit :: Utility/./UtilityTests/StringListTest.SplitIntoLinesSingleTrailingCR' FAILED ********************

Hide Details

******************** FAIL: lldb-Unit :: Utility/./UtilityTests/StructuredDataTest.StringDump (1641 of 1699) ******************** TEST 'lldb-Unit :: Utility/./UtilityTests/StructuredDataTest.StringDump' FAILED ********************

Hide Details

******************** FAIL: lldb-Unit :: Utility/./UtilityTests/TildeExpressionResolver.ResolveFullPath (1642 of 1699) ******************** TEST 'lldb-Unit :: Utility/./UtilityTests/TildeExpressionResolver.ResolveFullPath' FAILED ********************

Hide Details

******************** FAIL: lldb-Unit :: Utility/./UtilityTests/TimeoutTest.Construction (1643 of 1699) ******************** TEST 'lldb-Unit :: Utility/./UtilityTests/TimeoutTest.Construction' FAILED ********************

Hide Details

******************** FAIL: lldb-Unit :: Utility/./UtilityTests/TimeoutTest.Format (1644 of 1699) ******************** TEST 'lldb-Unit :: Utility/./UtilityTests/TimeoutTest.Format' FAILED ********************

Hide Details

******************** FAIL: lldb-Unit :: Utility/./UtilityTests/TimerTest.CategoryTimes (1645 of 1699) ******************** TEST 'lldb-Unit :: Utility/./UtilityTests/TimerTest.CategoryTimes' FAILED ********************

Hide Details

******************** FAIL: lldb-Unit :: Utility/./UtilityTests/TimerTest.CategoryTimes2 (1646 of 1699) ******************** TEST 'lldb-Unit :: Utility/./UtilityTests/TimerTest.CategoryTimes2' FAILED ********************

Hide Details

******************** FAIL: lldb-Unit :: Utility/./UtilityTests/TimerTest.CategoryTimesNested (1647 of 1699) ******************** TEST 'lldb-Unit :: Utility/./UtilityTests/TimerTest.CategoryTimesNested' FAILED ********************

Hide Details

******************** FAIL: lldb-Unit :: Utility/./UtilityTests/TimerTest.CategoryTimesStats (1648 of 1699) ******************** TEST 'lldb-Unit :: Utility/./UtilityTests/TimerTest.CategoryTimesStats' FAILED ********************

Hide Details

******************** FAIL: lldb-Unit :: Utility/./UtilityTests/UUIDTest.RelationalOperators (1649 of 1699) ******************** TEST 'lldb-Unit :: Utility/./UtilityTests/UUIDTest.RelationalOperators' FAILED ********************

Hide Details

******************** FAIL: lldb-Unit :: Utility/./UtilityTests/UUIDTest.SetFromStringRef (1650 of 1699) ******************** TEST 'lldb-Unit :: Utility/./UtilityTests/UUIDTest.SetFromStringRef' FAILED ********************

Hide Details

******************** FAIL: lldb-Unit :: Utility/./UtilityTests/UUIDTest.StringConverion (1651 of 1699) ******************** TEST 'lldb-Unit :: Utility/./UtilityTests/UUIDTest.StringConverion' FAILED ********************

Hide Details

******************** FAIL: lldb-Unit :: Utility/./UtilityTests/UUIDTest.Validity (1652 of 1699) ******************** TEST 'lldb-Unit :: Utility/./UtilityTests/UUIDTest.Validity' FAILED ********************

Hide Details

******************** FAIL: lldb-Unit :: Utility/./UtilityTests/UriParserTest.BadPort2 (1653 of 1699) ******************** TEST 'lldb-Unit :: Utility/./UtilityTests/UriParserTest.BadPort2' FAILED ********************

Hide Details

******************** FAIL: lldb-Unit :: Utility/./UtilityTests/UriParserTest.BadPort (1654 of 1699) ******************** TEST 'lldb-Unit :: Utility/./UtilityTests/UriParserTest.BadPort' FAILED ********************

Hide Details

******************** FAIL: lldb-Unit :: Utility/./UtilityTests/UriParserTest.BracketedHostname (1655 of 1699) ******************** TEST 'lldb-Unit :: Utility/./UtilityTests/UriParserTest.BracketedHostname' FAILED ********************

Hide Details

******************** FAIL: lldb-Unit :: Utility/./UtilityTests/UriParserTest.BracketedHostnamePort (1656 of 1699) ******************** TEST 'lldb-Unit :: Utility/./UtilityTests/UriParserTest.BracketedHostnamePort' FAILED ********************

Hide Details

******************** FAIL: lldb-Unit :: Utility/./UtilityTests/UriParserTest.BracketedHostnameWithColon (1657 of 1699) ******************** TEST 'lldb-Unit :: Utility/./UtilityTests/UriParserTest.BracketedHostnameWithColon' FAILED ********************

Hide Details

******************** FAIL: lldb-Unit :: Utility/./UtilityTests/UriParserTest.Empty (1658 of 1699) ******************** TEST 'lldb-Unit :: Utility/./UtilityTests/UriParserTest.Empty' FAILED ********************

Hide Details

******************** FAIL: lldb-Unit :: Utility/./UtilityTests/UriParserTest.LongPath (1659 of 1699) ******************** TEST 'lldb-Unit :: Utility/./UtilityTests/UriParserTest.LongPath' FAILED ********************

Hide Details

******************** FAIL: lldb-Unit :: Utility/./UtilityTests/UriParserTest.Minimal (1660 of 1699) ******************** TEST 'lldb-Unit :: Utility/./UtilityTests/UriParserTest.Minimal' FAILED ********************

Hide Details

******************** FAIL: lldb-Unit :: Utility/./UtilityTests/UriParserTest.MinimalPath (1661 of 1699) ******************** TEST 'lldb-Unit :: Utility/./UtilityTests/UriParserTest.MinimalPath' FAILED ********************

Hide Details

******************** FAIL: lldb-Unit :: Utility/./UtilityTests/UriParserTest.MinimalPort (1662 of 1699) ******************** TEST 'lldb-Unit :: Utility/./UtilityTests/UriParserTest.MinimalPort' FAILED ********************

Hide Details

******************** FAIL: lldb-Unit :: Utility/./UtilityTests/UriParserTest.MinimalPortPath (1663 of 1699) ******************** TEST 'lldb-Unit :: Utility/./UtilityTests/UriParserTest.MinimalPortPath' FAILED ********************

Hide Details

******************** FAIL: lldb-Unit :: Utility/./UtilityTests/UriParserTest.PortOverflow (1664 of 1699) ******************** TEST 'lldb-Unit :: Utility/./UtilityTests/UriParserTest.PortOverflow' FAILED ********************

Hide Details

******************** FAIL: lldb-Unit :: Utility/./UtilityTests/UriParserTest.SchemeHostSeparator (1665 of 1699) ******************** TEST 'lldb-Unit :: Utility/./UtilityTests/UriParserTest.SchemeHostSeparator' FAILED ********************

Hide Details

******************** FAIL: lldb-Unit :: Utility/./UtilityTests/UriParserTest.SchemeHostSeparator2 (1666 of 1699) ******************** TEST 'lldb-Unit :: Utility/./UtilityTests/UriParserTest.SchemeHostSeparator2' FAILED ********************

Hide Details

******************** FAIL: lldb-Unit :: Utility/./UtilityTests/UriParserTest.SchemeHostSeparator3 (1667 of 1699) ******************** TEST 'lldb-Unit :: Utility/./UtilityTests/UriParserTest.SchemeHostSeparator3' FAILED ********************

Hide Details

******************** FAIL: lldb-Unit :: Utility/./UtilityTests/UriParserTest.SchemeHostSeparator4 (1668 of 1699) ******************** TEST 'lldb-Unit :: Utility/./UtilityTests/UriParserTest.SchemeHostSeparator4' FAILED ********************

Hide Details

******************** FAIL: lldb-Unit :: Utility/./UtilityTests/UriParserTest.TypicalPortPath (1669 of 1699) ******************** TEST 'lldb-Unit :: Utility/./UtilityTests/UriParserTest.TypicalPortPath' FAILED ********************

Hide Details

******************** FAIL: lldb-Unit :: Utility/./UtilityTests/UserIDResolver.GetGroupName (1670 of 1699) ******************** TEST 'lldb-Unit :: Utility/./UtilityTests/UserIDResolver.GetGroupName' FAILED ********************

Hide Details

******************** FAIL: lldb-Unit :: Utility/./UtilityTests/UserIDResolver.GetUserName (1671 of 1699) ******************** TEST 'lldb-Unit :: Utility/./UtilityTests/UserIDResolver.GetUserName' FAILED ********************

Hide Details

******************** FAIL: lldb-Unit :: Utility/./UtilityTests/VASprintfTest.BufferResize (1672 of 1699) ******************** TEST 'lldb-Unit :: Utility/./UtilityTests/VASprintfTest.BufferResize' FAILED ********************

Hide Details

******************** FAIL: lldb-Unit :: Utility/./UtilityTests/VASprintfTest.EncodingError (1673 of 1699) ******************** TEST 'lldb-Unit :: Utility/./UtilityTests/VASprintfTest.EncodingError' FAILED ********************

Hide Details

******************** FAIL: lldb-Unit :: Utility/./UtilityTests/VASprintfTest.NoBufferResize (1674 of 1699) ******************** TEST 'lldb-Unit :: Utility/./UtilityTests/VASprintfTest.NoBufferResize' FAILED ********************

Hide Details

******************** FAIL: lldb-Unit :: Utility/./UtilityTests/VMRange.Clear (1675 of 1699) ******************** TEST 'lldb-Unit :: Utility/./UtilityTests/VMRange.Clear' FAILED ********************

Hide Details

******************** FAIL: lldb-Unit :: Utility/./UtilityTests/VMRange.CollectionContains (1676 of 1699) ******************** TEST 'lldb-Unit :: Utility/./UtilityTests/VMRange.CollectionContains' FAILED ********************

Hide Details

******************** FAIL: lldb-Unit :: Utility/./UtilityTests/VMRange.Comparison (1677 of 1699) ******************** TEST 'lldb-Unit :: Utility/./UtilityTests/VMRange.Comparison' FAILED ********************

Hide Details

******************** FAIL: lldb-Unit :: Utility/./UtilityTests/VMRange.ContainsAddr (1678 of 1699) ******************** TEST 'lldb-Unit :: Utility/./UtilityTests/VMRange.ContainsAddr' FAILED ********************

Hide Details

******************** FAIL: lldb-Unit :: Utility/./UtilityTests/VMRange.ContainsRange (1679 of 1699) ******************** TEST 'lldb-Unit :: Utility/./UtilityTests/VMRange.ContainsRange' FAILED ********************

Hide Details

******************** FAIL: lldb-Unit :: Utility/./UtilityTests/VMRange.IsValid (1680 of 1699) ******************** TEST 'lldb-Unit :: Utility/./UtilityTests/VMRange.IsValid' FAILED ********************

Hide Details

******************** FAIL: lldb-Unit :: Utility/./UtilityTests/VMRange.Reset (1681 of 1699) ******************** TEST 'lldb-Unit :: Utility/./UtilityTests/VMRange.Reset' FAILED ********************

Hide Details

******************** FAIL: lldb-Unit :: Utility/./UtilityTests/VMRange.Ordering (1682 of 1699) ******************** TEST 'lldb-Unit :: Utility/./UtilityTests/VMRange.Ordering' FAILED ********************

Hide Details

******************** FAIL: lldb-Unit :: Utility/./UtilityTests/VMRange.SetEndAddress (1683 of 1699) ******************** TEST 'lldb-Unit :: Utility/./UtilityTests/VMRange.SetEndAddress' FAILED ********************

Hide Details

******************** FAIL: lldb-Unit :: debugserver/./debugserverTests/RNBSocket.AnyListen (1684 of 1699) ******************** TEST 'lldb-Unit :: debugserver/./debugserverTests/RNBSocket.AnyListen' FAILED ********************

Hide Details

******************** FAIL: lldb-Unit :: debugserver/./debugserverTests/RNBSocket.LoopBackConnectIPv4 (1685 of 1699) ******************** TEST 'lldb-Unit :: debugserver/./debugserverTests/RNBSocket.LoopBackConnectIPv4' FAILED ********************

Hide Details

******************** FAIL: lldb-Unit :: debugserver/./debugserverTests/RNBSocket.LoopBackConnectIPv6 (1686 of 1699) ******************** TEST 'lldb-Unit :: debugserver/./debugserverTests/RNBSocket.LoopBackConnectIPv6' FAILED ********************

Hide Details

******************** FAIL: lldb-Unit :: debugserver/./debugserverTests/RNBSocket.LoopBackListenIPv4 (1687 of 1699) ******************** TEST 'lldb-Unit :: debugserver/./debugserverTests/RNBSocket.LoopBackListenIPv4' FAILED ********************

Hide Details

******************** FAIL: lldb-Unit :: debugserver/./debugserverTests/RNBSocket.LoopBackListenIPv6 (1688 of 1699) ******************** TEST 'lldb-Unit :: debugserver/./debugserverTests/RNBSocket.LoopBackListenIPv6' FAILED ********************

Hide Details

******************** FAIL: lldb-Unit :: tools/lldb-server/tests/./LLDBServerTests/StandardStartupTest.TestStopReplyContainsThreadPcs (1689 of 1699) ******************** TEST 'lldb-Unit :: tools/lldb-server/tests/./LLDBServerTests/StandardStartupTest.TestStopReplyContainsThreadPcs' FAILED ********************

Hide Details

******************** FAIL: lldb-Unit :: tools/lldb-server/tests/./LLDBServerTests/TestBase.DebugserverEnv (1690 of 1699) ******************** TEST 'lldb-Unit :: tools/lldb-server/tests/./LLDBServerTests/TestBase.DebugserverEnv' FAILED ********************

Hide Details

******************** FAIL: lldb-Unit :: tools/lldb-server/tests/./LLDBServerTests/TestBase.LaunchModePreservesEnvironment (1691 of 1699) ******************** TEST 'lldb-Unit :: tools/lldb-server/tests/./LLDBServerTests/TestBase.LaunchModePreservesEnvironment' FAILED ********************

Hide Details

******************** TIMEOUT: LLDB :: ExecControl/StopHook/stop-hook.test (1692 of 1699) ******************** TEST 'LLDB :: ExecControl/StopHook/stop-hook.test' FAILED ******************** Script: -- : 'RUN: at line 1'; /Users/buildslave/jenkins/workspace/lldb-cmake-matrix/lldb-build/bin/clang -isysroot /Applications/Xcode.app/Contents/Developer/Platforms/MacOSX.platform/Developer/SDKs/MacOSX.sdk /Users/buildslave/jenkins/workspace/lldb-cmake-matrix/llvm-project/lldb/lit/ExecControl/StopHook/Inputs/stop-hook.c -g -o /Users/buildslave/jenkins/workspace/lldb-cmake-matrix/lldb-build/tools/lldb/lit/ExecControl/StopHook/Output/stop-hook.test.tmp : 'RUN: at line 3'; /Users/buildslave/jenkins/workspace/lldb-cmake-matrix/lldb-build/bin/lldb --no-lldbinit -S /Users/buildslave/jenkins/workspace/lldb-cmake-matrix/lldb-build/tools/lldb/lit/lit-lldb-init -b -s /Users/buildslave/jenkins/workspace/lldb-cmake-matrix/llvm-project/lldb/lit/ExecControl/StopHook/Inputs/stop-hook-1.lldbinit -s /Users/buildslave/jenkins/workspace/lldb-cmake-matrix/llvm-project/lldb/lit/ExecControl/StopHook/stop-hook.test -f /Users/buildslave/jenkins/workspace/lldb-cmake-matrix/lldb-build/tools/lldb/lit/ExecControl/StopHook/Output/stop-hook.test.tmp | /Users/buildslave/jenkins/workspace/lldb-cmake-matrix/lldb-build/bin/FileCheck --check-prefix=CHECK --check-prefix=CHECK-FUNC /Users/buildslave/jenkins/workspace/lldb-cmake-matrix/llvm-project/lldb/lit/ExecControl/StopHook/stop-hook.test : 'RUN: at line 6'; /Users/buildslave/jenkins/workspace/lldb-cmake-matrix/lldb-build/bin/lldb --no-lldbinit -S /Users/buildslave/jenkins/workspace/lldb-cmake-matrix/lldb-build/tools/lldb/lit/lit-lldb-init -b -s /Users/buildslave/jenkins/workspace/lldb-cmake-matrix/llvm-project/lldb/lit/ExecControl/StopHook/Inputs/stop-hook-2.lldbinit -s /Users/buildslave/jenkins/workspace/lldb-cmake-matrix/llvm-project/lldb/lit/ExecControl/StopHook/stop-hook.test -f /Users/buildslave/jenkins/workspace/lldb-cmake-matrix/lldb-build/tools/lldb/lit/ExecControl/StopHook/Output/stop-hook.test.tmp | /Users/buildslave/jenkins/workspace/lldb-cmake-matrix/lldb-build/bin/FileCheck /Users/buildslave/jenkins/workspace/lldb-cmake-matrix/llvm-project/lldb/lit/ExecControl/StopHook/stop-hook.test : 'RUN: at line 8'; /Users/buildslave/jenkins/workspace/lldb-cmake-matrix/lldb-build/bin/lldb --no-lldbinit -S /Users/buildslave/jenkins/workspace/lldb-cmake-matrix/lldb-build/tools/lldb/lit/lit-lldb-init -b -s /Users/buildslave/jenkins/workspace/lldb-cmake-matrix/llvm-project/lldb/lit/ExecControl/StopHook/Inputs/stop-hook-3.lldbinit -s /Users/buildslave/jenkins/workspace/lldb-cmake-matrix/llvm-project/lldb/lit/ExecControl/StopHook/stop-hook.test -f /Users/buildslave/jenkins/workspace/lldb-cmake-matrix/lldb-build/tools/lldb/lit/ExecControl/StopHook/Output/stop-hook.test.tmp | /Users/buildslave/jenkins/workspace/lldb-cmake-matrix/lldb-build/bin/FileCheck /Users/buildslave/jenkins/workspace/lldb-cmake-matrix/llvm-project/lldb/lit/ExecControl/StopHook/stop-hook.test -- Exit Code: -9 Timeout: Reached timeout of 600 seconds

Hide Details

Hide Details

******************** TIMEOUT: LLDB :: Reproducer/TestReuseDirectory.test (1693 of 1699) ******************** TEST 'LLDB :: Reproducer/TestReuseDirectory.test' FAILED ******************** Script: -- : 'RUN: at line 6'; rm -rf /Users/buildslave/jenkins/workspace/lldb-cmake-matrix/lldb-build/tools/lldb/lit/Reproducer/Output/TestReuseDirectory.test.tmp.repro : 'RUN: at line 7'; /Users/buildslave/jenkins/workspace/lldb-cmake-matrix/lldb-build/bin/clang -isysroot /Applications/Xcode.app/Contents/Developer/Platforms/MacOSX.platform/Developer/SDKs/MacOSX.sdk /Users/buildslave/jenkins/workspace/lldb-cmake-matrix/llvm-project/lldb/lit/Reproducer/Inputs/simple.c -g -o /Users/buildslave/jenkins/workspace/lldb-cmake-matrix/lldb-build/tools/lldb/lit/Reproducer/Output/TestReuseDirectory.test.tmp.out : 'RUN: at line 8'; /Users/buildslave/jenkins/workspace/lldb-cmake-matrix/lldb-build/bin/lldb --no-lldbinit -S /Users/buildslave/jenkins/workspace/lldb-cmake-matrix/lldb-build/tools/lldb/lit/lit-lldb-init -x -b -s /Users/buildslave/jenkins/workspace/lldb-cmake-matrix/llvm-project/lldb/lit/Reproducer/Inputs/GDBRemoteCapture.in --capture --capture-path /Users/buildslave/jenkins/workspace/lldb-cmake-matrix/lldb-build/tools/lldb/lit/Reproducer/Output/TestReuseDirectory.test.tmp.repro /Users/buildslave/jenkins/workspace/lldb-cmake-matrix/lldb-build/tools/lldb/lit/Reproducer/Output/TestReuseDirectory.test.tmp.out | /Users/buildslave/jenkins/workspace/lldb-cmake-matrix/lldb-build/bin/FileCheck /Users/buildslave/jenkins/workspace/lldb-cmake-matrix/llvm-project/lldb/lit/Reproducer/TestGDBRemoteRepro.test --check-prefix CHECK --check-prefix CAPTURE : 'RUN: at line 9'; /Users/buildslave/jenkins/workspace/lldb-cmake-matrix/lldb-build/bin/lldb --no-lldbinit -S /Users/buildslave/jenkins/workspace/lldb-cmake-matrix/lldb-build/tools/lldb/lit/lit-lldb-init -x -b -s /Users/buildslave/jenkins/workspace/lldb-cmake-matrix/llvm-project/lldb/lit/Reproducer/Inputs/GDBRemoteCapture.in --capture --capture-path /Users/buildslave/jenkins/workspace/lldb-cmake-matrix/lldb-build/tools/lldb/lit/Reproducer/Output/TestReuseDirectory.test.tmp.repro /Users/buildslave/jenkins/workspace/lldb-cmake-matrix/lldb-build/tools/lldb/lit/Reproducer/Output/TestReuseDirectory.test.tmp.out | /Users/buildslave/jenkins/workspace/lldb-cmake-matrix/lldb-build/bin/FileCheck /Users/buildslave/jenkins/workspace/lldb-cmake-matrix/llvm-project/lldb/lit/Reproducer/TestGDBRemoteRepro.test --check-prefix CHECK --check-prefix CAPTURE : 'RUN: at line 10'; /Users/buildslave/jenkins/workspace/lldb-cmake-matrix/lldb-build/bin/lldb --no-lldbinit -S /Users/buildslave/jenkins/workspace/lldb-cmake-matrix/lldb-build/tools/lldb/lit/lit-lldb-init --replay /Users/buildslave/jenkins/workspace/lldb-cmake-matrix/lldb-build/tools/lldb/lit/Reproducer/Output/TestReuseDirectory.test.tmp.repro | /Users/buildslave/jenkins/workspace/lldb-cmake-matrix/lldb-build/bin/FileCheck /Users/buildslave/jenkins/workspace/lldb-cmake-matrix/llvm-project/lldb/lit/Reproducer/TestGDBRemoteRepro.test --check-prefix CHECK --check-prefix REPLAY : 'RUN: at line 15'; rm -rf /Users/buildslave/jenkins/workspace/lldb-cmake-matrix/lldb-build/tools/lldb/lit/Reproducer/Output/TestReuseDirectory.test.tmp.repro_moved : 'RUN: at line 16'; mv /Users/buildslave/jenkins/workspace/lldb-cmake-matrix/lldb-build/tools/lldb/lit/Reproducer/Output/TestReuseDirectory.test.tmp.repro /Users/buildslave/jenkins/workspace/lldb-cmake-matrix/lldb-build/tools/lldb/lit/Reproducer/Output/TestReuseDirectory.test.tmp.repro_moved : 'RUN: at line 17'; /Users/buildslave/jenkins/workspace/lldb-cmake-matrix/lldb-build/bin/lldb --no-lldbinit -S /Users/buildslave/jenkins/workspace/lldb-cmake-matrix/lldb-build/tools/lldb/lit/lit-lldb-init --replay /Users/buildslave/jenkins/workspace/lldb-cmake-matrix/lldb-build/tools/lldb/lit/Reproducer/Output/TestReuseDirectory.test.tmp.repro_moved | /Users/buildslave/jenkins/workspace/lldb-cmake-matrix/lldb-build/bin/FileCheck /Users/buildslave/jenkins/workspace/lldb-cmake-matrix/llvm-project/lldb/lit/Reproducer/TestGDBRemoteRepro.test --check-prefix CHECK --check-prefix REPLAY -- Exit Code: -9 Timeout: Reached timeout of 600 seconds

Hide Details

Hide Details

******************** TIMEOUT: LLDB :: SymbolFile/Breakpad/stack-cfi-parsing.test (1694 of 1699) ******************** TEST 'LLDB :: SymbolFile/Breakpad/stack-cfi-parsing.test' FAILED ******************** Script: -- : 'RUN: at line 1'; /Users/buildslave/jenkins/workspace/lldb-cmake-matrix/lldb-build/bin/yaml2obj /Users/buildslave/jenkins/workspace/lldb-cmake-matrix/llvm-project/lldb/lit/SymbolFile/Breakpad/Inputs/stack-cfi-parsing.yaml > /Users/buildslave/jenkins/workspace/lldb-cmake-matrix/lldb-build/tools/lldb/lit/SymbolFile/Breakpad/Output/stack-cfi-parsing.test.tmp : 'RUN: at line 2'; /Users/buildslave/jenkins/workspace/lldb-cmake-matrix/lldb-build/bin/lldb --no-lldbinit -S /Users/buildslave/jenkins/workspace/lldb-cmake-matrix/lldb-build/tools/lldb/lit/lit-lldb-init -c /Users/buildslave/jenkins/workspace/lldb-cmake-matrix/lldb-build/tools/lldb/lit/SymbolFile/Breakpad/Output/stack-cfi-parsing.test.tmp -o "target symbols add /Users/buildslave/jenkins/workspace/lldb-cmake-matrix/llvm-project/lldb/lit/SymbolFile/Breakpad/Inputs/stack-cfi-parsing.syms" -s /Users/buildslave/jenkins/workspace/lldb-cmake-matrix/llvm-project/lldb/lit/SymbolFile/Breakpad/stack-cfi-parsing.test -b | /Users/buildslave/jenkins/workspace/lldb-cmake-matrix/lldb-build/bin/FileCheck /Users/buildslave/jenkins/workspace/lldb-cmake-matrix/llvm-project/lldb/lit/SymbolFile/Breakpad/stack-cfi-parsing.test -- Exit Code: -9 Timeout: Reached timeout of 600 seconds

Hide Details

Hide Details

******************** TIMEOUT: LLDB :: SymbolFile/DWARF/debug_rnglists.s (1695 of 1699) ******************** TEST 'LLDB :: SymbolFile/DWARF/debug_rnglists.s' FAILED ******************** Script: -- : 'RUN: at line 3'; /Users/buildslave/jenkins/workspace/lldb-cmake-matrix/lldb-build/bin/llvm-mc -triple=x86_64-pc-linux -filetype=obj /Users/buildslave/jenkins/workspace/lldb-cmake-matrix/llvm-project/lldb/lit/SymbolFile/DWARF/debug_rnglists.s > /Users/buildslave/jenkins/workspace/lldb-cmake-matrix/lldb-build/tools/lldb/lit/SymbolFile/DWARF/Output/debug_rnglists.s.tmp : 'RUN: at line 4'; /Users/buildslave/jenkins/workspace/lldb-cmake-matrix/lldb-build/bin/lldb --no-lldbinit -S /Users/buildslave/jenkins/workspace/lldb-cmake-matrix/lldb-build/tools/lldb/lit/lit-lldb-init /Users/buildslave/jenkins/workspace/lldb-cmake-matrix/lldb-build/tools/lldb/lit/SymbolFile/DWARF/Output/debug_rnglists.s.tmp -o "image lookup -v -s lookup_rnglists" -o exit | /Users/buildslave/jenkins/workspace/lldb-cmake-matrix/lldb-build/bin/FileCheck /Users/buildslave/jenkins/workspace/lldb-cmake-matrix/llvm-project/lldb/lit/SymbolFile/DWARF/debug_rnglists.s -- Exit Code: -9 Timeout: Reached timeout of 600 seconds

Hide Details

Hide Details

******************** TIMEOUT: LLDB :: SymbolFile/DWARF/gnu-style-compression.cpp (1696 of 1699) ******************** TEST 'LLDB :: SymbolFile/DWARF/gnu-style-compression.cpp' FAILED ******************** Script: -- : 'RUN: at line 3'; /Users/buildslave/jenkins/workspace/lldb-cmake-matrix/lldb-build/bin/clang -isysroot /Applications/Xcode.app/Contents/Developer/Platforms/MacOSX.platform/Developer/SDKs/MacOSX.sdk /Users/buildslave/jenkins/workspace/lldb-cmake-matrix/llvm-project/lldb/lit/SymbolFile/DWARF/gnu-style-compression.cpp -target x86_64-pc-linux -g -gsplit-dwarf -c -o /Users/buildslave/jenkins/workspace/lldb-cmake-matrix/lldb-build/tools/lldb/lit/SymbolFile/DWARF/Output/gnu-style-compression.cpp.tmp -Wa,--compress-debug-sections=zlib-gnu : 'RUN: at line 5'; /Users/buildslave/jenkins/workspace/lldb-cmake-matrix/lldb-build/bin/lldb --no-lldbinit -S /Users/buildslave/jenkins/workspace/lldb-cmake-matrix/lldb-build/tools/lldb/lit/lit-lldb-init /Users/buildslave/jenkins/workspace/lldb-cmake-matrix/lldb-build/tools/lldb/lit/SymbolFile/DWARF/Output/gnu-style-compression.cpp.tmp -o "target var s a" -b | /Users/buildslave/jenkins/workspace/lldb-cmake-matrix/lldb-build/bin/FileCheck /Users/buildslave/jenkins/workspace/lldb-cmake-matrix/llvm-project/lldb/lit/SymbolFile/DWARF/gnu-style-compression.cpp -- Exit Code: -9 Timeout: Reached timeout of 600 seconds

Hide Details

Hide Details

******************** TIMEOUT: LLDB :: SymbolFile/DWARF/split-dwarf-inlining.cpp (1697 of 1699) ******************** TEST 'LLDB :: SymbolFile/DWARF/split-dwarf-inlining.cpp' FAILED ******************** Script: -- : 'RUN: at line 1'; /Users/buildslave/jenkins/workspace/lldb-cmake-matrix/lldb-build/bin/clang --driver-mode=g++ -isysroot /Applications/Xcode.app/Contents/Developer/Platforms/MacOSX.platform/Developer/SDKs/MacOSX.sdk -target x86_64-pc-linux -gsplit-dwarf -fsplit-dwarf-inlining -c /Users/buildslave/jenkins/workspace/lldb-cmake-matrix/llvm-project/lldb/lit/SymbolFile/DWARF/split-dwarf-inlining.cpp -o /Users/buildslave/jenkins/workspace/lldb-cmake-matrix/lldb-build/tools/lldb/lit/SymbolFile/DWARF/Output/split-dwarf-inlining.cpp.tmp : 'RUN: at line 3'; /Users/buildslave/jenkins/workspace/lldb-cmake-matrix/lldb-build/bin/lldb --no-lldbinit -S /Users/buildslave/jenkins/workspace/lldb-cmake-matrix/lldb-build/tools/lldb/lit/lit-lldb-init /Users/buildslave/jenkins/workspace/lldb-cmake-matrix/lldb-build/tools/lldb/lit/SymbolFile/DWARF/Output/split-dwarf-inlining.cpp.tmp -o "breakpoint set -n foo" -b | /Users/buildslave/jenkins/workspace/lldb-cmake-matrix/lldb-build/bin/FileCheck /Users/buildslave/jenkins/workspace/lldb-cmake-matrix/llvm-project/lldb/lit/SymbolFile/DWARF/split-dwarf-inlining.cpp -- Exit Code: -9 Timeout: Reached timeout of 600 seconds

Hide Details

Hide Details

******************** TIMEOUT: LLDB :: SymbolFile/sizeless-symbol.test (1698 of 1699) ******************** TEST 'LLDB :: SymbolFile/sizeless-symbol.test' FAILED ******************** Script: -- : 'RUN: at line 2'; /Users/buildslave/jenkins/workspace/lldb-cmake-matrix/lldb-build/bin/clang -isysroot /Applications/Xcode.app/Contents/Developer/Platforms/MacOSX.platform/Developer/SDKs/MacOSX.sdk -target x86_64-unknown-unknown-elf /Users/buildslave/jenkins/workspace/lldb-cmake-matrix/llvm-project/lldb/lit/SymbolFile/Inputs/sizeless-symbol.s -c -o /Users/buildslave/jenkins/workspace/lldb-cmake-matrix/lldb-build/tools/lldb/lit/SymbolFile/Output/sizeless-symbol.test.tmp.o : 'RUN: at line 3'; /Users/buildslave/jenkins/workspace/lldb-cmake-matrix/lldb-build/bin/lldb --no-lldbinit -S /Users/buildslave/jenkins/workspace/lldb-cmake-matrix/lldb-build/tools/lldb/lit/lit-lldb-init /Users/buildslave/jenkins/workspace/lldb-cmake-matrix/lldb-build/tools/lldb/lit/SymbolFile/Output/sizeless-symbol.test.tmp.o -s /Users/buildslave/jenkins/workspace/lldb-cmake-matrix/llvm-project/lldb/lit/SymbolFile/sizeless-symbol.test -o quit | /Users/buildslave/jenkins/workspace/lldb-cmake-matrix/lldb-build/bin/FileCheck /Users/buildslave/jenkins/workspace/lldb-cmake-matrix/llvm-project/lldb/lit/SymbolFile/sizeless-symbol.test -- Exit Code: -9 Timeout: Reached timeout of 600 seconds

Hide Details

Command Output (stderr): -- clang-10: warning: argument unused during compilation: '-isysroot /Applications/Xcode.app/Contents/Developer/Platforms/MacOSX.platform/Developer/SDKs/MacOSX.sdk' [-Wunused-command-line-argument]

Hide Details

--

Hide Details

******************** Cancelling nested steps due to timeout Sending interrupt signal to process sh: line 1: 31529 Terminated: 15 JENKINS_SERVER_COOKIE=$jsc '/bin/sh' -xe '/Users/buildslave/jenkins/workspace/lldb-cmake-matrix@tmp/durable-4c976dce/script.sh' > '/Users/buildslave/jenkins/workspace/lldb-cmake-matrix@tmp/durable-4c976dce/jenkins-log.txt' 2>&1 ninja: build stopped: interrupted by user. script returned exit code 143 [Pipeline] } [Pipeline] // timeout [Pipeline] } [Pipeline] // stage [Pipeline] stage [Pipeline] { (Build Clang 6.0.1) Stage "Build Clang 6.0.1" skipped due to earlier failure(s) [Pipeline] } [Pipeline] // stage [Pipeline] stage [Pipeline] { (Test Clang 6.0.1) Stage "Test Clang 6.0.1" skipped due to earlier failure(s) [Pipeline] } [Pipeline] // stage [Pipeline] stage [Pipeline] { (Build Clang 7.0.1) Stage "Build Clang 7.0.1" skipped due to earlier failure(s) [Pipeline] } [Pipeline] // stage [Pipeline] stage [Pipeline] { (Test Clang 7.0.1) Stage "Test Clang 7.0.1" skipped due to earlier failure(s) [Pipeline] } [Pipeline] // stage [Pipeline] } [Pipeline] // node [Pipeline] End of Pipeline [BFA] Scanning build for known causes... [BFA] Found failure cause(s): [BFA] Regression test failed from category Test [BFA] Link error [BFA] Compile Error from category Compile [BFA] Done. 0s Timeout has been exceeded Finished: ABORTED