FailedConsole Output

Skipping 8,467 KB.. Full Log
space/lldb-cmake-sanitized/lldb-build/lldb-test-build.noindex -s=/Users/buildslave/jenkins/workspace/lldb-cmake-sanitized/test/logs -t --env TERM=vt100 --env LLVM_LIBS_DIR=/Users/buildslave/jenkins/workspace/lldb-cmake-sanitized/lldb-build/./lib --inferior-env ASAN_OPTIONS=detect_stack_use_after_return=1 --inferior-env DYLD_INSERT_LIBRARIES=/Users/buildslave/jenkins/workspace/lldb-cmake-sanitized/host-compiler/lib/clang/11.0.0/lib/darwin/libclang_rt.asan_osx_dynamic.dylib --build-dir /Users/buildslave/jenkins/workspace/lldb-cmake-sanitized/lldb-build/lldb-test-build.noindex --lldb-module-cache-dir /Users/buildslave/jenkins/workspace/lldb-cmake-sanitized/lldb-build/lldb-test-build.noindex/module-cache-lldb/lldb-api --clang-module-cache-dir /Users/buildslave/jenkins/workspace/lldb-cmake-sanitized/lldb-build/lldb-test-build.noindex/module-cache-clang/lldb-api --executable /Users/buildslave/jenkins/workspace/lldb-cmake-sanitized/lldb-build/./bin/lldb --compiler /Users/buildslave/jenkins/workspace/lldb-cmake-sanitized/lldb-build/./bin/clang --dsymutil /Users/buildslave/jenkins/workspace/lldb-cmake-sanitized/lldb-build/./bin/dsymutil --filecheck /Users/buildslave/jenkins/workspace/lldb-cmake-sanitized/lldb-build/./bin/FileCheck --lldb-libs-dir /Users/buildslave/jenkins/workspace/lldb-cmake-sanitized/lldb-build/./lib /Users/buildslave/jenkins/workspace/lldb-cmake-sanitized/llvm-project/lldb/test/API/functionalities/data-formatter/data-formatter-objc/nsindexpath -p TestDataFormatterNSIndexPath.py
--
Exit Code: -6

Hide Details

Command Output (stdout): -- lldb version 11.0.99 clang revision 92063228f85bfe22a6dfe20bf01c99ffe6ff3130 llvm revision 92063228f85bfe22a6dfe20bf01c99ffe6ff3130

Hide Details

-- Command Output (stderr): --

Hide Details

Session logs for test failures/errors/unexpected successes will go into directory '/Users/buildslave/jenkins/workspace/lldb-cmake-sanitized/test/logs' Command invoked: /Users/buildslave/jenkins/workspace/lldb-cmake-sanitized/llvm-project/lldb/test/API/dotest.py --arch x86_64 -s /Users/buildslave/jenkins/workspace/lldb-cmake-sanitized/lldb-build/lldb-test-traces -S nm -u CXXFLAGS -u CFLAGS --codesign-identity lldb_codesign --server /Users/buildslave/jenkins/workspace/lldb-cmake-sanitized/lldb-build/./bin/debugserver --arch x86_64 --build-dir /Users/buildslave/jenkins/workspace/lldb-cmake-sanitized/lldb-build/lldb-test-build.noindex -s=/Users/buildslave/jenkins/workspace/lldb-cmake-sanitized/test/logs -t --env TERM=vt100 --env LLVM_LIBS_DIR=/Users/buildslave/jenkins/workspace/lldb-cmake-sanitized/lldb-build/./lib --inferior-env ASAN_OPTIONS=detect_stack_use_after_return=1 --inferior-env DYLD_INSERT_LIBRARIES=/Users/buildslave/jenkins/workspace/lldb-cmake-sanitized/host-compiler/lib/clang/11.0.0/lib/darwin/libclang_rt.asan_osx_dynamic.dylib --build-dir /Users/buildslave/jenkins/workspace/lldb-cmake-sanitized/lldb-build/lldb-test-build.noindex --lldb-module-cache-dir /Users/buildslave/jenkins/workspace/lldb-cmake-sanitized/lldb-build/lldb-test-build.noindex/module-cache-lldb/lldb-api --clang-module-cache-dir /Users/buildslave/jenkins/workspace/lldb-cmake-sanitized/lldb-build/lldb-test-build.noindex/module-cache-clang/lldb-api --executable /Users/buildslave/jenkins/workspace/lldb-cmake-sanitized/lldb-build/./bin/lldb --compiler /Users/buildslave/jenkins/workspace/lldb-cmake-sanitized/lldb-build/./bin/clang --dsymutil /Users/buildslave/jenkins/workspace/lldb-cmake-sanitized/lldb-build/./bin/dsymutil --filecheck /Users/buildslave/jenkins/workspace/lldb-cmake-sanitized/lldb-build/./bin/FileCheck --lldb-libs-dir /Users/buildslave/jenkins/workspace/lldb-cmake-sanitized/lldb-build/./lib /Users/buildslave/jenkins/workspace/lldb-cmake-sanitized/llvm-project/lldb/test/API/functionalities/data-formatter/data-formatter-objc/nsindexpath -p TestDataFormatterNSIndexPath.py Change dir to: /Users/buildslave/jenkins/workspace/lldb-cmake-sanitized/llvm-project/lldb/test/API/functionalities/data-formatter/data-formatter-objc/nsindexpath runCmd: settings clear -all output:

Hide Details

runCmd: settings set symbols.enable-external-lookup false output:

Hide Details

runCmd: settings set target.auto-apply-fixits false output:

Hide Details

runCmd: settings set plugin.process.gdb-remote.packet-timeout 60 output:

Hide Details

runCmd: settings set symbols.clang-modules-cache-path "/Users/buildslave/jenkins/workspace/lldb-cmake-sanitized/lldb-build/lldb-test-build.noindex/module-cache-lldb/lldb-api" output:

Hide Details

runCmd: settings set use-color false output:

Hide Details

runCmd: setting set target.prefer-dynamic-value no-dynamic-values output:

Hide Details

runCmd: settings set target.env-vars ASAN_OPTIONS=detect_stack_use_after_return=1 DYLD_INSERT_LIBRARIES=/Users/buildslave/jenkins/workspace/lldb-cmake-sanitized/host-compiler/lib/clang/11.0.0/lib/darwin/libclang_rt.asan_osx_dynamic.dylib output:

Hide Details

runCmd: file /Users/buildslave/jenkins/workspace/lldb-cmake-sanitized/lldb-build/lldb-test-build.noindex/functionalities/data-formatter/data-formatter-objc/nsindexpath/TestDataFormatterNSIndexPath.test_nsindexpath_with_run_command_dsym/a.out output: Current executable set to '/Users/buildslave/jenkins/workspace/lldb-cmake-sanitized/lldb-build/lldb-test-build.noindex/functionalities/data-formatter/data-formatter-objc/nsindexpath/TestDataFormatterNSIndexPath.test_nsindexpath_with_run_command_dsym/a.out' (x86_64).

Hide Details

Hide Details

runCmd: breakpoint set -f "main.m" -l 15 output: Breakpoint 1: where = a.out`main + 301 at main.m:15:22, address = 0x0000000100000e9d

Hide Details

Hide Details

Expecting pattern: ^Breakpoint (?P<bpno>[0-9]+): (?P<num_locations>[0-9]+) locations\.$ Not matched

Hide Details

Expecting pattern: ^Breakpoint (?P<bpno>[0-9]+): (?P<num_locations>no) locations \(pending\)\. Not matched

Hide Details

Expecting pattern: ^Breakpoint (?P<bpno>[0-9]+): where = (?P<module>.*)`(?P<symbol>[+\-]{0,1}[^+]+)( \+ (?P<offset>[0-9]+)){0,1}( \[inlined\] (?P<inline_symbol>.*)){0,1} at (?P<file>[^:]+):(?P<line_no>[0-9]+)(?P<column>(:[0-9]+)?), address = (?P<address>0x[0-9a-fA-F]+)$ Matched

Hide Details

runCmd: run output: Process 63704 stopped * thread #1, queue = 'com.apple.main-thread', stop reason = breakpoint 1.1 frame #0: 0x0000000100000e9d a.out`main(argc=1, argv=0x00007ffeefbff400) at main.m:15:22 12 NSIndexPath* indexPath4 = [NSIndexPath indexPathWithIndexes:values length:4]; 13 NSIndexPath* indexPath5 = [NSIndexPath indexPathWithIndexes:values length:5]; 14 -> 15 NSLog(@"%@", indexPath1); // break here ^ 16 NSLog(@"%@", indexPath2); 17 NSLog(@"%@", indexPath3); 18 NSLog(@"%@", indexPath4);

Hide Details

Process 63704 launched: '/Users/buildslave/jenkins/workspace/lldb-cmake-sanitized/lldb-build/lldb-test-build.noindex/functionalities/data-formatter/data-formatter-objc/nsindexpath/TestDataFormatterNSIndexPath.test_nsindexpath_with_run_command_dsym/a.out' (x86_64)

Hide Details

Hide Details

runCmd: thread list output: Process 63704 stopped * thread #1: tid = 0x61bdd1, 0x0000000100000e9d a.out`main(argc=1, argv=0x00007ffeefbff400) at main.m:15:22, queue = 'com.apple.main-thread', stop reason = breakpoint 1.1

Hide Details

Hide Details

Expecting sub string: stopped Matched

Hide Details

Expecting sub string: stop reason = breakpoint Matched

Hide Details

Adding tearDown hook: def cleanup(): self.runCmd('type format clear', check=False) self.runCmd('type summary clear', check=False) self.runCmd('type synth clear', check=False)

Hide Details

Hide Details

runCmd: frame variable --ptr-depth=1 -d run -- indexPath1 output: (NSIndexPath *) indexPath1 = 0x01f7043d0c852df9 { [0] = 1 }

Hide Details

Hide Details

Expecting sub string: [0] = 1 Matched

Hide Details

runCmd: frame variable --ptr-depth=1 -d run -- indexPath2 output: (NSIndexPath *) indexPath2 = 0x01f7043d08852c79 { [0] = 1 [1] = 2 }

Hide Details

Hide Details

Expecting sub string: [0] = 1 Matched

Hide Details

Expecting sub string: [1] = 2 Matched

Hide Details

runCmd: frame variable --ptr-depth=1 -d run -- indexPath3 output: (NSIndexPath *) indexPath3 = 0x01f704fd08852cf9 { [0] = 1 [1] = 2 [2] = 3 }

Hide Details

Hide Details

Expecting sub string: [0] = 1 Matched

Hide Details

Expecting sub string: [1] = 2 Matched

Hide Details

Expecting sub string: [2] = 3 Matched

Hide Details

runCmd: frame variable --ptr-depth=1 -d run -- indexPath4 output: (NSIndexPath *) indexPath4 = 0x01d704fd08852f79 { [0] = 1 [1] = 2 [2] = 3 [3] = 4 }

Hide Details

Hide Details

Expecting sub string: [0] = 1 Matched

Hide Details

Expecting sub string: [1] = 2 Matched

Hide Details

Expecting sub string: [2] = 3 Matched

Hide Details

Expecting sub string: [3] = 4 Matched

Hide Details

runCmd: frame variable --ptr-depth=1 -d run -- indexPath5 output: (NSIndexPath *) indexPath5 = 0x0000603000002f20 { [0] = 1 [1] = 2 [2] = 3 [3] = 4 [4] = 5 }

Hide Details

Hide Details

Expecting sub string: [0] = 1 Matched

Hide Details

Expecting sub string: [1] = 2 Matched

Hide Details

Expecting sub string: [2] = 3 Matched

Hide Details

Expecting sub string: [3] = 4 Matched

Hide Details

Expecting sub string: [4] = 5 Matched

Hide Details

runCmd: expression --ptr-depth=1 -d run -- indexPath1 output: (NSIndexPath *) $0 = 0x01f7043d0c852df9 { [0] = 1 }

Hide Details

Hide Details

Expecting sub string: [0] = 1 Matched

Hide Details

runCmd: expression --ptr-depth=1 -d run -- indexPath2 output: (NSIndexPath *) $1 = 0x01f7043d08852c79 { [0] = 1 [1] = 2 }

Hide Details

Hide Details

Expecting sub string: [0] = 1 Matched

Hide Details

Expecting sub string: [1] = 2 Matched

Hide Details

runCmd: expression --ptr-depth=1 -d run -- indexPath3 output: (NSIndexPath *) $2 = 0x01f704fd08852cf9 { [0] = 1 [1] = 2 [2] = 3 }

Hide Details

Hide Details

Expecting sub string: [0] = 1 Matched

Hide Details

Expecting sub string: [1] = 2 Matched

Hide Details

Expecting sub string: [2] = 3 Matched

Hide Details

runCmd: expression --ptr-depth=1 -d run -- indexPath4 output: (NSIndexPath *) $3 = 0x01d704fd08852f79 { [0] = 1 [1] = 2 [2] = 3 [3] = 4 }

Hide Details

Hide Details

Expecting sub string: [0] = 1 Matched

Hide Details

Expecting sub string: [1] = 2 Matched

Hide Details

Expecting sub string: [2] = 3 Matched

Hide Details

Expecting sub string: [3] = 4 Matched

Hide Details

runCmd: expression --ptr-depth=1 -d run -- indexPath5 output: (NSIndexPath *) $4 = 0x0000603000002f20 { [0] = 1 [1] = 2 [2] = 3 [3] = 4 [4] = 5 }

Hide Details

Hide Details

Expecting sub string: [0] = 1 Matched

Hide Details

Expecting sub string: [1] = 2 Matched

Hide Details

Expecting sub string: [2] = 3 Matched

Hide Details

Expecting sub string: [3] = 4 Matched Assertion failed: (tokenKind == tok::kw___bridge_retain), function ParseParenExpression, file /Users/buildslave/jenkins/workspace/lldb-cmake-sanitized/llvm-project/clang/lib/Parse/ParseExpr.cpp, line 2804.

Hide Details

--

Hide Details

******************** PASS: lldb-unit :: Utility/./UtilityTests/UriParserTest.BadPort (1471 of 2028) PASS: lldb-unit :: Utility/./UtilityTests/SubsystemRAIITest.NormalSubsystem (1472 of 2028) PASS: lldb-api :: types/TestDoubleTypes.py (1473 of 2028) PASS: lldb-shell :: SymbolFile/Breakpad/line-table-edgecases.test (1474 of 2028) PASS: lldb-unit :: Utility/./UtilityTests/StringListTest.Join (1475 of 2028) PASS: lldb-unit :: ScriptInterpreter/Python/./ScriptInterpreterPythonTests/PythonDataObjectsTest.TestPythonStringToStr (1476 of 2028) PASS: lldb-unit :: Utility/./UtilityTests/UriParserTest.BracketedHostnameWithColon (1477 of 2028) PASS: lldb-shell :: Reproducer/TestCrash.test (1478 of 2028) PASS: lldb-unit :: Process/gdb-remote/./ProcessGdbRemoteTests/GDBRemoteCommunicationServerTest.SendErrorResponse_UnimplementedError (1479 of 2028) PASS: lldb-api :: python_api/hello_world/TestHelloWorld.py (1480 of 2028) FAIL: lldb-api :: lang/objc/variadic_methods/TestVariadicMethods.py (1481 of 2028) ******************** TEST 'lldb-api :: lang/objc/variadic_methods/TestVariadicMethods.py' FAILED ******************** Script: -- /Users/buildslave/jenkins/workspace/lldb-cmake-sanitized/lldb-build/lldb-test-build.noindex/copied-system-python /Users/buildslave/jenkins/workspace/lldb-cmake-sanitized/llvm-project/lldb/test/API/dotest.py --arch x86_64 -s /Users/buildslave/jenkins/workspace/lldb-cmake-sanitized/lldb-build/lldb-test-traces -S nm -u CXXFLAGS -u CFLAGS --codesign-identity lldb_codesign --server /Users/buildslave/jenkins/workspace/lldb-cmake-sanitized/lldb-build/./bin/debugserver --arch x86_64 --build-dir /Users/buildslave/jenkins/workspace/lldb-cmake-sanitized/lldb-build/lldb-test-build.noindex -s=/Users/buildslave/jenkins/workspace/lldb-cmake-sanitized/test/logs -t --env TERM=vt100 --env LLVM_LIBS_DIR=/Users/buildslave/jenkins/workspace/lldb-cmake-sanitized/lldb-build/./lib --inferior-env ASAN_OPTIONS=detect_stack_use_after_return=1 --inferior-env DYLD_INSERT_LIBRARIES=/Users/buildslave/jenkins/workspace/lldb-cmake-sanitized/host-compiler/lib/clang/11.0.0/lib/darwin/libclang_rt.asan_osx_dynamic.dylib --build-dir /Users/buildslave/jenkins/workspace/lldb-cmake-sanitized/lldb-build/lldb-test-build.noindex --lldb-module-cache-dir /Users/buildslave/jenkins/workspace/lldb-cmake-sanitized/lldb-build/lldb-test-build.noindex/module-cache-lldb/lldb-api --clang-module-cache-dir /Users/buildslave/jenkins/workspace/lldb-cmake-sanitized/lldb-build/lldb-test-build.noindex/module-cache-clang/lldb-api --executable /Users/buildslave/jenkins/workspace/lldb-cmake-sanitized/lldb-build/./bin/lldb --compiler /Users/buildslave/jenkins/workspace/lldb-cmake-sanitized/lldb-build/./bin/clang --dsymutil /Users/buildslave/jenkins/workspace/lldb-cmake-sanitized/lldb-build/./bin/dsymutil --filecheck /Users/buildslave/jenkins/workspace/lldb-cmake-sanitized/lldb-build/./bin/FileCheck --lldb-libs-dir /Users/buildslave/jenkins/workspace/lldb-cmake-sanitized/lldb-build/./lib /Users/buildslave/jenkins/workspace/lldb-cmake-sanitized/llvm-project/lldb/test/API/lang/objc/variadic_methods -p TestVariadicMethods.py -- Exit Code: -6

Hide Details

Command Output (stdout): -- lldb version 11.0.99 clang revision 92063228f85bfe22a6dfe20bf01c99ffe6ff3130 llvm revision 92063228f85bfe22a6dfe20bf01c99ffe6ff3130

Hide Details

-- Command Output (stderr): -- Assertion failed: (tokenKind == tok::kw___bridge_retain), function ParseParenExpression, file /Users/buildslave/jenkins/workspace/lldb-cmake-sanitized/llvm-project/clang/lib/Parse/ParseExpr.cpp, line 2804.

Hide Details

--

Hide Details

******************** PASS: lldb-unit :: Utility/./UtilityTests/ArgsTest.BareSingleQuote (1482 of 2028) UNSUPPORTED: lldb-api :: functionalities/darwin_log/filter/regex/subsystem/TestDarwinLogFilterRegexSubsystem.py (1483 of 2028) PASS: lldb-unit :: Utility/./UtilityTests/RecordReplayTest.InstrumentedBarPtr (1484 of 2028) FAIL: lldb-api :: lang/objc/objc-new-syntax/TestObjCNewSyntaxLiteral.py (1485 of 2028) ******************** TEST 'lldb-api :: lang/objc/objc-new-syntax/TestObjCNewSyntaxLiteral.py' FAILED ******************** Script: -- /Users/buildslave/jenkins/workspace/lldb-cmake-sanitized/lldb-build/lldb-test-build.noindex/copied-system-python /Users/buildslave/jenkins/workspace/lldb-cmake-sanitized/llvm-project/lldb/test/API/dotest.py --arch x86_64 -s /Users/buildslave/jenkins/workspace/lldb-cmake-sanitized/lldb-build/lldb-test-traces -S nm -u CXXFLAGS -u CFLAGS --codesign-identity lldb_codesign --server /Users/buildslave/jenkins/workspace/lldb-cmake-sanitized/lldb-build/./bin/debugserver --arch x86_64 --build-dir /Users/buildslave/jenkins/workspace/lldb-cmake-sanitized/lldb-build/lldb-test-build.noindex -s=/Users/buildslave/jenkins/workspace/lldb-cmake-sanitized/test/logs -t --env TERM=vt100 --env LLVM_LIBS_DIR=/Users/buildslave/jenkins/workspace/lldb-cmake-sanitized/lldb-build/./lib --inferior-env ASAN_OPTIONS=detect_stack_use_after_return=1 --inferior-env DYLD_INSERT_LIBRARIES=/Users/buildslave/jenkins/workspace/lldb-cmake-sanitized/host-compiler/lib/clang/11.0.0/lib/darwin/libclang_rt.asan_osx_dynamic.dylib --build-dir /Users/buildslave/jenkins/workspace/lldb-cmake-sanitized/lldb-build/lldb-test-build.noindex --lldb-module-cache-dir /Users/buildslave/jenkins/workspace/lldb-cmake-sanitized/lldb-build/lldb-test-build.noindex/module-cache-lldb/lldb-api --clang-module-cache-dir /Users/buildslave/jenkins/workspace/lldb-cmake-sanitized/lldb-build/lldb-test-build.noindex/module-cache-clang/lldb-api --executable /Users/buildslave/jenkins/workspace/lldb-cmake-sanitized/lldb-build/./bin/lldb --compiler /Users/buildslave/jenkins/workspace/lldb-cmake-sanitized/lldb-build/./bin/clang --dsymutil /Users/buildslave/jenkins/workspace/lldb-cmake-sanitized/lldb-build/./bin/dsymutil --filecheck /Users/buildslave/jenkins/workspace/lldb-cmake-sanitized/lldb-build/./bin/FileCheck --lldb-libs-dir /Users/buildslave/jenkins/workspace/lldb-cmake-sanitized/lldb-build/./lib /Users/buildslave/jenkins/workspace/lldb-cmake-sanitized/llvm-project/lldb/test/API/lang/objc/objc-new-syntax -p TestObjCNewSyntaxLiteral.py -- Exit Code: -6

Hide Details

Command Output (stdout): -- lldb version 11.0.99 clang revision 92063228f85bfe22a6dfe20bf01c99ffe6ff3130 llvm revision 92063228f85bfe22a6dfe20bf01c99ffe6ff3130

Hide Details

-- Command Output (stderr): -- Assertion failed: (tokenKind == tok::kw___bridge_retain), function ParseParenExpression, file /Users/buildslave/jenkins/workspace/lldb-cmake-sanitized/llvm-project/clang/lib/Parse/ParseExpr.cpp, line 2804.

Hide Details

--

Hide Details

******************** PASS: lldb-unit :: Process/minidump/./LLDBMinidumpTests/MinidumpParserTest.GetLinuxProcStatus (1486 of 2028) PASS: lldb-api :: functionalities/data-formatter/data-formatter-disabling/TestDataFormatterDisabling.py (1487 of 2028) PASS: lldb-api :: tools/lldb-server/commandline/TestStubReverseConnect.py (1488 of 2028) PASS: lldb-unit :: Language/Highlighting/./HighlighterTests/HighlighterTest.ClangTrailingBackslashMissingNewLine (1489 of 2028) PASS: lldb-unit :: Host/./HostTests/File.GetStreamFromDescriptor (1490 of 2028) PASS: lldb-unit :: UnwindAssembly/x86/./UnwindAssemblyx86Tests/Testx86AssemblyInspectionEngine.TestPushEDI (1491 of 2028) PASS: lldb-api :: functionalities/breakpoint/dummy_target_breakpoints/TestBreakpointsWithNoTargets.py (1492 of 2028) PASS: lldb-unit :: Symbol/./SymbolTests/SymbolsTest.TerminateLocateExecutableSymbolFileForUnknownExecutableAndUnknownSymbolFile (1493 of 2028) PASS: lldb-unit :: UnwindAssembly/x86/./UnwindAssemblyx86Tests/Testx86AssemblyInspectionEngine.TestSimple32bitFrameFunction (1494 of 2028) PASS: lldb-unit :: UnwindAssembly/x86/./UnwindAssemblyx86Tests/Testx86AssemblyInspectionEngine.TestPushR15 (1495 of 2028) PASS: lldb-unit :: ScriptInterpreter/Python/./ScriptInterpreterPythonTests/PythonDataObjectsTest.TestGlobalNameResolutionNoDot (1496 of 2028) PASS: lldb-shell :: Commands/command-backtrace.test (1497 of 2028) PASS: lldb-shell :: Process/TestEnvironment.test (1498 of 2028) PASS: lldb-unit :: Expression/./ExpressionTests/CppModuleConfigurationTest.UnknownLibCppFile (1499 of 2028) PASS: lldb-api :: commands/expression/call-function/TestCallUserDefinedFunction.py (1500 of 2028) PASS: lldb-unit :: Utility/./UtilityTests/StreamTest.PutCString (1501 of 2028) PASS: lldb-unit :: UnwindAssembly/x86/./UnwindAssemblyx86Tests/Testx86AssemblyInspectionEngine.Test32bitFramelessBigStackFrame (1502 of 2028) PASS: lldb-shell :: SymbolFile/DWARF/parallel-indexing-stress.s (1503 of 2028) PASS: lldb-shell :: ObjectFile/MachO/lc_build_version.yaml (1504 of 2028) PASS: lldb-unit :: Language/Highlighting/./HighlighterTests/HighlighterTest.Colons (1505 of 2028) PASS: lldb-unit :: Utility/./UtilityTests/StringExtractorTest.DecodeHexU8_Extra (1506 of 2028) PASS: lldb-unit :: UnwindAssembly/x86/./UnwindAssemblyx86Tests/Testx86AssemblyInspectionEngine.TestPushEAX (1507 of 2028) PASS: lldb-shell :: SymbolFile/Breakpad/line-table-missing-file.test (1508 of 2028) UNSUPPORTED: lldb-api :: commands/expression/call-restarts/TestCallThatRestarts.py (1509 of 2028) PASS: lldb-unit :: Utility/./UtilityTests/StringListTest.ForRange (1510 of 2028) UNSUPPORTED: lldb-api :: lang/objc/ptr_refs/TestPtrRefsObjC.py (1511 of 2028) PASS: lldb-unit :: Utility/./UtilityTests/TimerTest.CategoryTimesNested (1512 of 2028) UNSUPPORTED: lldb-shell :: Unwind/eh-frame-small-fde.test (1513 of 2028) FAIL: lldb-api :: lang/objc/objc-ivar-protocols/TestIvarProtocols.py (1514 of 2028) ******************** TEST 'lldb-api :: lang/objc/objc-ivar-protocols/TestIvarProtocols.py' FAILED ******************** Script: -- /Users/buildslave/jenkins/workspace/lldb-cmake-sanitized/lldb-build/lldb-test-build.noindex/copied-system-python /Users/buildslave/jenkins/workspace/lldb-cmake-sanitized/llvm-project/lldb/test/API/dotest.py --arch x86_64 -s /Users/buildslave/jenkins/workspace/lldb-cmake-sanitized/lldb-build/lldb-test-traces -S nm -u CXXFLAGS -u CFLAGS --codesign-identity lldb_codesign --server /Users/buildslave/jenkins/workspace/lldb-cmake-sanitized/lldb-build/./bin/debugserver --arch x86_64 --build-dir /Users/buildslave/jenkins/workspace/lldb-cmake-sanitized/lldb-build/lldb-test-build.noindex -s=/Users/buildslave/jenkins/workspace/lldb-cmake-sanitized/test/logs -t --env TERM=vt100 --env LLVM_LIBS_DIR=/Users/buildslave/jenkins/workspace/lldb-cmake-sanitized/lldb-build/./lib --inferior-env ASAN_OPTIONS=detect_stack_use_after_return=1 --inferior-env DYLD_INSERT_LIBRARIES=/Users/buildslave/jenkins/workspace/lldb-cmake-sanitized/host-compiler/lib/clang/11.0.0/lib/darwin/libclang_rt.asan_osx_dynamic.dylib --build-dir /Users/buildslave/jenkins/workspace/lldb-cmake-sanitized/lldb-build/lldb-test-build.noindex --lldb-module-cache-dir /Users/buildslave/jenkins/workspace/lldb-cmake-sanitized/lldb-build/lldb-test-build.noindex/module-cache-lldb/lldb-api --clang-module-cache-dir /Users/buildslave/jenkins/workspace/lldb-cmake-sanitized/lldb-build/lldb-test-build.noindex/module-cache-clang/lldb-api --executable /Users/buildslave/jenkins/workspace/lldb-cmake-sanitized/lldb-build/./bin/lldb --compiler /Users/buildslave/jenkins/workspace/lldb-cmake-sanitized/lldb-build/./bin/clang --dsymutil /Users/buildslave/jenkins/workspace/lldb-cmake-sanitized/lldb-build/./bin/dsymutil --filecheck /Users/buildslave/jenkins/workspace/lldb-cmake-sanitized/lldb-build/./bin/FileCheck --lldb-libs-dir /Users/buildslave/jenkins/workspace/lldb-cmake-sanitized/lldb-build/./lib /Users/buildslave/jenkins/workspace/lldb-cmake-sanitized/llvm-project/lldb/test/API/lang/objc/objc-ivar-protocols -p TestIvarProtocols.py -- Exit Code: -6

Hide Details

Command Output (stdout): -- lldb version 11.0.99 clang revision 92063228f85bfe22a6dfe20bf01c99ffe6ff3130 llvm revision 92063228f85bfe22a6dfe20bf01c99ffe6ff3130

Hide Details

-- Command Output (stderr): -- Assertion failed: (tokenKind == tok::kw___bridge_retain), function ParseParenExpression, file /Users/buildslave/jenkins/workspace/lldb-cmake-sanitized/llvm-project/clang/lib/Parse/ParseExpr.cpp, line 2804.

Hide Details

--

Hide Details

******************** PASS: lldb-shell :: Recognizer/assert.test (1515 of 2028) PASS: lldb-unit :: Utility/./UtilityTests/EnvironmentTest.EnvpConversion (1516 of 2028) PASS: lldb-unit :: Utility/./UtilityTests/ConstStringTest.format_provider (1517 of 2028) PASS: lldb-unit :: Language/CPlusPlus/./LanguageCPlusPlusTests/CPlusPlusLanguage.ExtractContextAndIdentifier (1518 of 2028) PASS: lldb-unit :: Utility/./UtilityTests/ArchSpecTest.TestSetTriple (1519 of 2028) PASS: lldb-api :: api/multiple-targets/TestMultipleTargets.py (1520 of 2028) PASS: lldb-unit :: SymbolFile/NativePDB/./SymbolFileNativePDBTests/PDBFPOProgramToDWARFExpressionTests.InvalidAssignmentMultiple (1521 of 2028) PASS: lldb-unit :: Utility/./UtilityTests/VMRange.ContainsAddr (1522 of 2028) PASS: lldb-unit :: ScriptInterpreter/Python/./ScriptInterpreterPythonTests/PythonDataObjectsTest.TestPythonTupleSize (1523 of 2028) PASS: lldb-api :: commands/frame/var-scope/TestFrameVariableScope.py (1524 of 2028) PASS: lldb-shell :: Register/x86-64-ymm-read.test (1525 of 2028) PASS: lldb-api :: functionalities/thread/concurrent_events/TestConcurrentWatchpointWithDelayWatchpointThreads.py (1526 of 2028) UNSUPPORTED: lldb-api :: lang/cpp/function-template-parameter-pack/TestFunctionTemplateParameterPack.py (1527 of 2028) PASS: lldb-api :: commands/expression/unicode-in-variable/TestUnicodeInVariable.py (1528 of 2028) PASS: lldb-shell :: ObjectFile/ELF/PT_LOAD-overlap-PT_INTERP.yaml (1529 of 2028) PASS: lldb-unit :: Utility/./UtilityTests/RegularExpression.Invalid (1530 of 2028) PASS: lldb-unit :: Utility/./UtilityTests/StringListTest.SplitIntoLinesSingleTrailingCR (1531 of 2028) PASS: lldb-api :: functionalities/thread_plan/TestThreadPlanCommands.py (1532 of 2028) PASS: lldb-unit :: Utility/./UtilityTests/RangeTest.ContainsRange (1533 of 2028) PASS: lldb-api :: commands/expression/import-std-module/deque-dbg-info-content/TestDbgInfoContentDequeFromStdModule.py (1534 of 2028) PASS: lldb-api :: commands/expression/import-std-module/basic/TestImportStdModule.py (1535 of 2028) PASS: lldb-shell :: ObjectFile/ELF/PT_LOAD-overlap.yaml (1536 of 2028) PASS: lldb-unit :: UnwindAssembly/x86/./UnwindAssemblyx86Tests/Testx86AssemblyInspectionEngine.TestPopR12 (1537 of 2028) PASS: lldb-unit :: Utility/./UtilityTests/AnsiTerminal.Incomplete (1538 of 2028) PASS: lldb-api :: commands/expression/rdar44436068/Test128BitsInteger.py (1539 of 2028) PASS: lldb-unit :: Utility/./UtilityTests/ArchSpecTest.TestParseMachCPUDashSubtypeTripleExtra (1540 of 2028) PASS: lldb-api :: types/TestFloatTypes.py (1541 of 2028) PASS: lldb-api :: python_api/interpreter/TestCommandInterpreterAPI.py (1542 of 2028) PASS: lldb-unit :: UnwindAssembly/x86/./UnwindAssemblyx86Tests/Testx86AssemblyInspectionEngine.TestSpArithx86_64Augmented (1543 of 2028) PASS: lldb-unit :: ObjectFile/ELF/./ObjectFileELFTests/ObjectFileELFTest.GetModuleSpecifications_EarlySectionHeaders (1544 of 2028) PASS: lldb-api :: lang/objcxx/class-name-clash/TestNameClash.py (1545 of 2028) PASS: lldb-unit :: ScriptInterpreter/Python/./ScriptInterpreterPythonTests/PythonDataObjectsTest.TestPythonTupleInitializerList (1546 of 2028) PASS: lldb-unit :: Utility/./UtilityTests/StringListTest.SplitIntoLines (1547 of 2028) PASS: lldb-api :: functionalities/thread/step_out/TestThreadStepOut.py (1548 of 2028) PASS: lldb-shell :: Reproducer/Modules/TestModuleCXX.test (1549 of 2028) PASS: lldb-unit :: Language/Highlighting/./HighlighterTests/HighlighterTest.ClangIdentifiers (1550 of 2028) PASS: lldb-unit :: Expression/./ExpressionTests/DiagnosticManagerTest.PutStringSeverities (1551 of 2028) PASS: lldb-unit :: Utility/./UtilityTests/RegularExpression.Valid (1552 of 2028) PASS: lldb-shell :: Register/x86-64-read.test (1553 of 2028) PASS: lldb-api :: functionalities/data-formatter/data-formatter-synthval/TestDataFormatterSynthVal.py (1554 of 2028) PASS: lldb-api :: commands/version/TestVersion.py (1555 of 2028) PASS: lldb-api :: commands/expression/weak_symbols/TestWeakSymbols.py (1556 of 2028) PASS: lldb-unit :: Symbol/./SymbolTests/TestClangASTImporter.MetadataPropagationIndirectImport (1557 of 2028) PASS: lldb-shell :: ObjectFile/PECOFF/export-dllfunc.yaml (1558 of 2028) PASS: lldb-shell :: ObjectFile/ELF/duplicate-section.yaml (1559 of 2028) PASS: lldb-api :: functionalities/data-formatter/data-formatter-skip-summary/TestDataFormatterSkipSummary.py (1560 of 2028) PASS: lldb-unit :: Utility/./UtilityTests/UriParserTest.LongPath (1561 of 2028) FAIL: lldb-api :: lang/objc/objc-struct-return/TestObjCStructReturn.py (1562 of 2028) ******************** TEST 'lldb-api :: lang/objc/objc-struct-return/TestObjCStructReturn.py' FAILED ******************** Script: -- /Users/buildslave/jenkins/workspace/lldb-cmake-sanitized/lldb-build/lldb-test-build.noindex/copied-system-python /Users/buildslave/jenkins/workspace/lldb-cmake-sanitized/llvm-project/lldb/test/API/dotest.py --arch x86_64 -s /Users/buildslave/jenkins/workspace/lldb-cmake-sanitized/lldb-build/lldb-test-traces -S nm -u CXXFLAGS -u CFLAGS --codesign-identity lldb_codesign --server /Users/buildslave/jenkins/workspace/lldb-cmake-sanitized/lldb-build/./bin/debugserver --arch x86_64 --build-dir /Users/buildslave/jenkins/workspace/lldb-cmake-sanitized/lldb-build/lldb-test-build.noindex -s=/Users/buildslave/jenkins/workspace/lldb-cmake-sanitized/test/logs -t --env TERM=vt100 --env LLVM_LIBS_DIR=/Users/buildslave/jenkins/workspace/lldb-cmake-sanitized/lldb-build/./lib --inferior-env ASAN_OPTIONS=detect_stack_use_after_return=1 --inferior-env DYLD_INSERT_LIBRARIES=/Users/buildslave/jenkins/workspace/lldb-cmake-sanitized/host-compiler/lib/clang/11.0.0/lib/darwin/libclang_rt.asan_osx_dynamic.dylib --build-dir /Users/buildslave/jenkins/workspace/lldb-cmake-sanitized/lldb-build/lldb-test-build.noindex --lldb-module-cache-dir /Users/buildslave/jenkins/workspace/lldb-cmake-sanitized/lldb-build/lldb-test-build.noindex/module-cache-lldb/lldb-api --clang-module-cache-dir /Users/buildslave/jenkins/workspace/lldb-cmake-sanitized/lldb-build/lldb-test-build.noindex/module-cache-clang/lldb-api --executable /Users/buildslave/jenkins/workspace/lldb-cmake-sanitized/lldb-build/./bin/lldb --compiler /Users/buildslave/jenkins/workspace/lldb-cmake-sanitized/lldb-build/./bin/clang --dsymutil /Users/buildslave/jenkins/workspace/lldb-cmake-sanitized/lldb-build/./bin/dsymutil --filecheck /Users/buildslave/jenkins/workspace/lldb-cmake-sanitized/lldb-build/./bin/FileCheck --lldb-libs-dir /Users/buildslave/jenkins/workspace/lldb-cmake-sanitized/lldb-build/./lib /Users/buildslave/jenkins/workspace/lldb-cmake-sanitized/llvm-project/lldb/test/API/lang/objc/objc-struct-return -p TestObjCStructReturn.py -- Exit Code: -6

Hide Details

Command Output (stdout): -- lldb version 11.0.99 clang revision 92063228f85bfe22a6dfe20bf01c99ffe6ff3130 llvm revision 92063228f85bfe22a6dfe20bf01c99ffe6ff3130

Hide Details

-- Command Output (stderr): -- Assertion failed: (tokenKind == tok::kw___bridge_retain), function ParseParenExpression, file /Users/buildslave/jenkins/workspace/lldb-cmake-sanitized/llvm-project/clang/lib/Parse/ParseExpr.cpp, line 2804.

Hide Details

--

Hide Details

******************** PASS: lldb-api :: commands/frame/var/TestFrameVar.py (1563 of 2028) UNSUPPORTED: lldb-api :: functionalities/data-formatter/data-formatter-stl/libstdcpp/string/TestDataFormatterStdString.py (1564 of 2028) PASS: lldb-api :: functionalities/rerun/TestRerun.py (1565 of 2028) PASS: lldb-api :: functionalities/data-formatter/data-formatter-enum-format/TestDataFormatterEnumFormat.py (1566 of 2028) PASS: lldb-shell :: Breakpoint/split-dwarf-5-addrbase.test (1567 of 2028) FAIL: lldb-api :: commands/expression/two-files/TestObjCTypeQueryFromOtherCompileUnit.py (1568 of 2028) ******************** TEST 'lldb-api :: commands/expression/two-files/TestObjCTypeQueryFromOtherCompileUnit.py' FAILED ******************** Script: -- /Users/buildslave/jenkins/workspace/lldb-cmake-sanitized/lldb-build/lldb-test-build.noindex/copied-system-python /Users/buildslave/jenkins/workspace/lldb-cmake-sanitized/llvm-project/lldb/test/API/dotest.py --arch x86_64 -s /Users/buildslave/jenkins/workspace/lldb-cmake-sanitized/lldb-build/lldb-test-traces -S nm -u CXXFLAGS -u CFLAGS --codesign-identity lldb_codesign --server /Users/buildslave/jenkins/workspace/lldb-cmake-sanitized/lldb-build/./bin/debugserver --arch x86_64 --build-dir /Users/buildslave/jenkins/workspace/lldb-cmake-sanitized/lldb-build/lldb-test-build.noindex -s=/Users/buildslave/jenkins/workspace/lldb-cmake-sanitized/test/logs -t --env TERM=vt100 --env LLVM_LIBS_DIR=/Users/buildslave/jenkins/workspace/lldb-cmake-sanitized/lldb-build/./lib --inferior-env ASAN_OPTIONS=detect_stack_use_after_return=1 --inferior-env DYLD_INSERT_LIBRARIES=/Users/buildslave/jenkins/workspace/lldb-cmake-sanitized/host-compiler/lib/clang/11.0.0/lib/darwin/libclang_rt.asan_osx_dynamic.dylib --build-dir /Users/buildslave/jenkins/workspace/lldb-cmake-sanitized/lldb-build/lldb-test-build.noindex --lldb-module-cache-dir /Users/buildslave/jenkins/workspace/lldb-cmake-sanitized/lldb-build/lldb-test-build.noindex/module-cache-lldb/lldb-api --clang-module-cache-dir /Users/buildslave/jenkins/workspace/lldb-cmake-sanitized/lldb-build/lldb-test-build.noindex/module-cache-clang/lldb-api --executable /Users/buildslave/jenkins/workspace/lldb-cmake-sanitized/lldb-build/./bin/lldb --compiler /Users/buildslave/jenkins/workspace/lldb-cmake-sanitized/lldb-build/./bin/clang --dsymutil /Users/buildslave/jenkins/workspace/lldb-cmake-sanitized/lldb-build/./bin/dsymutil --filecheck /Users/buildslave/jenkins/workspace/lldb-cmake-sanitized/lldb-build/./bin/FileCheck --lldb-libs-dir /Users/buildslave/jenkins/workspace/lldb-cmake-sanitized/lldb-build/./lib /Users/buildslave/jenkins/workspace/lldb-cmake-sanitized/llvm-project/lldb/test/API/commands/expression/two-files -p TestObjCTypeQueryFromOtherCompileUnit.py -- Exit Code: -6

Hide Details

Command Output (stdout): -- lldb version 11.0.99 clang revision 92063228f85bfe22a6dfe20bf01c99ffe6ff3130 llvm revision 92063228f85bfe22a6dfe20bf01c99ffe6ff3130

Hide Details

-- Command Output (stderr): -- Assertion failed: (tokenKind == tok::kw___bridge_retain), function ParseParenExpression, file /Users/buildslave/jenkins/workspace/lldb-cmake-sanitized/llvm-project/clang/lib/Parse/ParseExpr.cpp, line 2804.

Hide Details

--

Hide Details

******************** PASS: lldb-unit :: Utility/./UtilityTests/CompletionRequest.FakeLastArg (1569 of 2028) PASS: lldb-api :: commands/expression/import_base_class_when_class_has_derived_member/TestImportBaseClassWhenClassHasDerivedMember.py (1570 of 2028) PASS: lldb-unit :: Utility/./UtilityTests/StringLexerTest.GetUnlexed (1571 of 2028) PASS: lldb-shell :: SymbolFile/Breakpad/line-table-mixed-path-styles.test (1572 of 2028) PASS: lldb-api :: functionalities/thread/concurrent_events/TestConcurrentTwoBreakpointsOneSignal.py (1573 of 2028) PASS: lldb-unit :: ScriptInterpreter/Python/./ScriptInterpreterPythonTests/PythonDataObjectsTest.TestPythonBytes (1574 of 2028) PASS: lldb-api :: python_api/symbol-context/two-files/TestSymbolContextTwoFiles.py (1575 of 2028) UNSUPPORTED: lldb-api :: functionalities/tsan/thread_numbers/TestTsanThreadNumbers.py (1576 of 2028) PASS: lldb-api :: functionalities/thread/concurrent_events/TestConcurrentDelaySignalWatch.py (1577 of 2028) PASS: lldb-unit :: Utility/./UtilityTests/StringListTest.InsertStringAtIndexStart (1578 of 2028) PASS: lldb-unit :: UnwindAssembly/x86/./UnwindAssemblyx86Tests/Testx86AssemblyInspectionEngine.TestPopR14 (1579 of 2028) PASS: lldb-unit :: Utility/./UtilityTests/FileSpecTest.EqualSeparator (1580 of 2028) PASS: lldb-unit :: UnwindAssembly/x86/./UnwindAssemblyx86Tests/Testx86AssemblyInspectionEngine.TestPush0 (1581 of 2028) PASS: lldb-api :: commands/command/script/TestCommandScript.py (1582 of 2028) PASS: lldb-api :: functionalities/breakpoint/debugbreak/TestDebugBreak.py (1583 of 2028) UNSUPPORTED: lldb-shell :: ScriptInterpreter/Lua/nested_sessions.test (1584 of 2028) PASS: lldb-shell :: SymbolFile/symbol-binding.test (1585 of 2028) PASS: lldb-api :: commands/expression/radar_8638051/Test8638051.py (1586 of 2028) PASS: lldb-api :: functionalities/thread/concurrent_events/TestConcurrentTwoBreakpointThreads.py (1587 of 2028) PASS: lldb-api :: lang/cpp/nsimport/TestCppNsImport.py (1588 of 2028) PASS: lldb-unit :: ScriptInterpreter/Python/./ScriptInterpreterPythonTests/PythonDataObjectsTest.TestOwnedReferences (1589 of 2028) PASS: lldb-unit :: Utility/./UtilityTests/RangeTest.ContainsEndInclusiveInvalid (1590 of 2028) PASS: lldb-api :: functionalities/dynamic_value_child_count/TestDynamicValueChildCount.py (1591 of 2028) PASS: lldb-unit :: Utility/./UtilityTests/StreamTest.AddressRangeSize (1592 of 2028) UNSUPPORTED: lldb-api :: benchmarks/stepping/TestSteppingSpeed.py (1593 of 2028) PASS: lldb-shell :: Minidump/Windows/broken-unwind.test (1594 of 2028) UNSUPPORTED: lldb-shell :: ObjectFile/ELF/minidebuginfo-set-and-hit-breakpoint.test (1595 of 2028) PASS: lldb-api :: functionalities/completion/TestCompletion.py (1596 of 2028) PASS: lldb-shell :: ObjectFile/ELF/basic-info.yaml (1597 of 2028) PASS: lldb-shell :: SymbolFile/DWARF/DW_OP_piece-smaller-than-struct.s (1598 of 2028) UNSUPPORTED: lldb-api :: tools/lldb-server/TestGdbRemoteModuleInfo.py (1599 of 2028) PASS: lldb-unit :: UnwindAssembly/x86/./UnwindAssemblyx86Tests/Testx86AssemblyInspectionEngine.Testi386IgnoredRegisters (1600 of 2028) PASS: lldb-unit :: ScriptInterpreter/Python/./ScriptInterpreterPythonTests/PythonDataObjectsTest.TestExceptions (1601 of 2028) PASS: lldb-api :: functionalities/gdb_remote_client/TestRegDefinitionInParts.py (1602 of 2028) PASS: lldb-unit :: Utility/./UtilityTests/SerializationRountripTest.SerializeDeserializeCStringArrayNullptr (1603 of 2028) PASS: lldb-api :: lang/cpp/symbols/TestSymbols.py (1604 of 2028) PASS: lldb-unit :: UnwindAssembly/x86/./UnwindAssemblyx86Tests/Testx86AssemblyInspectionEngine.TestPopRBX (1605 of 2028) PASS: lldb-unit :: Utility/./UtilityTests/VMRange.Reset (1606 of 2028) PASS: lldb-api :: commands/expression/ir-interpreter-phi-nodes/TestIRInterpreterPHINodes.py (1607 of 2028) PASS: lldb-unit :: Utility/./UtilityTests/FileSpecTest.AppendPathComponent (1608 of 2028) PASS: lldb-unit :: Utility/./UtilityTests/TimeoutTest.Format (1609 of 2028) PASS: lldb-unit :: Utility/./UtilityTests/ArgsTest.TestSingleArg (1610 of 2028) PASS: lldb-unit :: Utility/./UtilityTests/ScalarTest.APIntConstructor (1611 of 2028) PASS: lldb-unit :: Utility/./UtilityTests/SubsystemRAIITest.SubsystemWithErrorFailure (1612 of 2028) PASS: lldb-unit :: Language/Highlighting/./HighlighterTests/HighlighterTest.HighlighterSelectionType (1613 of 2028) PASS: lldb-api :: python_api/value/linked_list/TestValueAPILinkedList.py (1614 of 2028) PASS: lldb-api :: lang/c/bitfields/TestBitfields.py (1615 of 2028) PASS: lldb-unit :: Utility/./UtilityTests/StreamTeeTest.SetStreamAtIndexOverwrite (1616 of 2028) PASS: lldb-api :: functionalities/jitloader_gdb/TestJITLoaderGDB.py (1617 of 2028) PASS: lldb-shell :: Settings/TestFrameFormatMangling.test (1618 of 2028) UNSUPPORTED: lldb-shell :: SymbolFile/target-symbols-add-unwind.test (1619 of 2028) PASS: lldb-unit :: Core/./LLDBCoreTests/SourceFileCache.FindSourceFileFound (1620 of 2028) PASS: lldb-unit :: Utility/./UtilityTests/Flags.GetBitSize (1621 of 2028) PASS: lldb-unit :: Utility/./UtilityTests/RangeDataVector.FindEntryIndexesThatContain_Overlap (1622 of 2028) PASS: lldb-unit :: Process/gdb-remote/./ProcessGdbRemoteTests/GDBRemoteCommunicationServerTest.SendErrorResponse_StringError (1623 of 2028) PASS: lldb-unit :: Utility/./UtilityTests/UUIDTest.SetFromStringRef (1624 of 2028) PASS: lldb-unit :: Utility/./UtilityTests/RangeTest.Equal (1625 of 2028) PASS: lldb-unit :: Expression/./ExpressionTests/ClangExpressionDeclMapTest.TestUnknownIdentifierLookup (1626 of 2028) PASS: lldb-api :: commands/expression/import-std-module/vector-of-vectors/TestVectorOfVectorsFromStdModule.py (1627 of 2028) PASS: lldb-api :: commands/target/stop-hooks/TestStopHooks.py (1628 of 2028) PASS: lldb-unit :: Process/gdb-remote/./ProcessGdbRemoteTests/GDBRemoteCommunicationServerTest.SendErrorResponse_ErrorList (1629 of 2028) PASS: lldb-unit :: Host/./HostTests/Host.GetEnvironment (1630 of 2028) FAIL: lldb-api :: lang/objc/foundation/TestObjCMethodsString.py (1631 of 2028) ******************** TEST 'lldb-api :: lang/objc/foundation/TestObjCMethodsString.py' FAILED ******************** Script: -- /Users/buildslave/jenkins/workspace/lldb-cmake-sanitized/lldb-build/lldb-test-build.noindex/copied-system-python /Users/buildslave/jenkins/workspace/lldb-cmake-sanitized/llvm-project/lldb/test/API/dotest.py --arch x86_64 -s /Users/buildslave/jenkins/workspace/lldb-cmake-sanitized/lldb-build/lldb-test-traces -S nm -u CXXFLAGS -u CFLAGS --codesign-identity lldb_codesign --server /Users/buildslave/jenkins/workspace/lldb-cmake-sanitized/lldb-build/./bin/debugserver --arch x86_64 --build-dir /Users/buildslave/jenkins/workspace/lldb-cmake-sanitized/lldb-build/lldb-test-build.noindex -s=/Users/buildslave/jenkins/workspace/lldb-cmake-sanitized/test/logs -t --env TERM=vt100 --env LLVM_LIBS_DIR=/Users/buildslave/jenkins/workspace/lldb-cmake-sanitized/lldb-build/./lib --inferior-env ASAN_OPTIONS=detect_stack_use_after_return=1 --inferior-env DYLD_INSERT_LIBRARIES=/Users/buildslave/jenkins/workspace/lldb-cmake-sanitized/host-compiler/lib/clang/11.0.0/lib/darwin/libclang_rt.asan_osx_dynamic.dylib --build-dir /Users/buildslave/jenkins/workspace/lldb-cmake-sanitized/lldb-build/lldb-test-build.noindex --lldb-module-cache-dir /Users/buildslave/jenkins/workspace/lldb-cmake-sanitized/lldb-build/lldb-test-build.noindex/module-cache-lldb/lldb-api --clang-module-cache-dir /Users/buildslave/jenkins/workspace/lldb-cmake-sanitized/lldb-build/lldb-test-build.noindex/module-cache-clang/lldb-api --executable /Users/buildslave/jenkins/workspace/lldb-cmake-sanitized/lldb-build/./bin/lldb --compiler /Users/buildslave/jenkins/workspace/lldb-cmake-sanitized/lldb-build/./bin/clang --dsymutil /Users/buildslave/jenkins/workspace/lldb-cmake-sanitized/lldb-build/./bin/dsymutil --filecheck /Users/buildslave/jenkins/workspace/lldb-cmake-sanitized/lldb-build/./bin/FileCheck --lldb-libs-dir /Users/buildslave/jenkins/workspace/lldb-cmake-sanitized/lldb-build/./lib /Users/buildslave/jenkins/workspace/lldb-cmake-sanitized/llvm-project/lldb/test/API/lang/objc/foundation -p TestObjCMethodsString.py -- Exit Code: -6

Hide Details

Command Output (stdout): -- lldb version 11.0.99 clang revision 92063228f85bfe22a6dfe20bf01c99ffe6ff3130 llvm revision 92063228f85bfe22a6dfe20bf01c99ffe6ff3130

Hide Details

-- Command Output (stderr): -- Assertion failed: (tokenKind == tok::kw___bridge_retain), function ParseParenExpression, file /Users/buildslave/jenkins/workspace/lldb-cmake-sanitized/llvm-project/clang/lib/Parse/ParseExpr.cpp, line 2804.

Hide Details

--

Hide Details

******************** FAIL: lldb-api :: lang/objc/objc++/TestObjCXX.py (1632 of 2028) ******************** TEST 'lldb-api :: lang/objc/objc++/TestObjCXX.py' FAILED ******************** Script: -- /Users/buildslave/jenkins/workspace/lldb-cmake-sanitized/lldb-build/lldb-test-build.noindex/copied-system-python /Users/buildslave/jenkins/workspace/lldb-cmake-sanitized/llvm-project/lldb/test/API/dotest.py --arch x86_64 -s /Users/buildslave/jenkins/workspace/lldb-cmake-sanitized/lldb-build/lldb-test-traces -S nm -u CXXFLAGS -u CFLAGS --codesign-identity lldb_codesign --server /Users/buildslave/jenkins/workspace/lldb-cmake-sanitized/lldb-build/./bin/debugserver --arch x86_64 --build-dir /Users/buildslave/jenkins/workspace/lldb-cmake-sanitized/lldb-build/lldb-test-build.noindex -s=/Users/buildslave/jenkins/workspace/lldb-cmake-sanitized/test/logs -t --env TERM=vt100 --env LLVM_LIBS_DIR=/Users/buildslave/jenkins/workspace/lldb-cmake-sanitized/lldb-build/./lib --inferior-env ASAN_OPTIONS=detect_stack_use_after_return=1 --inferior-env DYLD_INSERT_LIBRARIES=/Users/buildslave/jenkins/workspace/lldb-cmake-sanitized/host-compiler/lib/clang/11.0.0/lib/darwin/libclang_rt.asan_osx_dynamic.dylib --build-dir /Users/buildslave/jenkins/workspace/lldb-cmake-sanitized/lldb-build/lldb-test-build.noindex --lldb-module-cache-dir /Users/buildslave/jenkins/workspace/lldb-cmake-sanitized/lldb-build/lldb-test-build.noindex/module-cache-lldb/lldb-api --clang-module-cache-dir /Users/buildslave/jenkins/workspace/lldb-cmake-sanitized/lldb-build/lldb-test-build.noindex/module-cache-clang/lldb-api --executable /Users/buildslave/jenkins/workspace/lldb-cmake-sanitized/lldb-build/./bin/lldb --compiler /Users/buildslave/jenkins/workspace/lldb-cmake-sanitized/lldb-build/./bin/clang --dsymutil /Users/buildslave/jenkins/workspace/lldb-cmake-sanitized/lldb-build/./bin/dsymutil --filecheck /Users/buildslave/jenkins/workspace/lldb-cmake-sanitized/lldb-build/./bin/FileCheck --lldb-libs-dir /Users/buildslave/jenkins/workspace/lldb-cmake-sanitized/lldb-build/./lib /Users/buildslave/jenkins/workspace/lldb-cmake-sanitized/llvm-project/lldb/test/API/lang/objc/objc++ -p TestObjCXX.py -- Exit Code: -6

Hide Details

Command Output (stdout): -- lldb version 11.0.99 clang revision 92063228f85bfe22a6dfe20bf01c99ffe6ff3130 llvm revision 92063228f85bfe22a6dfe20bf01c99ffe6ff3130

Hide Details

-- Command Output (stderr): -- Assertion failed: (tokenKind == tok::kw___bridge_retain), function ParseParenExpression, file /Users/buildslave/jenkins/workspace/lldb-cmake-sanitized/llvm-project/clang/lib/Parse/ParseExpr.cpp, line 2804.

Hide Details

--

Hide Details

******************** PASS: lldb-unit :: Signals/./SignalsTests/UnixSignalsTest.GetInfo (1633 of 2028) PASS: lldb-unit :: Utility/./UtilityTests/StreamTest.PutCharWhitespace (1634 of 2028) PASS: lldb-unit :: Process/gdb-remote/./ProcessGdbRemoteTests/GDBRemoteCommunicationClientTest.ReadRegister (1635 of 2028) PASS: lldb-unit :: Expression/./ExpressionTests/ClangHostTest.MacOSX (1636 of 2028) PASS: lldb-api :: functionalities/data-formatter/data-formatter-stl/libcxx/initializerlist/TestInitializerList.py (1637 of 2028) PASS: lldb-unit :: Host/./HostTests/MainLoopTest.DetectsEOF (1638 of 2028) UNSUPPORTED: lldb-shell :: SymbolFile/PDB/func-symbols.test (1639 of 2028) PASS: lldb-shell :: Register/x86-64-gp-read.test (1640 of 2028) PASS: lldb-api :: lang/cpp/stl/TestSTL.py (1641 of 2028) PASS: lldb-api :: functionalities/signal/handle-abrt/TestHandleAbort.py (1642 of 2028) PASS: lldb-api :: functionalities/gdb_remote_client/TestNestedRegDefinitions.py (1643 of 2028) PASS: lldb-api :: functionalities/fat_archives/TestFatArchives.py (1644 of 2028) PASS: lldb-unit :: Symbol/./SymbolTests/TestTypeSystemClang.TestOwningModule (1645 of 2028) PASS: lldb-shell :: SymbolFile/Breakpad/symtab-macho.test (1646 of 2028) PASS: lldb-unit :: Utility/./UtilityTests/StringExtractorTest.GetU64BigEndian (1647 of 2028) PASS: lldb-shell :: SymbolFile/DWARF/dwp-debug-types.s (1648 of 2028) PASS: lldb-unit :: Utility/./UtilityTests/ScalarTest.Scalar_512 (1649 of 2028) PASS: lldb-unit :: Utility/./UtilityTests/ConstStringTest.UpdateMangledCounterpart (1650 of 2028) PASS: lldb-api :: python_api/sbenvironment/TestSBEnvironment.py (1651 of 2028) PASS: lldb-unit :: Utility/./UtilityTests/FileSpecTest.FileAndDirectoryComponents (1652 of 2028) PASS: lldb-shell :: SymbolFile/DWARF/dwarf5-index-is-used.cpp (1653 of 2028) PASS: lldb-api :: python_api/value/TestValueAPI.py (1654 of 2028) PASS: lldb-api :: functionalities/data-formatter/data-formatter-stl/libcxx/list/loop/TestDataFormatterLibcxxListLoop.py (1655 of 2028) PASS: lldb-api :: python_api/default-constructor/TestDefaultConstructorForAPIObjects.py (1656 of 2028) PASS: lldb-api :: functionalities/data-formatter/boolreference/TestFormattersBoolRefPtr.py (1657 of 2028) UNSUPPORTED: lldb-api :: commands/register/register/intel_xtended_registers/TestMPXRegisters.py (1658 of 2028) PASS: lldb-shell :: ScriptInterpreter/Python/crashlog.test (1659 of 2028) PASS: lldb-unit :: Utility/./UtilityTests/UriParserTest.SchemeHostSeparator2 (1660 of 2028) UNSUPPORTED: lldb-api :: iohandler/completion/TestIOHandlerCompletion.py (1661 of 2028) PASS: lldb-unit :: Language/Highlighting/./HighlighterTests/HighlighterTest.ClangStringLiterals (1662 of 2028) PASS: lldb-unit :: Symbol/./SymbolTests/TestClangASTImporter.CompleteFwdDeclWithOtherOrigin (1663 of 2028) UNSUPPORTED: lldb-shell :: Register/x86-64-zmm-write.test (1664 of 2028) PASS: lldb-unit :: Utility/./UtilityTests/RecordReplayTest.InstrumentedBarRef (1665 of 2028) UNSUPPORTED: lldb-shell :: Watchpoint/netbsd-nouserdbregs.test (1666 of 2028) PASS: lldb-unit :: Utility/./UtilityTests/VMRange.SetEndAddress (1667 of 2028) FAIL: lldb-api :: lang/objcxx/objcxx-ivar-vector/TestIvarVector.py (1668 of 2028) ******************** TEST 'lldb-api :: lang/objcxx/objcxx-ivar-vector/TestIvarVector.py' FAILED ******************** Script: -- /Users/buildslave/jenkins/workspace/lldb-cmake-sanitized/lldb-build/lldb-test-build.noindex/copied-system-python /Users/buildslave/jenkins/workspace/lldb-cmake-sanitized/llvm-project/lldb/test/API/dotest.py --arch x86_64 -s /Users/buildslave/jenkins/workspace/lldb-cmake-sanitized/lldb-build/lldb-test-traces -S nm -u CXXFLAGS -u CFLAGS --codesign-identity lldb_codesign --server /Users/buildslave/jenkins/workspace/lldb-cmake-sanitized/lldb-build/./bin/debugserver --arch x86_64 --build-dir /Users/buildslave/jenkins/workspace/lldb-cmake-sanitized/lldb-build/lldb-test-build.noindex -s=/Users/buildslave/jenkins/workspace/lldb-cmake-sanitized/test/logs -t --env TERM=vt100 --env LLVM_LIBS_DIR=/Users/buildslave/jenkins/workspace/lldb-cmake-sanitized/lldb-build/./lib --inferior-env ASAN_OPTIONS=detect_stack_use_after_return=1 --inferior-env DYLD_INSERT_LIBRARIES=/Users/buildslave/jenkins/workspace/lldb-cmake-sanitized/host-compiler/lib/clang/11.0.0/lib/darwin/libclang_rt.asan_osx_dynamic.dylib --build-dir /Users/buildslave/jenkins/workspace/lldb-cmake-sanitized/lldb-build/lldb-test-build.noindex --lldb-module-cache-dir /Users/buildslave/jenkins/workspace/lldb-cmake-sanitized/lldb-build/lldb-test-build.noindex/module-cache-lldb/lldb-api --clang-module-cache-dir /Users/buildslave/jenkins/workspace/lldb-cmake-sanitized/lldb-build/lldb-test-build.noindex/module-cache-clang/lldb-api --executable /Users/buildslave/jenkins/workspace/lldb-cmake-sanitized/lldb-build/./bin/lldb --compiler /Users/buildslave/jenkins/workspace/lldb-cmake-sanitized/lldb-build/./bin/clang --dsymutil /Users/buildslave/jenkins/workspace/lldb-cmake-sanitized/lldb-build/./bin/dsymutil --filecheck /Users/buildslave/jenkins/workspace/lldb-cmake-sanitized/lldb-build/./bin/FileCheck --lldb-libs-dir /Users/buildslave/jenkins/workspace/lldb-cmake-sanitized/lldb-build/./lib /Users/buildslave/jenkins/workspace/lldb-cmake-sanitized/llvm-project/lldb/test/API/lang/objcxx/objcxx-ivar-vector -p TestIvarVector.py -- Exit Code: -6

Hide Details

Command Output (stdout): -- lldb version 11.0.99 clang revision 92063228f85bfe22a6dfe20bf01c99ffe6ff3130 llvm revision 92063228f85bfe22a6dfe20bf01c99ffe6ff3130

Hide Details

-- Command Output (stderr): -- Assertion failed: (tokenKind == tok::kw___bridge_retain), function ParseParenExpression, file /Users/buildslave/jenkins/workspace/lldb-cmake-sanitized/llvm-project/clang/lib/Parse/ParseExpr.cpp, line 2804.

Hide Details

--

Hide Details

******************** PASS: lldb-api :: functionalities/breakpoint/breakpoint_by_line_and_column/TestBreakpointByLineAndColumn.py (1669 of 2028) PASS: lldb-unit :: Utility/./UtilityTests/SubsystemRAIITest.SubsystemWithErrorSuccess (1670 of 2028) PASS: lldb-api :: functionalities/breakpoint/consecutive_breakpoints/TestConsecutiveBreakpoints.py (1671 of 2028) PASS: lldb-api :: python_api/process/read-mem-cstring/TestReadMemCString.py (1672 of 2028) PASS: lldb-api :: functionalities/data-formatter/pyobjsynthprovider/TestPyObjSynthProvider.py (1673 of 2028) PASS: lldb-unit :: UnwindAssembly/x86/./UnwindAssemblyx86Tests/Testx86AssemblyInspectionEngine.TestDisassemblyMidFunctionEpilogues (1674 of 2028) PASS: lldb-api :: tools/lldb-server/TestGdbRemoteExpeditedRegisters.py (1675 of 2028) PASS: lldb-shell :: ObjectFile/MachO/lc_build_version_notools.yaml (1676 of 2028) PASS: lldb-api :: functionalities/float-display/TestFloatDisplay.py (1677 of 2028) PASS: lldb-unit :: Utility/./UtilityTests/AnsiTerminal.WhiteSpace (1678 of 2028) PASS: lldb-unit :: Symbol/./SymbolTests/PostfixExpression.ParseFPOProgram (1679 of 2028) PASS: lldb-unit :: UnwindAssembly/x86/./UnwindAssemblyx86Tests/Testx86AssemblyInspectionEngine.Test32BitOnlyInstruction (1680 of 2028) PASS: lldb-shell :: SymbolFile/DWARF/debug_ranges.s (1681 of 2028) PASS: lldb-unit :: Process/minidump/./LLDBMinidumpTests/RegisterContextMinidump.ConvertMinidumpContext_x86_64 (1682 of 2028) FAIL: lldb-api :: lang/objc/self/TestObjCSelf.py (1683 of 2028) ******************** TEST 'lldb-api :: lang/objc/self/TestObjCSelf.py' FAILED ******************** Script: -- /Users/buildslave/jenkins/workspace/lldb-cmake-sanitized/lldb-build/lldb-test-build.noindex/copied-system-python /Users/buildslave/jenkins/workspace/lldb-cmake-sanitized/llvm-project/lldb/test/API/dotest.py --arch x86_64 -s /Users/buildslave/jenkins/workspace/lldb-cmake-sanitized/lldb-build/lldb-test-traces -S nm -u CXXFLAGS -u CFLAGS --codesign-identity lldb_codesign --server /Users/buildslave/jenkins/workspace/lldb-cmake-sanitized/lldb-build/./bin/debugserver --arch x86_64 --build-dir /Users/buildslave/jenkins/workspace/lldb-cmake-sanitized/lldb-build/lldb-test-build.noindex -s=/Users/buildslave/jenkins/workspace/lldb-cmake-sanitized/test/logs -t --env TERM=vt100 --env LLVM_LIBS_DIR=/Users/buildslave/jenkins/workspace/lldb-cmake-sanitized/lldb-build/./lib --inferior-env ASAN_OPTIONS=detect_stack_use_after_return=1 --inferior-env DYLD_INSERT_LIBRARIES=/Users/buildslave/jenkins/workspace/lldb-cmake-sanitized/host-compiler/lib/clang/11.0.0/lib/darwin/libclang_rt.asan_osx_dynamic.dylib --build-dir /Users/buildslave/jenkins/workspace/lldb-cmake-sanitized/lldb-build/lldb-test-build.noindex --lldb-module-cache-dir /Users/buildslave/jenkins/workspace/lldb-cmake-sanitized/lldb-build/lldb-test-build.noindex/module-cache-lldb/lldb-api --clang-module-cache-dir /Users/buildslave/jenkins/workspace/lldb-cmake-sanitized/lldb-build/lldb-test-build.noindex/module-cache-clang/lldb-api --executable /Users/buildslave/jenkins/workspace/lldb-cmake-sanitized/lldb-build/./bin/lldb --compiler /Users/buildslave/jenkins/workspace/lldb-cmake-sanitized/lldb-build/./bin/clang --dsymutil /Users/buildslave/jenkins/workspace/lldb-cmake-sanitized/lldb-build/./bin/dsymutil --filecheck /Users/buildslave/jenkins/workspace/lldb-cmake-sanitized/lldb-build/./bin/FileCheck --lldb-libs-dir /Users/buildslave/jenkins/workspace/lldb-cmake-sanitized/lldb-build/./lib /Users/buildslave/jenkins/workspace/lldb-cmake-sanitized/llvm-project/lldb/test/API/lang/objc/self -p TestObjCSelf.py -- Exit Code: -6

Hide Details

Command Output (stdout): -- lldb version 11.0.99 clang revision 92063228f85bfe22a6dfe20bf01c99ffe6ff3130 llvm revision 92063228f85bfe22a6dfe20bf01c99ffe6ff3130

Hide Details

-- Command Output (stderr): -- Assertion failed: (tokenKind == tok::kw___bridge_retain), function ParseParenExpression, file /Users/buildslave/jenkins/workspace/lldb-cmake-sanitized/llvm-project/clang/lib/Parse/ParseExpr.cpp, line 2804.

Hide Details

--

Hide Details

******************** PASS: lldb-unit :: Utility/./UtilityTests/Flags.AnyClear (1684 of 2028) PASS: lldb-unit :: Utility/./UtilityTests/StreamTest.PutHex64ByteOrderBig (1685 of 2028) PASS: lldb-unit :: Host/./HostTests/SocketTest.UDPGetConnectURI (1686 of 2028) PASS: lldb-unit :: Utility/./UtilityTests/Predicate.WaitForValueNotEqualTo (1687 of 2028) PASS: lldb-shell :: Reproducer/TestVersionCheck.test (1688 of 2028) PASS: lldb-api :: functionalities/breakpoint/move_nearest/TestMoveNearest.py (1689 of 2028) PASS: lldb-api :: functionalities/data-formatter/data-formatter-objc/TestDataFormatterObjCKVO.py (1690 of 2028) PASS: lldb-shell :: SymbolFile/DWARF/debug_rnglists.s (1691 of 2028) PASS: lldb-unit :: Utility/./UtilityTests/StreamTeeTest.Assignment (1692 of 2028) PASS: lldb-api :: lang/objc/objc-checker/TestObjCCheckers.py (1693 of 2028) PASS: lldb-unit :: Utility/./UtilityTests/ProcessInstanceInfo.DumpTable (1694 of 2028) XFAIL: lldb-shell :: Register/x86-64-write.test (1695 of 2028) PASS: lldb-unit :: Language/Highlighting/./HighlighterTests/HighlighterTest.DefaultHighlighter (1696 of 2028) PASS: lldb-api :: functionalities/data-formatter/data-formatter-stl/libcxx/vector/TestDataFormatterLibcxxVector.py (1697 of 2028) PASS: lldb-unit :: Utility/./UtilityTests/NameMatchesTest.Ignore (1698 of 2028) PASS: lldb-api :: lang/cpp/std-function-step-into-callable/TestStdFunctionStepIntoCallable.py (1699 of 2028) PASS: lldb-shell :: Settings/TestDisableColor.test (1700 of 2028) PASS: lldb-unit :: Host/./HostTests/FileSystemTest.FileAndDirectoryComponents (1701 of 2028) PASS: lldb-unit :: Utility/./UtilityTests/ScalarTest.SetValueFromCString (1702 of 2028) UNSUPPORTED: lldb-api :: functionalities/tty/TestTerminal.py (1703 of 2028) PASS: lldb-shell :: SymbolFile/DWARF/find-basic-variable.cpp (1704 of 2028) PASS: lldb-api :: functionalities/data-formatter/data-formatter-caching/TestDataFormatterCaching.py (1705 of 2028) PASS: lldb-api :: python_api/sbplatform/TestSBPlatform.py (1706 of 2028) PASS: lldb-api :: commands/frame/diagnose/array/TestArray.py (1707 of 2028) PASS: lldb-unit :: Utility/./UtilityTests/StringListTest.GetMaxStringLengthMixed (1708 of 2028) PASS: lldb-unit :: Core/./LLDBCoreTests/SourceFileCache.FindSourceFileNotFound (1709 of 2028) PASS: lldb-unit :: Utility/./UtilityTests/XcodeSDKTest.GetSDKTypeForTriple (1710 of 2028) PASS: lldb-unit :: Utility/./UtilityTests/StreamTeeTest.DefaultConstructor (1711 of 2028) PASS: lldb-unit :: Interpreter/./InterpreterTests/CompletionTest.FileCompletionAbsolute (1712 of 2028) PASS: lldb-unit :: Utility/./UtilityTests/BinaryStreamTest.PutSLEB128Zero (1713 of 2028) FAIL: lldb-api :: commands/expression/po_verbosity/TestPoVerbosity.py (1714 of 2028) ******************** TEST 'lldb-api :: commands/expression/po_verbosity/TestPoVerbosity.py' FAILED ******************** Script: -- /Users/buildslave/jenkins/workspace/lldb-cmake-sanitized/lldb-build/lldb-test-build.noindex/copied-system-python /Users/buildslave/jenkins/workspace/lldb-cmake-sanitized/llvm-project/lldb/test/API/dotest.py --arch x86_64 -s /Users/buildslave/jenkins/workspace/lldb-cmake-sanitized/lldb-build/lldb-test-traces -S nm -u CXXFLAGS -u CFLAGS --codesign-identity lldb_codesign --server /Users/buildslave/jenkins/workspace/lldb-cmake-sanitized/lldb-build/./bin/debugserver --arch x86_64 --build-dir /Users/buildslave/jenkins/workspace/lldb-cmake-sanitized/lldb-build/lldb-test-build.noindex -s=/Users/buildslave/jenkins/workspace/lldb-cmake-sanitized/test/logs -t --env TERM=vt100 --env LLVM_LIBS_DIR=/Users/buildslave/jenkins/workspace/lldb-cmake-sanitized/lldb-build/./lib --inferior-env ASAN_OPTIONS=detect_stack_use_after_return=1 --inferior-env DYLD_INSERT_LIBRARIES=/Users/buildslave/jenkins/workspace/lldb-cmake-sanitized/host-compiler/lib/clang/11.0.0/lib/darwin/libclang_rt.asan_osx_dynamic.dylib --build-dir /Users/buildslave/jenkins/workspace/lldb-cmake-sanitized/lldb-build/lldb-test-build.noindex --lldb-module-cache-dir /Users/buildslave/jenkins/workspace/lldb-cmake-sanitized/lldb-build/lldb-test-build.noindex/module-cache-lldb/lldb-api --clang-module-cache-dir /Users/buildslave/jenkins/workspace/lldb-cmake-sanitized/lldb-build/lldb-test-build.noindex/module-cache-clang/lldb-api --executable /Users/buildslave/jenkins/workspace/lldb-cmake-sanitized/lldb-build/./bin/lldb --compiler /Users/buildslave/jenkins/workspace/lldb-cmake-sanitized/lldb-build/./bin/clang --dsymutil /Users/buildslave/jenkins/workspace/lldb-cmake-sanitized/lldb-build/./bin/dsymutil --filecheck /Users/buildslave/jenkins/workspace/lldb-cmake-sanitized/lldb-build/./bin/FileCheck --lldb-libs-dir /Users/buildslave/jenkins/workspace/lldb-cmake-sanitized/lldb-build/./lib /Users/buildslave/jenkins/workspace/lldb-cmake-sanitized/llvm-project/lldb/test/API/commands/expression/po_verbosity -p TestPoVerbosity.py -- Exit Code: -6

Hide Details

Command Output (stdout): -- lldb version 11.0.99 clang revision 92063228f85bfe22a6dfe20bf01c99ffe6ff3130 llvm revision 92063228f85bfe22a6dfe20bf01c99ffe6ff3130

Hide Details

-- Command Output (stderr): -- Assertion failed: (tokenKind == tok::kw___bridge_retain), function ParseParenExpression, file /Users/buildslave/jenkins/workspace/lldb-cmake-sanitized/llvm-project/clang/lib/Parse/ParseExpr.cpp, line 2804.

Hide Details

--

Hide Details

******************** PASS: lldb-unit :: Process/minidump/./LLDBMinidumpTests/MinidumpParserTest.FindMemoryRangeWithFullMemoryMinidump (1715 of 2028) PASS: lldb-unit :: ScriptInterpreter/Python/./ScriptInterpreterPythonTests/PythonDataObjectsTest.TestPythonTupleInitializerList2 (1716 of 2028) UNSUPPORTED: lldb-api :: functionalities/darwin_log/basic/TestDarwinLogBasic.py (1717 of 2028) PASS: lldb-shell :: SymbolFile/DWARF/debug-types-address-ranges.s (1718 of 2028) UNSUPPORTED: lldb-shell :: SymbolFile/PDB/class-layout.test (1719 of 2028) FAIL: lldb-api :: lang/objc/foundation/TestConstStrings.py (1720 of 2028) ******************** TEST 'lldb-api :: lang/objc/foundation/TestConstStrings.py' FAILED ******************** Script: -- /Users/buildslave/jenkins/workspace/lldb-cmake-sanitized/lldb-build/lldb-test-build.noindex/copied-system-python /Users/buildslave/jenkins/workspace/lldb-cmake-sanitized/llvm-project/lldb/test/API/dotest.py --arch x86_64 -s /Users/buildslave/jenkins/workspace/lldb-cmake-sanitized/lldb-build/lldb-test-traces -S nm -u CXXFLAGS -u CFLAGS --codesign-identity lldb_codesign --server /Users/buildslave/jenkins/workspace/lldb-cmake-sanitized/lldb-build/./bin/debugserver --arch x86_64 --build-dir /Users/buildslave/jenkins/workspace/lldb-cmake-sanitized/lldb-build/lldb-test-build.noindex -s=/Users/buildslave/jenkins/workspace/lldb-cmake-sanitized/test/logs -t --env TERM=vt100 --env LLVM_LIBS_DIR=/Users/buildslave/jenkins/workspace/lldb-cmake-sanitized/lldb-build/./lib --inferior-env ASAN_OPTIONS=detect_stack_use_after_return=1 --inferior-env DYLD_INSERT_LIBRARIES=/Users/buildslave/jenkins/workspace/lldb-cmake-sanitized/host-compiler/lib/clang/11.0.0/lib/darwin/libclang_rt.asan_osx_dynamic.dylib --build-dir /Users/buildslave/jenkins/workspace/lldb-cmake-sanitized/lldb-build/lldb-test-build.noindex --lldb-module-cache-dir /Users/buildslave/jenkins/workspace/lldb-cmake-sanitized/lldb-build/lldb-test-build.noindex/module-cache-lldb/lldb-api --clang-module-cache-dir /Users/buildslave/jenkins/workspace/lldb-cmake-sanitized/lldb-build/lldb-test-build.noindex/module-cache-clang/lldb-api --executable /Users/buildslave/jenkins/workspace/lldb-cmake-sanitized/lldb-build/./bin/lldb --compiler /Users/buildslave/jenkins/workspace/lldb-cmake-sanitized/lldb-build/./bin/clang --dsymutil /Users/buildslave/jenkins/workspace/lldb-cmake-sanitized/lldb-build/./bin/dsymutil --filecheck /Users/buildslave/jenkins/workspace/lldb-cmake-sanitized/lldb-build/./bin/FileCheck --lldb-libs-dir /Users/buildslave/jenkins/workspace/lldb-cmake-sanitized/lldb-build/./lib /Users/buildslave/jenkins/workspace/lldb-cmake-sanitized/llvm-project/lldb/test/API/lang/objc/foundation -p TestConstStrings.py -- Exit Code: -6

Hide Details

Command Output (stdout): -- lldb version 11.0.99 clang revision 92063228f85bfe22a6dfe20bf01c99ffe6ff3130 llvm revision 92063228f85bfe22a6dfe20bf01c99ffe6ff3130

Hide Details

-- Command Output (stderr): -- Assertion failed: (tokenKind == tok::kw___bridge_retain), function ParseParenExpression, file /Users/buildslave/jenkins/workspace/lldb-cmake-sanitized/llvm-project/clang/lib/Parse/ParseExpr.cpp, line 2804.

Hide Details

--

Hide Details

******************** PASS: lldb-unit :: SymbolFile/DWARF/./SymbolFileDWARFTests/SymbolFileDWARFTests.TestAbbrevMissingTerminator (1721 of 2028) PASS: lldb-api :: functionalities/postmortem/netbsd-core/TestNetBSDCore.py (1722 of 2028) UNSUPPORTED: lldb-api :: functionalities/tsan/global_location/TestTsanGlobalLocation.py (1723 of 2028) PASS: lldb-shell :: Driver/TestCommands.test (1724 of 2028) PASS: lldb-api :: commands/expression/completion-crash-incomplete-record/TestCompletionCrashIncompleteRecord.py (1725 of 2028) PASS: lldb-api :: functionalities/data-formatter/data-formatter-categories/TestDataFormatterCategories.py (1726 of 2028) PASS: lldb-api :: functionalities/gdb_remote_client/TestJLink6Armv7RegisterDefinition.py (1727 of 2028) PASS: lldb-api :: functionalities/breakpoint/address_breakpoints/TestBadAddressBreakpoints.py (1728 of 2028) PASS: lldb-shell :: ObjectFile/ELF/build-id-case.yaml (1729 of 2028) UNSUPPORTED: lldb-api :: functionalities/asan/TestReportData.py (1730 of 2028) PASS: lldb-unit :: SymbolFile/DWARF/./SymbolFileDWARFTests/SymbolFileDWARFTests.TestAbbrevOutOfOrder (1731 of 2028) PASS: lldb-unit :: Utility/./UtilityTests/StreamTest.AddressEmptyPrefix (1732 of 2028) PASS: lldb-api :: functionalities/postmortem/elf-core/gcore/TestGCore.py (1733 of 2028) PASS: lldb-unit :: Utility/./UtilityTests/RangeTest.DefaultConstructor (1734 of 2028) PASS: lldb-api :: functionalities/data-formatter/data-formatter-stl/libcxx/atomic/TestLibCxxAtomic.py (1735 of 2028) FAIL: lldb-api :: lang/objc/forward-decl/TestForwardDecl.py (1736 of 2028) ******************** TEST 'lldb-api :: lang/objc/forward-decl/TestForwardDecl.py' FAILED ******************** Script: -- /Users/buildslave/jenkins/workspace/lldb-cmake-sanitized/lldb-build/lldb-test-build.noindex/copied-system-python /Users/buildslave/jenkins/workspace/lldb-cmake-sanitized/llvm-project/lldb/test/API/dotest.py --arch x86_64 -s /Users/buildslave/jenkins/workspace/lldb-cmake-sanitized/lldb-build/lldb-test-traces -S nm -u CXXFLAGS -u CFLAGS --codesign-identity lldb_codesign --server /Users/buildslave/jenkins/workspace/lldb-cmake-sanitized/lldb-build/./bin/debugserver --arch x86_64 --build-dir /Users/buildslave/jenkins/workspace/lldb-cmake-sanitized/lldb-build/lldb-test-build.noindex -s=/Users/buildslave/jenkins/workspace/lldb-cmake-sanitized/test/logs -t --env TERM=vt100 --env LLVM_LIBS_DIR=/Users/buildslave/jenkins/workspace/lldb-cmake-sanitized/lldb-build/./lib --inferior-env ASAN_OPTIONS=detect_stack_use_after_return=1 --inferior-env DYLD_INSERT_LIBRARIES=/Users/buildslave/jenkins/workspace/lldb-cmake-sanitized/host-compiler/lib/clang/11.0.0/lib/darwin/libclang_rt.asan_osx_dynamic.dylib --build-dir /Users/buildslave/jenkins/workspace/lldb-cmake-sanitized/lldb-build/lldb-test-build.noindex --lldb-module-cache-dir /Users/buildslave/jenkins/workspace/lldb-cmake-sanitized/lldb-build/lldb-test-build.noindex/module-cache-lldb/lldb-api --clang-module-cache-dir /Users/buildslave/jenkins/workspace/lldb-cmake-sanitized/lldb-build/lldb-test-build.noindex/module-cache-clang/lldb-api --executable /Users/buildslave/jenkins/workspace/lldb-cmake-sanitized/lldb-build/./bin/lldb --compiler /Users/buildslave/jenkins/workspace/lldb-cmake-sanitized/lldb-build/./bin/clang --dsymutil /Users/buildslave/jenkins/workspace/lldb-cmake-sanitized/lldb-build/./bin/dsymutil --filecheck /Users/buildslave/jenkins/workspace/lldb-cmake-sanitized/lldb-build/./bin/FileCheck --lldb-libs-dir /Users/buildslave/jenkins/workspace/lldb-cmake-sanitized/lldb-build/./lib /Users/buildslave/jenkins/workspace/lldb-cmake-sanitized/llvm-project/lldb/test/API/lang/objc/forward-decl -p TestForwardDecl.py -- Exit Code: -6

Hide Details

Command Output (stdout): -- lldb version 11.0.99 clang revision 92063228f85bfe22a6dfe20bf01c99ffe6ff3130 llvm revision 92063228f85bfe22a6dfe20bf01c99ffe6ff3130

Hide Details

-- Command Output (stderr): -- Assertion failed: (tokenKind == tok::kw___bridge_retain), function ParseParenExpression, file /Users/buildslave/jenkins/workspace/lldb-cmake-sanitized/llvm-project/clang/lib/Parse/ParseExpr.cpp, line 2804.

Hide Details

--

Hide Details

******************** PASS: lldb-unit :: Utility/./UtilityTests/BinaryStreamTest.PutULEB128One (1737 of 2028) PASS: lldb-unit :: Utility/./UtilityTests/OptionsWithRawTest.WhitespaceSuffix (1738 of 2028) UNSUPPORTED: lldb-shell :: Register/arm-gp-read.test (1739 of 2028) PASS: lldb-unit :: UnwindAssembly/x86/./UnwindAssemblyx86Tests/Testx86AssemblyInspectionEngine.TestLEAVE (1740 of 2028) UNSUPPORTED: lldb-shell :: Register/arm-fp-read.test (1741 of 2028) PASS: lldb-unit :: Process/gdb-remote/./ProcessGdbRemoteTests/GDBRemoteClientBaseTest.SendContinueAndInterrupt2PacketBug (1742 of 2028) PASS: lldb-unit :: Language/Highlighting/./HighlighterTests/HighlighterTest.ClangTrailingBackslashWithWhitespace (1743 of 2028) PASS: lldb-unit :: Utility/./UtilityTests/StringExtractorTest.GetHexU8_InvalidHex_NoEof (1744 of 2028) PASS: lldb-unit :: Utility/./UtilityTests/StreamTest.AddressRange (1745 of 2028) PASS: lldb-unit :: Utility/./UtilityTests/StreamTest.PutSLEB128 (1746 of 2028) PASS: lldb-unit :: Utility/./UtilityTests/OptionsWithRawTest.WhitespaceInput (1747 of 2028) PASS: lldb-unit :: Utility/./UtilityTests/StringListTest.GetSize (1748 of 2028) PASS: lldb-unit :: Utility/./UtilityTests/ProcessInfoTest.Constructor (1749 of 2028) PASS: lldb-unit :: Symbol/./SymbolTests/TestTypeSystemClang.TestDisplayName (1750 of 2028) PASS: lldb-shell :: SymbolFile/DWARF/clang-ast-from-dwarf-objc-property.m (1751 of 2028) PASS: lldb-unit :: Utility/./UtilityTests/StringLexerTest.NextIfList (1752 of 2028) PASS: lldb-unit :: Utility/./UtilityTests/ListenerTest.GetEventWait (1753 of 2028) PASS: lldb-api :: commands/command/script/import/rdar-12586188/TestRdar12586188.py (1754 of 2028) PASS: lldb-unit :: Utility/./UtilityTests/StreamTest.PutHex16ByteOrderLittle (1755 of 2028) PASS: lldb-unit :: Utility/./UtilityTests/StreamTest.QuotedCString (1756 of 2028) PASS: lldb-api :: commands/expression/test/TestExprs.py (1757 of 2028) UNSUPPORTED: lldb-api :: benchmarks/expression/TestRepeatedExprs.py (1758 of 2028) PASS: lldb-api :: commands/watchpoints/watchpoint_disable/TestWatchpointDisable.py (1759 of 2028) PASS: lldb-unit :: Utility/./UtilityTests/FileSpecTest.EqualDotsPosixRoot (1760 of 2028) PASS: lldb-unit :: Utility/./UtilityTests/LogChannelTest.Enable (1761 of 2028) PASS: lldb-unit :: ScriptInterpreter/Python/./ScriptInterpreterPythonTests/PythonDataObjectsTest.TestResetting (1762 of 2028) PASS: lldb-api :: commands/command/script/import/TestImport.py (1763 of 2028) PASS: lldb-unit :: Utility/./UtilityTests/FileSpecTest.CopyByAppendingPathComponent (1764 of 2028) PASS: lldb-unit :: Utility/./UtilityTests/RangeTest.SizeTypes (1765 of 2028) PASS: lldb-api :: api/multithreaded/TestMultithreaded.py (1766 of 2028) PASS: lldb-unit :: Host/./HostTests/FileSystemTest.GetByteSize (1767 of 2028) PASS: lldb-api :: python_api/module_section/TestModuleAndSection.py (1768 of 2028) PASS: lldb-shell :: ObjectFile/PECOFF/symbol.yaml (1769 of 2028) PASS: lldb-unit :: Utility/./UtilityTests/RangeTest.LessThanInvalid (1770 of 2028) PASS: lldb-unit :: DataFormatter/./LLDBFormatterTests/StringPrinterTests.SwiftUTF8 (1771 of 2028) PASS: lldb-api :: python_api/watchpoint/watchlocation/TestSetWatchlocation.py (1772 of 2028) PASS: lldb-api :: functionalities/thread/concurrent_events/TestConcurrentTwoWatchpointsOneBreakpoint.py (1773 of 2028) PASS: lldb-shell :: Minidump/no-process-id.yaml (1774 of 2028) PASS: lldb-shell :: SymbolFile/DWARF/static_scope.s (1775 of 2028) PASS: lldb-api :: functionalities/memory-region/TestMemoryRegion.py (1776 of 2028) PASS: lldb-api :: functionalities/breakpoint/breakpoint_ids/TestBreakpointIDs.py (1777 of 2028) PASS: lldb-unit :: Utility/./UtilityTests/PassiveReplayTest.InstrumentedFooInvalid (1778 of 2028) PASS: lldb-shell :: ObjectFile/PECOFF/basic-info-arm64.yaml (1779 of 2028) PASS: lldb-unit :: Process/gdb-remote/./ProcessGdbRemoteTests/GDBRemoteCommunicationClientTest.GetQOffsets (1780 of 2028) PASS: lldb-unit :: Utility/./UtilityTests/ArchSpecTest.MergeFromMachOUnknown (1781 of 2028) PASS: lldb-api :: lang/objc/modules-auto-import/TestModulesAutoImport.py (1782 of 2028) PASS: lldb-api :: functionalities/thread/concurrent_events/TestConcurrentTwoBreakpointsOneWatchpoint.py (1783 of 2028) PASS: lldb-shell :: Commands/command-thread-select.test (1784 of 2028) PASS: lldb-api :: commands/expression/import-std-module/empty-module/TestEmptyStdModule.py (1785 of 2028) PASS: lldb-unit :: Expression/./ExpressionTests/DWARFExpression.DW_OP_pick (1786 of 2028) PASS: lldb-shell :: ObjectFile/MachO/lc_version_min.yaml (1787 of 2028) PASS: lldb-api :: functionalities/data-formatter/data-formatter-stl/libcxx/vbool/TestDataFormatterLibcxxVBool.py (1788 of 2028) PASS: lldb-api :: functionalities/return-value/TestReturnValue.py (1789 of 2028) PASS: lldb-unit :: Utility/./UtilityTests/StringExtractorTest.GetHexU8_Extra_NoEof (1790 of 2028) PASS: lldb-unit :: Utility/./UtilityTests/ArgsTest.TestUnknownEscape (1791 of 2028) PASS: lldb-unit :: Process/gdb-remote/./ProcessGdbRemoteTests/GDBRemoteCommunicationClientTest.GetMemoryRegionInfo (1792 of 2028) PASS: lldb-unit :: Utility/./UtilityTests/SerializationRountripTest.SerializeDeserializeObjectPointer (1793 of 2028) PASS: lldb-unit :: Host/./HostTests/MainLoopTest.UnmonitoredSignal (1794 of 2028) PASS: lldb-unit :: Utility/./UtilityTests/StatusTest.ErrorConversion (1795 of 2028) PASS: lldb-api :: python_api/lldbutil/process/TestPrintStackTraces.py (1796 of 2028) PASS: lldb-unit :: UnwindAssembly/x86/./UnwindAssemblyx86Tests/Testx86AssemblyInspectionEngine.TestPushExtended (1797 of 2028) PASS: lldb-api :: python_api/target/TestTargetAPI.py (1798 of 2028) PASS: lldb-api :: python_api/file_handle/TestFileHandle.py (1799 of 2028) PASS: lldb-shell :: Breakpoint/jitbp_elf.test (1800 of 2028) PASS: lldb-api :: commands/target/basic/TestTargetCommand.py (1801 of 2028) UNSUPPORTED: lldb-shell :: SymbolFile/Breakpad/stack-cfi-arm.yaml (1802 of 2028) PASS: lldb-shell :: SymbolFile/DWARF/DW_TAG_basic_type_DW_ATE_UTF_nonC.ll (1803 of 2028) PASS: lldb-shell :: Minidump/dump-all.test (1804 of 2028) PASS: lldb-unit :: Host/./HostTests/FileSystemTest.Resolve (1805 of 2028) PASS: lldb-unit :: Utility/./UtilityTests/BinaryStreamTest.PutULEB128EightBytes (1806 of 2028) PASS: lldb-api :: arm/emulation/TestEmulations.py (1807 of 2028) PASS: lldb-api :: functionalities/tail_call_frames/thread_step_out_or_return/TestSteppingOutWithArtificialFrames.py (1808 of 2028) PASS: lldb-unit :: Utility/./UtilityTests/UriParserTest.Empty (1809 of 2028) PASS: lldb-unit :: Utility/./UtilityTests/ScalarTest.ComparisonFloat (1810 of 2028) PASS: lldb-unit :: Utility/./UtilityTests/BinaryStreamTest.PutSLEB128SevenBytes (1811 of 2028) PASS: lldb-unit :: Utility/./UtilityTests/StreamTest.PutCStringWithStringRef (1812 of 2028) PASS: lldb-shell :: ObjectFile/PECOFF/sections.yaml (1813 of 2028) PASS: lldb-api :: functionalities/data-formatter/data-formatter-stl/libstdcpp/unique_ptr/invalid/TestDataFormatterInvalidStdUniquePtr.py (1814 of 2028) PASS: lldb-unit :: Utility/./UtilityTests/ArgsTest.StringListConstructor (1815 of 2028) PASS: lldb-shell :: Reproducer/TestWorkingDir.test (1816 of 2028) PASS: lldb-shell :: SymbolFile/DWARF/gnu-style-compression.cpp (1817 of 2028) PASS: lldb-unit :: Utility/./UtilityTests/StreamTest.PutChar (1818 of 2028) PASS: lldb-unit :: Language/Highlighting/./HighlighterTests/HighlighterTest.HighlighterSelectionPath (1819 of 2028) PASS: lldb-unit :: Utility/./UtilityTests/RegisterValueTest.GetSet8 (1820 of 2028) PASS: lldb-api :: sample_test/TestSampleInlineTest.py (1821 of 2028) PASS: lldb-unit :: Utility/./UtilityTests/UriParserTest.Minimal (1822 of 2028) PASS: lldb-unit :: Utility/./UtilityTests/AnsiTerminal.AtEnd (1823 of 2028) UNSUPPORTED: lldb-api :: commands/target/auto-install-main-executable/TestAutoInstallMainExecutable.py (1824 of 2028) PASS: lldb-unit :: Host/./HostTests/MainLoopTest.TerminatesImmediately (1825 of 2028) PASS: lldb-api :: api/command-return-object/TestSBCommandReturnObject.py (1826 of 2028) PASS: lldb-api :: lang/cpp/limit-debug-info/TestWithLimitDebugInfo.py (1827 of 2028) UNSUPPORTED: lldb-api :: tools/lldb-server/platform-process-connect/TestPlatformProcessConnect.py (1828 of 2028) PASS: lldb-api :: commands/process/launch/TestProcessLaunch.py (1829 of 2028) PASS: lldb-unit :: Process/minidump/./LLDBMinidumpTests/MinidumpParserTest.GetThreadContext_x86_32 (1830 of 2028) PASS: lldb-api :: api/check_public_api_headers/TestPublicAPIHeaders.py (1831 of 2028) UNSUPPORTED: lldb-api :: functionalities/tsan/multiple/TestTsanMultiple.py (1832 of 2028) UNSUPPORTED: lldb-shell :: Register/x86-64-ymm16-write.test (1833 of 2028) PASS: lldb-unit :: Utility/./UtilityTests/ProcessInstanceInfo.Dump (1834 of 2028) UNSUPPORTED: lldb-api :: lang/objc/objc-dynamic-value/TestObjCDynamicValue.py (1835 of 2028) PASS: lldb-api :: functionalities/abbreviation/TestCommonShortSpellings.py (1836 of 2028) PASS: lldb-unit :: Symbol/./SymbolTests/TestTypeSystemClang.TestIsClangType (1837 of 2028) PASS: lldb-unit :: Interpreter/./InterpreterTests/OptionArgParserTest.toBoolean (1838 of 2028) PASS: lldb-api :: lang/c/step-target/TestStepTarget.py (1839 of 2028) PASS: lldb-unit :: ScriptInterpreter/Python/./ScriptInterpreterPythonTests/PythonDataObjectsTest.TestPythonInteger (1840 of 2028) PASS: lldb-unit :: Symbol/./SymbolTests/TestTypeSystemClang.TestGetTypeClassDeclType (1841 of 2028) PASS: lldb-api :: commands/disassemble/basic/TestFrameDisassemble.py (1842 of 2028) PASS: lldb-api :: commands/command/delete/TestCommandDelete.py (1843 of 2028) FAIL: lldb-api :: lang/objcxx/cxx-bridged-po/TestObjCXXBridgedPO.py (1844 of 2028) ******************** TEST 'lldb-api :: lang/objcxx/cxx-bridged-po/TestObjCXXBridgedPO.py' FAILED ******************** Script: -- /Users/buildslave/jenkins/workspace/lldb-cmake-sanitized/lldb-build/lldb-test-build.noindex/copied-system-python /Users/buildslave/jenkins/workspace/lldb-cmake-sanitized/llvm-project/lldb/test/API/dotest.py --arch x86_64 -s /Users/buildslave/jenkins/workspace/lldb-cmake-sanitized/lldb-build/lldb-test-traces -S nm -u CXXFLAGS -u CFLAGS --codesign-identity lldb_codesign --server /Users/buildslave/jenkins/workspace/lldb-cmake-sanitized/lldb-build/./bin/debugserver --arch x86_64 --build-dir /Users/buildslave/jenkins/workspace/lldb-cmake-sanitized/lldb-build/lldb-test-build.noindex -s=/Users/buildslave/jenkins/workspace/lldb-cmake-sanitized/test/logs -t --env TERM=vt100 --env LLVM_LIBS_DIR=/Users/buildslave/jenkins/workspace/lldb-cmake-sanitized/lldb-build/./lib --inferior-env ASAN_OPTIONS=detect_stack_use_after_return=1 --inferior-env DYLD_INSERT_LIBRARIES=/Users/buildslave/jenkins/workspace/lldb-cmake-sanitized/host-compiler/lib/clang/11.0.0/lib/darwin/libclang_rt.asan_osx_dynamic.dylib --build-dir /Users/buildslave/jenkins/workspace/lldb-cmake-sanitized/lldb-build/lldb-test-build.noindex --lldb-module-cache-dir /Users/buildslave/jenkins/workspace/lldb-cmake-sanitized/lldb-build/lldb-test-build.noindex/module-cache-lldb/lldb-api --clang-module-cache-dir /Users/buildslave/jenkins/workspace/lldb-cmake-sanitized/lldb-build/lldb-test-build.noindex/module-cache-clang/lldb-api --executable /Users/buildslave/jenkins/workspace/lldb-cmake-sanitized/lldb-build/./bin/lldb --compiler /Users/buildslave/jenkins/workspace/lldb-cmake-sanitized/lldb-build/./bin/clang --dsymutil /Users/buildslave/jenkins/workspace/lldb-cmake-sanitized/lldb-build/./bin/dsymutil --filecheck /Users/buildslave/jenkins/workspace/lldb-cmake-sanitized/lldb-build/./bin/FileCheck --lldb-libs-dir /Users/buildslave/jenkins/workspace/lldb-cmake-sanitized/lldb-build/./lib /Users/buildslave/jenkins/workspace/lldb-cmake-sanitized/llvm-project/lldb/test/API/lang/objcxx/cxx-bridged-po -p TestObjCXXBridgedPO.py -- Exit Code: -6

Hide Details

Command Output (stdout): -- lldb version 11.0.99 clang revision 92063228f85bfe22a6dfe20bf01c99ffe6ff3130 llvm revision 92063228f85bfe22a6dfe20bf01c99ffe6ff3130

Hide Details

-- Command Output (stderr): -- Assertion failed: (tokenKind == tok::kw___bridge_retain), function ParseParenExpression, file /Users/buildslave/jenkins/workspace/lldb-cmake-sanitized/llvm-project/clang/lib/Parse/ParseExpr.cpp, line 2804.

Hide Details

--

Hide Details

******************** PASS: lldb-unit :: Symbol/./SymbolTests/TestClangASTImporter.ImportInvalidType (1845 of 2028) PASS: lldb-api :: commands/expression/persistent_types/TestPersistentTypes.py (1846 of 2028) PASS: lldb-unit :: Core/./LLDBCoreTests/MangledTest.ResultForBlockInvocation (1847 of 2028) UNSUPPORTED: lldb-shell :: BuildScript/toolchain-clang-cl.test (1848 of 2028) PASS: lldb-unit :: Utility/./UtilityTests/NameMatchesTest.StartsWith (1849 of 2028) PASS: lldb-unit :: Utility/./UtilityTests/VMRange.CollectionContains (1850 of 2028) PASS: lldb-shell :: SymbolFile/Breakpad/line-table.test (1851 of 2028) PASS: lldb-api :: functionalities/tail_call_frames/ambiguous_tail_call_seq2/TestAmbiguousTailCallSeq2.py (1852 of 2028) PASS: lldb-api :: commands/apropos/with-process/TestAproposWithProcess.py (1853 of 2028) PASS: lldb-api :: macosx/thread_suspend/TestInternalThreadSuspension.py (1854 of 2028) PASS: lldb-unit :: Utility/./UtilityTests/FileSpecTest.GuessPathStyle (1855 of 2028) PASS: lldb-api :: lang/c/modules/TestCModules.py (1856 of 2028) PASS: lldb-unit :: Symbol/./SymbolTests/TestTypeSystemClang.TestBuiltinTypeForEncodingAndBitSize (1857 of 2028) PASS: lldb-api :: functionalities/data-formatter/dump_dynamic/TestDumpDynamic.py (1858 of 2028) PASS: lldb-unit :: Utility/./UtilityTests/StringExtractorTest.GetNameColonValueSuccess (1859 of 2028) PASS: lldb-api :: commands/breakpoint/command/list/TestBreakpointCommandList.py (1860 of 2028) PASS: lldb-api :: python_api/process/TestProcessAPI.py (1861 of 2028) PASS: lldb-unit :: Utility/./UtilityTests/StringListTest.InsertStringAtIndexStdString (1862 of 2028) UNSUPPORTED: lldb-shell :: Process/Windows/exception_access_violation.cpp (1863 of 2028) PASS: lldb-api :: lang/cpp/char8_t/TestCxxChar8_t.py (1864 of 2028) PASS: lldb-api :: commands/expression/cast_int_to_anonymous_enum/TestCastIntToAnonymousEnum.py (1865 of 2028) UNSUPPORTED: lldb-api :: tools/lldb-server/TestGdbRemote_vContThreads.py (1866 of 2028) PASS: lldb-unit :: Utility/./UtilityTests/UriParserTest.PortOverflow (1867 of 2028) PASS: lldb-api :: functionalities/data-formatter/data-formatter-globals/TestDataFormatterGlobals.py (1868 of 2028) PASS: lldb-api :: python_api/function_symbol/TestDisasmAPI.py (1869 of 2028) UNSUPPORTED: lldb-shell :: ScriptInterpreter/Lua/independent_state.test (1870 of 2028) PASS: lldb-unit :: Utility/./UtilityTests/StringListTest.LongestCommonPrefix (1871 of 2028) PASS: lldb-unit :: Utility/./UtilityTests/StringExtractorTest.InitMisc (1872 of 2028) FAIL: lldb-api :: lang/objc/objc-optimized/TestObjcOptimized.py (1873 of 2028) ******************** TEST 'lldb-api :: lang/objc/objc-optimized/TestObjcOptimized.py' FAILED ******************** Script: -- /Users/buildslave/jenkins/workspace/lldb-cmake-sanitized/lldb-build/lldb-test-build.noindex/copied-system-python /Users/buildslave/jenkins/workspace/lldb-cmake-sanitized/llvm-project/lldb/test/API/dotest.py --arch x86_64 -s /Users/buildslave/jenkins/workspace/lldb-cmake-sanitized/lldb-build/lldb-test-traces -S nm -u CXXFLAGS -u CFLAGS --codesign-identity lldb_codesign --server /Users/buildslave/jenkins/workspace/lldb-cmake-sanitized/lldb-build/./bin/debugserver --arch x86_64 --build-dir /Users/buildslave/jenkins/workspace/lldb-cmake-sanitized/lldb-build/lldb-test-build.noindex -s=/Users/buildslave/jenkins/workspace/lldb-cmake-sanitized/test/logs -t --env TERM=vt100 --env LLVM_LIBS_DIR=/Users/buildslave/jenkins/workspace/lldb-cmake-sanitized/lldb-build/./lib --inferior-env ASAN_OPTIONS=detect_stack_use_after_return=1 --inferior-env DYLD_INSERT_LIBRARIES=/Users/buildslave/jenkins/workspace/lldb-cmake-sanitized/host-compiler/lib/clang/11.0.0/lib/darwin/libclang_rt.asan_osx_dynamic.dylib --build-dir /Users/buildslave/jenkins/workspace/lldb-cmake-sanitized/lldb-build/lldb-test-build.noindex --lldb-module-cache-dir /Users/buildslave/jenkins/workspace/lldb-cmake-sanitized/lldb-build/lldb-test-build.noindex/module-cache-lldb/lldb-api --clang-module-cache-dir /Users/buildslave/jenkins/workspace/lldb-cmake-sanitized/lldb-build/lldb-test-build.noindex/module-cache-clang/lldb-api --executable /Users/buildslave/jenkins/workspace/lldb-cmake-sanitized/lldb-build/./bin/lldb --compiler /Users/buildslave/jenkins/workspace/lldb-cmake-sanitized/lldb-build/./bin/clang --dsymutil /Users/buildslave/jenkins/workspace/lldb-cmake-sanitized/lldb-build/./bin/dsymutil --filecheck /Users/buildslave/jenkins/workspace/lldb-cmake-sanitized/lldb-build/./bin/FileCheck --lldb-libs-dir /Users/buildslave/jenkins/workspace/lldb-cmake-sanitized/lldb-build/./lib /Users/buildslave/jenkins/workspace/lldb-cmake-sanitized/llvm-project/lldb/test/API/lang/objc/objc-optimized -p TestObjcOptimized.py -- Exit Code: -6

Hide Details

Command Output (stdout): -- lldb version 11.0.99 clang revision 92063228f85bfe22a6dfe20bf01c99ffe6ff3130 llvm revision 92063228f85bfe22a6dfe20bf01c99ffe6ff3130 a.out was compiled with optimization - stepping may behave oddly; variables may not be available. a.out was compiled with optimization - stepping may behave oddly; variables may not be available. a.out was compiled with optimization - stepping may behave oddly; variables may not be available.

Hide Details

-- Command Output (stderr): -- Assertion failed: (tokenKind == tok::kw___bridge_retain), function ParseParenExpression, file /Users/buildslave/jenkins/workspace/lldb-cmake-sanitized/llvm-project/clang/lib/Parse/ParseExpr.cpp, line 2804.

Hide Details

--

Hide Details

******************** PASS: lldb-unit :: Utility/./UtilityTests/ProcessInstanceInfoList.Yaml (1874 of 2028) PASS: lldb-unit :: Utility/./UtilityTests/StreamTest.PutBytesAsRawHex8ToLittleEndian (1875 of 2028) PASS: lldb-unit :: Host/./HostTests/ConnectionFileDescriptorTest.TCPGetURIv6 (1876 of 2028) PASS: lldb-api :: functionalities/breakpoint/breakpoint_language/TestBreakpointLanguage.py (1877 of 2028) PASS: lldb-api :: lang/c/offsetof/TestOffsetof.py (1878 of 2028) PASS: lldb-shell :: SymbolFile/Breakpad/unwind-via-raSearch.test (1879 of 2028) PASS: lldb-unit :: Utility/./UtilityTests/FileSpecTest.EqualDotsPosix (1880 of 2028) PASS: lldb-unit :: Symbol/./SymbolTests/TestTypeSystemClang.TestFunctionTemplateConstruction (1881 of 2028) PASS: lldb-api :: tools/lldb-server/TestGdbRemoteProcessInfo.py (1882 of 2028) PASS: lldb-unit :: tools/lldb-server/tests/./LLDBServerTests/StandardStartupTest.TestStopReplyContainsThreadPcs (1883 of 2028) PASS: lldb-api :: python_api/sbdata/TestSBData.py (1884 of 2028) UNSUPPORTED: lldb-api :: tools/lldb-server/signal-filtering/TestGdbRemote_QPassSignals.py (1885 of 2028) PASS: lldb-unit :: Utility/./UtilityTests/SerializationRountripTest.SerializeDeserializeCString (1886 of 2028) PASS: lldb-api :: functionalities/breakpoint/require_hw_breakpoints/TestRequireHWBreakpoints.py (1887 of 2028) UNSUPPORTED: lldb-api :: functionalities/darwin_log/source/debug/TestDarwinLogSourceDebug.py (1888 of 2028) PASS: lldb-api :: commands/expression/call-function/TestCallBuiltinFunction.py (1889 of 2028) PASS: lldb-unit :: ScriptInterpreter/Python/./ScriptInterpreterPythonTests/PythonDataObjectsTest.TestPythonCallableInvoke (1890 of 2028) PASS: lldb-unit :: Utility/./UtilityTests/ArgsTest.TestAppendArg (1891 of 2028) UNSUPPORTED: lldb-api :: commands/gui/basic/TestGuiBasic.py (1892 of 2028) PASS: lldb-shell :: Driver/TestNoUseColor.test (1893 of 2028) UNSUPPORTED: lldb-shell :: SymbolFile/DWARF/debug-types-expressions.test (1894 of 2028) PASS: lldb-api :: commands/settings/TestSettings.py (1895 of 2028) PASS: lldb-unit :: Utility/./UtilityTests/RangeTest.DoesAdjoinOrIntersect (1896 of 2028) PASS: lldb-shell :: Process/UnsupportedLanguage.test (1897 of 2028) PASS: lldb-unit :: Symbol/./SymbolTests/TestTypeSystemClang.TestGetTypeClassTypeOfExpr (1898 of 2028) PASS: lldb-api :: commands/add-dsym/uuid/TestAddDsymCommand.py (1899 of 2028) FAIL: lldb-api :: functionalities/data-formatter/data-formatter-objc/TestDataFormatterObjCNSContainer.py (1900 of 2028) ******************** TEST 'lldb-api :: functionalities/data-formatter/data-formatter-objc/TestDataFormatterObjCNSContainer.py' FAILED ******************** Script: -- /Users/buildslave/jenkins/workspace/lldb-cmake-sanitized/lldb-build/lldb-test-build.noindex/copied-system-python /Users/buildslave/jenkins/workspace/lldb-cmake-sanitized/llvm-project/lldb/test/API/dotest.py --arch x86_64 -s /Users/buildslave/jenkins/workspace/lldb-cmake-sanitized/lldb-build/lldb-test-traces -S nm -u CXXFLAGS -u CFLAGS --codesign-identity lldb_codesign --server /Users/buildslave/jenkins/workspace/lldb-cmake-sanitized/lldb-build/./bin/debugserver --arch x86_64 --build-dir /Users/buildslave/jenkins/workspace/lldb-cmake-sanitized/lldb-build/lldb-test-build.noindex -s=/Users/buildslave/jenkins/workspace/lldb-cmake-sanitized/test/logs -t --env TERM=vt100 --env LLVM_LIBS_DIR=/Users/buildslave/jenkins/workspace/lldb-cmake-sanitized/lldb-build/./lib --inferior-env ASAN_OPTIONS=detect_stack_use_after_return=1 --inferior-env DYLD_INSERT_LIBRARIES=/Users/buildslave/jenkins/workspace/lldb-cmake-sanitized/host-compiler/lib/clang/11.0.0/lib/darwin/libclang_rt.asan_osx_dynamic.dylib --build-dir /Users/buildslave/jenkins/workspace/lldb-cmake-sanitized/lldb-build/lldb-test-build.noindex --lldb-module-cache-dir /Users/buildslave/jenkins/workspace/lldb-cmake-sanitized/lldb-build/lldb-test-build.noindex/module-cache-lldb/lldb-api --clang-module-cache-dir /Users/buildslave/jenkins/workspace/lldb-cmake-sanitized/lldb-build/lldb-test-build.noindex/module-cache-clang/lldb-api --executable /Users/buildslave/jenkins/workspace/lldb-cmake-sanitized/lldb-build/./bin/lldb --compiler /Users/buildslave/jenkins/workspace/lldb-cmake-sanitized/lldb-build/./bin/clang --dsymutil /Users/buildslave/jenkins/workspace/lldb-cmake-sanitized/lldb-build/./bin/dsymutil --filecheck /Users/buildslave/jenkins/workspace/lldb-cmake-sanitized/lldb-build/./bin/FileCheck --lldb-libs-dir /Users/buildslave/jenkins/workspace/lldb-cmake-sanitized/lldb-build/./lib /Users/buildslave/jenkins/workspace/lldb-cmake-sanitized/llvm-project/lldb/test/API/functionalities/data-formatter/data-formatter-objc -p TestDataFormatterObjCNSContainer.py -- Exit Code: -6

Hide Details

Command Output (stdout): -- lldb version 11.0.99 clang revision 92063228f85bfe22a6dfe20bf01c99ffe6ff3130 llvm revision 92063228f85bfe22a6dfe20bf01c99ffe6ff3130

Hide Details

-- Command Output (stderr): --

Hide Details

Session logs for test failures/errors/unexpected successes will go into directory '/Users/buildslave/jenkins/workspace/lldb-cmake-sanitized/test/logs' Command invoked: /Users/buildslave/jenkins/workspace/lldb-cmake-sanitized/llvm-project/lldb/test/API/dotest.py --arch x86_64 -s /Users/buildslave/jenkins/workspace/lldb-cmake-sanitized/lldb-build/lldb-test-traces -S nm -u CXXFLAGS -u CFLAGS --codesign-identity lldb_codesign --server /Users/buildslave/jenkins/workspace/lldb-cmake-sanitized/lldb-build/./bin/debugserver --arch x86_64 --build-dir /Users/buildslave/jenkins/workspace/lldb-cmake-sanitized/lldb-build/lldb-test-build.noindex -s=/Users/buildslave/jenkins/workspace/lldb-cmake-sanitized/test/logs -t --env TERM=vt100 --env LLVM_LIBS_DIR=/Users/buildslave/jenkins/workspace/lldb-cmake-sanitized/lldb-build/./lib --inferior-env ASAN_OPTIONS=detect_stack_use_after_return=1 --inferior-env DYLD_INSERT_LIBRARIES=/Users/buildslave/jenkins/workspace/lldb-cmake-sanitized/host-compiler/lib/clang/11.0.0/lib/darwin/libclang_rt.asan_osx_dynamic.dylib --build-dir /Users/buildslave/jenkins/workspace/lldb-cmake-sanitized/lldb-build/lldb-test-build.noindex --lldb-module-cache-dir /Users/buildslave/jenkins/workspace/lldb-cmake-sanitized/lldb-build/lldb-test-build.noindex/module-cache-lldb/lldb-api --clang-module-cache-dir /Users/buildslave/jenkins/workspace/lldb-cmake-sanitized/lldb-build/lldb-test-build.noindex/module-cache-clang/lldb-api --executable /Users/buildslave/jenkins/workspace/lldb-cmake-sanitized/lldb-build/./bin/lldb --compiler /Users/buildslave/jenkins/workspace/lldb-cmake-sanitized/lldb-build/./bin/clang --dsymutil /Users/buildslave/jenkins/workspace/lldb-cmake-sanitized/lldb-build/./bin/dsymutil --filecheck /Users/buildslave/jenkins/workspace/lldb-cmake-sanitized/lldb-build/./bin/FileCheck --lldb-libs-dir /Users/buildslave/jenkins/workspace/lldb-cmake-sanitized/lldb-build/./lib /Users/buildslave/jenkins/workspace/lldb-cmake-sanitized/llvm-project/lldb/test/API/functionalities/data-formatter/data-formatter-objc -p TestDataFormatterObjCNSContainer.py Change dir to: /Users/buildslave/jenkins/workspace/lldb-cmake-sanitized/llvm-project/lldb/test/API/functionalities/data-formatter/data-formatter-objc runCmd: settings clear -all output:

Hide Details

runCmd: settings set symbols.enable-external-lookup false output:

Hide Details

runCmd: settings set target.auto-apply-fixits false output:

Hide Details

runCmd: settings set plugin.process.gdb-remote.packet-timeout 60 output:

Hide Details

runCmd: settings set symbols.clang-modules-cache-path "/Users/buildslave/jenkins/workspace/lldb-cmake-sanitized/lldb-build/lldb-test-build.noindex/module-cache-lldb/lldb-api" output:

Hide Details

runCmd: settings set use-color false output:

Hide Details

runCmd: setting set target.prefer-dynamic-value no-dynamic-values output:

Hide Details

runCmd: settings set target.env-vars ASAN_OPTIONS=detect_stack_use_after_return=1 DYLD_INSERT_LIBRARIES=/Users/buildslave/jenkins/workspace/lldb-cmake-sanitized/host-compiler/lib/clang/11.0.0/lib/darwin/libclang_rt.asan_osx_dynamic.dylib output:

Hide Details

runCmd: settings set target.env-vars ASAN_OPTIONS=detect_stack_use_after_return=1 DYLD_INSERT_LIBRARIES=/Users/buildslave/jenkins/workspace/lldb-cmake-sanitized/host-compiler/lib/clang/11.0.0/lib/darwin/libclang_rt.asan_osx_dynamic.dylib output:

Hide Details

runCmd: thread list output: Process 92886 stopped * thread #1: tid = 0x6295a5, 0x000000010000489b a.out`main(argc=1, argv=0x00007ffeefbff410) at main.m:770:4, queue = 'com.apple.main-thread', stop reason = breakpoint 1.1 thread #2: tid = 0x6295e7, 0x00007fff693e45be libsystem_kernel.dylib`__workq_kernreturn + 10 thread #3: tid = 0x6295e8, 0x00007fff693e45be libsystem_kernel.dylib`__workq_kernreturn + 10

Hide Details

Hide Details

Expecting sub string: stopped Matched

Hide Details

Expecting sub string: stop reason = breakpoint Matched

Hide Details

Adding tearDown hook: def cleanup(): self.runCmd('type format clear', check=False) self.runCmd('type summary clear', check=False) self.runCmd('type synth clear', check=False)

Hide Details

Hide Details

runCmd: frame variable newArray nsDictionary newDictionary nscfDictionary cfDictionaryRef newMutableDictionary cfarray_ref mutable_array_ref output: (NSArray *) newArray = 0x0000604000001dd0 @"50 elements" (NSDictionary *) nsDictionary = 0x00006060000095c0 2 key/value pairs (NSDictionary *) newDictionary = 0x0000619000001980 12 key/value pairs (NSDictionary *) nscfDictionary = 0x0000606000009620 4 key/value pairs (CFDictionaryRef) cfDictionaryRef = 0x00006060000095c0 2 key/value pairs (NSDictionary *) newMutableDictionary = 0x0000603000003610 21 key/value pairs (CFArrayRef) cfarray_ref = 0x0000607000004000 @"3 elements" (CFMutableArrayRef) mutable_array_ref = 0x0000604000002150 @"11 elements"

Hide Details

Hide Details

Expecting sub string: (NSArray *) newArray = Matched

Hide Details

Expecting sub string: @"50 elements" Matched

Hide Details

Expecting sub string: (NSDictionary *) nsDictionary = Matched

Hide Details

Expecting sub string: 2 key/value pairs Matched

Hide Details

Expecting sub string: (NSDictionary *) newDictionary = Matched

Hide Details

Expecting sub string: 12 key/value pairs Matched

Hide Details

Expecting sub string: (NSDictionary *) nscfDictionary = Matched

Hide Details

Expecting sub string: 4 key/value pairs Matched

Hide Details

Expecting sub string: (CFDictionaryRef) cfDictionaryRef = Matched

Hide Details

Expecting sub string: 2 key/value pairs Matched

Hide Details

Expecting sub string: (NSDictionary *) newMutableDictionary = Matched

Hide Details

Expecting sub string: 21 key/value pairs Matched

Hide Details

Expecting sub string: (CFArrayRef) cfarray_ref = Matched

Hide Details

Expecting sub string: @"3 elements" Matched

Hide Details

Expecting sub string: (CFMutableArrayRef) mutable_array_ref = Matched

Hide Details

Expecting sub string: @"11 elements" Matched

Hide Details

runCmd: frame variable -d run-target *nscfDictionary output: (__NSCFDictionary) *nscfDictionary = { [0] = { key = 0x0000000100006610 @"bar" value = 0x0000000100006610 @"bar" } [1] = { key = 0x0000000100006650 @"quux" value = 0x0000000100006650 @"quux" } [2] = { key = 0x0000000100006350 @"foo" value = 0x0000000100006350 @"foo" } [3] = { key = 0x0000000100006630 @"baz" value = 0x0000000100006630 @"baz" } }

Hide Details

Hide Details

Expecting pattern: \(__NSCFDictionary\) \*nscfDictionary = Matched

Hide Details

Expecting pattern: key = 0x.* @"foo" Matched

Hide Details

Expecting pattern: value = 0x.* @"foo" Matched

Hide Details

Expecting pattern: key = 0x.* @"bar" Matched

Hide Details

Expecting pattern: value = 0x.* @"bar" Matched

Hide Details

Expecting pattern: key = 0x.* @"baz" Matched

Hide Details

Expecting pattern: value = 0x.* @"baz" Matched

Hide Details

Expecting pattern: key = 0x.* @"quux" Matched

Hide Details

Expecting pattern: value = 0x.* @"quux" Matched

Hide Details

runCmd: frame variable -d run-target *cfDictionaryRef output: (const __CFDictionary) *cfDictionaryRef = { [0] = { key = 0x0000000100006350 @"foo" value = 0x0000000100006350 @"foo" } [1] = { key = 0x0000000100006610 @"bar" value = 0x0000000100006610 @"bar" } }

Hide Details

Hide Details

Expecting pattern: \(const __CFDictionary\) \*cfDictionaryRef = Matched

Hide Details

Expecting pattern: key = 0x.* @"foo" Matched

Hide Details

Expecting pattern: value = 0x.* @"foo" Matched

Hide Details

Expecting pattern: key = 0x.* @"bar" Matched

Hide Details

Expecting pattern: value = 0x.* @"bar" Matched

Hide Details

runCmd: frame var nscfSet cfSetRef output: (NSSet *) nscfSet = 0x00006040000020d0 2 elements (CFSetRef) cfSetRef = 0x00006040000020d0 2 elements

Hide Details

Hide Details

Expecting sub string: (NSSet *) nscfSet = Matched

Hide Details

Expecting sub string: 2 elements Matched

Hide Details

Expecting sub string: (CFSetRef) cfSetRef = Matched

Hide Details

Expecting sub string: 2 elements Matched

Hide Details

runCmd: frame variable -d run-target *nscfSet output: (__NSCFSet) *nscfSet = { [0] = 0x0000000100006350 @"foo" [1] = 0x0000000100006610 @"bar" }

Hide Details

Hide Details

Expecting pattern: \(__NSCFSet\) \*nscfSet = Matched

Hide Details

Expecting pattern: \[0\] = 0x.* @".*" Matched

Hide Details

Expecting pattern: \[1\] = 0x.* @".*" Matched

Hide Details

runCmd: frame variable -d run-target *cfSetRef output: (const __CFSet) *cfSetRef = { [0] = 0x0000000100006350 @"foo" [1] = 0x0000000100006610 @"bar" }

Hide Details

Hide Details

Expecting pattern: \(const __CFSet\) \*cfSetRef = Matched

Hide Details

Expecting pattern: \[0\] = 0x.* @".*" Matched

Hide Details

Expecting pattern: \[1\] = 0x.* @".*" Matched

Hide Details

runCmd: frame variable iset1 iset2 imset output: (NSIndexSet *) iset1 = 0x00006030000097f0 4 indexes (NSIndexSet *) iset2 = 0x0000603000009820 512 indexes (NSMutableIndexSet *) imset = 0x0000604000008f10 10 indexes

Hide Details

Assertion failed: (tokenKind == tok::kw___bridge_retain), function ParseParenExpression, file /Users/buildslave/jenkins/workspace/lldb-cmake-sanitized/llvm-project/clang/lib/Parse/ParseExpr.cpp, line 2804.

Hide Details

--

Hide Details

******************** PASS: lldb-unit :: Utility/./UtilityTests/ArchSpecTest.TripleComponentsWereSpecified (1901 of 2028) UNSUPPORTED: lldb-shell :: SymbolFile/NativePDB/stack_unwinding01.cpp (1902 of 2028) PASS: lldb-unit :: Process/minidump/./LLDBMinidumpTests/MinidumpParserTest.GetPidWindows (1903 of 2028) PASS: lldb-unit :: Utility/./UtilityTests/StreamTest.PutPtr (1904 of 2028) PASS: lldb-unit :: UnwindAssembly/x86/./UnwindAssemblyx86Tests/Testx86AssemblyInspectionEngine.TestSubESP (1905 of 2028) PASS: lldb-unit :: ScriptInterpreter/Python/./ScriptInterpreterPythonTests/PythonDataObjectsTest.TestDictionaryResolutionWithDot (1906 of 2028) FAIL: lldb-api :: python_api/exprpath_synthetic/TestExprPathSynthetic.py (1907 of 2028) ******************** TEST 'lldb-api :: python_api/exprpath_synthetic/TestExprPathSynthetic.py' FAILED ******************** Script: -- /Users/buildslave/jenkins/workspace/lldb-cmake-sanitized/lldb-build/lldb-test-build.noindex/copied-system-python /Users/buildslave/jenkins/workspace/lldb-cmake-sanitized/llvm-project/lldb/test/API/dotest.py --arch x86_64 -s /Users/buildslave/jenkins/workspace/lldb-cmake-sanitized/lldb-build/lldb-test-traces -S nm -u CXXFLAGS -u CFLAGS --codesign-identity lldb_codesign --server /Users/buildslave/jenkins/workspace/lldb-cmake-sanitized/lldb-build/./bin/debugserver --arch x86_64 --build-dir /Users/buildslave/jenkins/workspace/lldb-cmake-sanitized/lldb-build/lldb-test-build.noindex -s=/Users/buildslave/jenkins/workspace/lldb-cmake-sanitized/test/logs -t --env TERM=vt100 --env LLVM_LIBS_DIR=/Users/buildslave/jenkins/workspace/lldb-cmake-sanitized/lldb-build/./lib --inferior-env ASAN_OPTIONS=detect_stack_use_after_return=1 --inferior-env DYLD_INSERT_LIBRARIES=/Users/buildslave/jenkins/workspace/lldb-cmake-sanitized/host-compiler/lib/clang/11.0.0/lib/darwin/libclang_rt.asan_osx_dynamic.dylib --build-dir /Users/buildslave/jenkins/workspace/lldb-cmake-sanitized/lldb-build/lldb-test-build.noindex --lldb-module-cache-dir /Users/buildslave/jenkins/workspace/lldb-cmake-sanitized/lldb-build/lldb-test-build.noindex/module-cache-lldb/lldb-api --clang-module-cache-dir /Users/buildslave/jenkins/workspace/lldb-cmake-sanitized/lldb-build/lldb-test-build.noindex/module-cache-clang/lldb-api --executable /Users/buildslave/jenkins/workspace/lldb-cmake-sanitized/lldb-build/./bin/lldb --compiler /Users/buildslave/jenkins/workspace/lldb-cmake-sanitized/lldb-build/./bin/clang --dsymutil /Users/buildslave/jenkins/workspace/lldb-cmake-sanitized/lldb-build/./bin/dsymutil --filecheck /Users/buildslave/jenkins/workspace/lldb-cmake-sanitized/lldb-build/./bin/FileCheck --lldb-libs-dir /Users/buildslave/jenkins/workspace/lldb-cmake-sanitized/lldb-build/./lib /Users/buildslave/jenkins/workspace/lldb-cmake-sanitized/llvm-project/lldb/test/API/python_api/exprpath_synthetic -p TestExprPathSynthetic.py -- Exit Code: -6

Hide Details

Command Output (stdout): -- lldb version 11.0.99 clang revision 92063228f85bfe22a6dfe20bf01c99ffe6ff3130 llvm revision 92063228f85bfe22a6dfe20bf01c99ffe6ff3130

Hide Details

-- Command Output (stderr): -- Assertion failed: (tokenKind == tok::kw___bridge_retain), function ParseParenExpression, file /Users/buildslave/jenkins/workspace/lldb-cmake-sanitized/llvm-project/clang/lib/Parse/ParseExpr.cpp, line 2804.

Hide Details

--

Hide Details

******************** PASS: lldb-unit :: Process/minidump/./LLDBMinidumpTests/MinidumpParserTest.GetExceptionStream (1908 of 2028) PASS: lldb-api :: tools/lldb-server/TestGdbRemoteAttach.py (1909 of 2028) PASS: lldb-api :: functionalities/pointer_num_children/TestPointerNumChildren.py (1910 of 2028) PASS: lldb-unit :: Symbol/./SymbolTests/TestTypeSystemClang.TestUnifyAccessSpecifiers (1911 of 2028) UNSUPPORTED: lldb-api :: functionalities/unwind/standard/TestStandardUnwind.py (1912 of 2028) PASS: lldb-api :: functionalities/data-formatter/data-formatter-objc/TestDataFormatterObjCNSData.py (1913 of 2028) PASS: lldb-unit :: Utility/./UtilityTests/StreamTest.AddressPrefixAndSuffix (1914 of 2028) PASS: lldb-unit :: Utility/./UtilityTests/StringListTest.InsertStringAtIndexOutOfBounds (1915 of 2028) PASS: lldb-api :: commands/expression/calculator_mode/TestCalculatorMode.py (1916 of 2028) PASS: lldb-unit :: UnwindAssembly/x86/./UnwindAssemblyx86Tests/Testx86AssemblyInspectionEngine.TestPopR13 (1917 of 2028) PASS: lldb-unit :: Target/./TargetTests/MCBasedABI.MapRegisterName (1918 of 2028) PASS: lldb-unit :: Process/gdb-remote/./ProcessGdbRemoteTests/GDBRemoteCommunicationClientTest.TestPacketSpeedJSON (1919 of 2028) PASS: lldb-api :: functionalities/gdb_remote_client/TestNoGPacketSupported.py (1920 of 2028) FAIL: lldb-api :: functionalities/data-formatter/synthupdate/TestSyntheticFilterRecompute.py (1921 of 2028) ******************** TEST 'lldb-api :: functionalities/data-formatter/synthupdate/TestSyntheticFilterRecompute.py' FAILED ******************** Script: -- /Users/buildslave/jenkins/workspace/lldb-cmake-sanitized/lldb-build/lldb-test-build.noindex/copied-system-python /Users/buildslave/jenkins/workspace/lldb-cmake-sanitized/llvm-project/lldb/test/API/dotest.py --arch x86_64 -s /Users/buildslave/jenkins/workspace/lldb-cmake-sanitized/lldb-build/lldb-test-traces -S nm -u CXXFLAGS -u CFLAGS --codesign-identity lldb_codesign --server /Users/buildslave/jenkins/workspace/lldb-cmake-sanitized/lldb-build/./bin/debugserver --arch x86_64 --build-dir /Users/buildslave/jenkins/workspace/lldb-cmake-sanitized/lldb-build/lldb-test-build.noindex -s=/Users/buildslave/jenkins/workspace/lldb-cmake-sanitized/test/logs -t --env TERM=vt100 --env LLVM_LIBS_DIR=/Users/buildslave/jenkins/workspace/lldb-cmake-sanitized/lldb-build/./lib --inferior-env ASAN_OPTIONS=detect_stack_use_after_return=1 --inferior-env DYLD_INSERT_LIBRARIES=/Users/buildslave/jenkins/workspace/lldb-cmake-sanitized/host-compiler/lib/clang/11.0.0/lib/darwin/libclang_rt.asan_osx_dynamic.dylib --build-dir /Users/buildslave/jenkins/workspace/lldb-cmake-sanitized/lldb-build/lldb-test-build.noindex --lldb-module-cache-dir /Users/buildslave/jenkins/workspace/lldb-cmake-sanitized/lldb-build/lldb-test-build.noindex/module-cache-lldb/lldb-api --clang-module-cache-dir /Users/buildslave/jenkins/workspace/lldb-cmake-sanitized/lldb-build/lldb-test-build.noindex/module-cache-clang/lldb-api --executable /Users/buildslave/jenkins/workspace/lldb-cmake-sanitized/lldb-build/./bin/lldb --compiler /Users/buildslave/jenkins/workspace/lldb-cmake-sanitized/lldb-build/./bin/clang --dsymutil /Users/buildslave/jenkins/workspace/lldb-cmake-sanitized/lldb-build/./bin/dsymutil --filecheck /Users/buildslave/jenkins/workspace/lldb-cmake-sanitized/lldb-build/./bin/FileCheck --lldb-libs-dir /Users/buildslave/jenkins/workspace/lldb-cmake-sanitized/lldb-build/./lib /Users/buildslave/jenkins/workspace/lldb-cmake-sanitized/llvm-project/lldb/test/API/functionalities/data-formatter/synthupdate -p TestSyntheticFilterRecompute.py -- Exit Code: -6

Hide Details

Command Output (stdout): -- lldb version 11.0.99 clang revision 92063228f85bfe22a6dfe20bf01c99ffe6ff3130 llvm revision 92063228f85bfe22a6dfe20bf01c99ffe6ff3130

Hide Details

-- Command Output (stderr): --

Hide Details

Session logs for test failures/errors/unexpected successes will go into directory '/Users/buildslave/jenkins/workspace/lldb-cmake-sanitized/test/logs' Command invoked: /Users/buildslave/jenkins/workspace/lldb-cmake-sanitized/llvm-project/lldb/test/API/dotest.py --arch x86_64 -s /Users/buildslave/jenkins/workspace/lldb-cmake-sanitized/lldb-build/lldb-test-traces -S nm -u CXXFLAGS -u CFLAGS --codesign-identity lldb_codesign --server /Users/buildslave/jenkins/workspace/lldb-cmake-sanitized/lldb-build/./bin/debugserver --arch x86_64 --build-dir /Users/buildslave/jenkins/workspace/lldb-cmake-sanitized/lldb-build/lldb-test-build.noindex -s=/Users/buildslave/jenkins/workspace/lldb-cmake-sanitized/test/logs -t --env TERM=vt100 --env LLVM_LIBS_DIR=/Users/buildslave/jenkins/workspace/lldb-cmake-sanitized/lldb-build/./lib --inferior-env ASAN_OPTIONS=detect_stack_use_after_return=1 --inferior-env DYLD_INSERT_LIBRARIES=/Users/buildslave/jenkins/workspace/lldb-cmake-sanitized/host-compiler/lib/clang/11.0.0/lib/darwin/libclang_rt.asan_osx_dynamic.dylib --build-dir /Users/buildslave/jenkins/workspace/lldb-cmake-sanitized/lldb-build/lldb-test-build.noindex --lldb-module-cache-dir /Users/buildslave/jenkins/workspace/lldb-cmake-sanitized/lldb-build/lldb-test-build.noindex/module-cache-lldb/lldb-api --clang-module-cache-dir /Users/buildslave/jenkins/workspace/lldb-cmake-sanitized/lldb-build/lldb-test-build.noindex/module-cache-clang/lldb-api --executable /Users/buildslave/jenkins/workspace/lldb-cmake-sanitized/lldb-build/./bin/lldb --compiler /Users/buildslave/jenkins/workspace/lldb-cmake-sanitized/lldb-build/./bin/clang --dsymutil /Users/buildslave/jenkins/workspace/lldb-cmake-sanitized/lldb-build/./bin/dsymutil --filecheck /Users/buildslave/jenkins/workspace/lldb-cmake-sanitized/lldb-build/./bin/FileCheck --lldb-libs-dir /Users/buildslave/jenkins/workspace/lldb-cmake-sanitized/lldb-build/./lib /Users/buildslave/jenkins/workspace/lldb-cmake-sanitized/llvm-project/lldb/test/API/functionalities/data-formatter/synthupdate -p TestSyntheticFilterRecompute.py Change dir to: /Users/buildslave/jenkins/workspace/lldb-cmake-sanitized/llvm-project/lldb/test/API/functionalities/data-formatter/synthupdate runCmd: settings clear -all output:

Hide Details

runCmd: settings set symbols.enable-external-lookup false output:

Hide Details

runCmd: settings set target.auto-apply-fixits false output:

Hide Details

runCmd: settings set plugin.process.gdb-remote.packet-timeout 60 output:

Hide Details

runCmd: settings set symbols.clang-modules-cache-path "/Users/buildslave/jenkins/workspace/lldb-cmake-sanitized/lldb-build/lldb-test-build.noindex/module-cache-lldb/lldb-api" output:

Hide Details

runCmd: settings set use-color false output:

Hide Details

runCmd: setting set target.prefer-dynamic-value no-dynamic-values output:

Hide Details

runCmd: settings set target.env-vars ASAN_OPTIONS=detect_stack_use_after_return=1 DYLD_INSERT_LIBRARIES=/Users/buildslave/jenkins/workspace/lldb-cmake-sanitized/host-compiler/lib/clang/11.0.0/lib/darwin/libclang_rt.asan_osx_dynamic.dylib output:

Hide Details

runCmd: file /Users/buildslave/jenkins/workspace/lldb-cmake-sanitized/lldb-build/lldb-test-build.noindex/functionalities/data-formatter/synthupdate/TestSyntheticFilterRecompute.test_rdar12437442_with_run_command_dsym/a.out output: Current executable set to '/Users/buildslave/jenkins/workspace/lldb-cmake-sanitized/lldb-build/lldb-test-build.noindex/functionalities/data-formatter/synthupdate/TestSyntheticFilterRecompute.test_rdar12437442_with_run_command_dsym/a.out' (x86_64).

Hide Details

Hide Details

runCmd: breakpoint set -f "main.m" -l 11 output: Breakpoint 1: where = a.out`main + 722 at main.m:11:9, address = 0x0000000100000ec2

Hide Details

Hide Details

Expecting pattern: ^Breakpoint (?P<bpno>[0-9]+): (?P<num_locations>[0-9]+) locations\.$ Not matched

Hide Details

Expecting pattern: ^Breakpoint (?P<bpno>[0-9]+): (?P<num_locations>no) locations \(pending\)\. Not matched

Hide Details

Expecting pattern: ^Breakpoint (?P<bpno>[0-9]+): where = (?P<module>.*)`(?P<symbol>[+\-]{0,1}[^+]+)( \+ (?P<offset>[0-9]+)){0,1}( \[inlined\] (?P<inline_symbol>.*)){0,1} at (?P<file>[^:]+):(?P<line_no>[0-9]+)(?P<column>(:[0-9]+)?), address = (?P<address>0x[0-9a-fA-F]+)$ Matched

Hide Details

runCmd: run output: Process 93377 stopped * thread #1, queue = 'com.apple.main-thread', stop reason = breakpoint 1.1 frame #0: 0x0000000100000ec2 a.out`main(argc=1, argv=0x00007ffeefbff428) at main.m:11:9 8 NSArray* foo = [NSArray arrayWithObjects:@1,@2,@3,@4,@5, nil]; 9 NSDictionary *bar = @{@1 : @"one",@2 : @"two", @3 : @"three", @4 : @"four", @5 : @"five", @6 : @"six", @7 : @"seven"}; 10 id x = foo; -> 11 x = bar; // Set break point at this line. ^ 12 13 [pool drain]; 14 return 0;

Hide Details

Process 93377 launched: '/Users/buildslave/jenkins/workspace/lldb-cmake-sanitized/lldb-build/lldb-test-build.noindex/functionalities/data-formatter/synthupdate/TestSyntheticFilterRecompute.test_rdar12437442_with_run_command_dsym/a.out' (x86_64)

Hide Details

Hide Details

runCmd: thread list output: Process 93377 stopped * thread #1: tid = 0x6299a6, 0x0000000100000ec2 a.out`main(argc=1, argv=0x00007ffeefbff428) at main.m:11:9, queue = 'com.apple.main-thread', stop reason = breakpoint 1.1

Hide Details

Hide Details

Expecting sub string: stopped Matched

Hide Details

Expecting sub string: stop reason = breakpoint Matched

Hide Details

Adding tearDown hook: def cleanup(): self.runCmd('type format clear', check=False) self.runCmd('type summary clear', check=False) self.runCmd('type synth clear', check=False)

Hide Details

Hide Details

runCmd: expr --dynamic-type run-target --ptr-depth 1 -- x output: (__NSArrayI *) $0 = 0x00006060000087e0 @"5 elements" { [0] = 0x823b2978657fc12f (int)1 [1] = 0x823b2978657fc22f (int)2 [2] = 0x823b2978657fc32f (int)3 [3] = 0x823b2978657fc42f (int)4 [4] = 0x823b2978657fc52f (int)5 }

Hide Details

Hide Details

runCmd: next output: Process 93377 stopped * thread #1, queue = 'com.apple.main-thread', stop reason = step over frame #0: 0x0000000100000ed0 a.out`main(argc=1, argv=0x00007ffeefbff428) at main.m:13:6 10 id x = foo; 11 x = bar; // Set break point at this line. 12 -> 13 [pool drain]; ^ 14 return 0; 15 } 16

Hide Details

Hide Details

Hide Details

runCmd: frame select 0 output: frame #0: 0x0000000100000ed0 a.out`main(argc=1, argv=0x00007ffeefbff428) at main.m:13:6 10 id x = foo; 11 x = bar; // Set break point at this line. 12 -> 13 [pool drain]; ^ 14 return 0; 15 } 16

Hide Details

Hide Details

runCmd: expr --dynamic-type run-target --ptr-depth 1 -- x output: (__NSDictionaryI *) $1 = 0x0000611000002980 7 key/value pairs { [0] = { key = 0x823b2978657fc52f (int)5 value = 0x00000001000010b0 @"five" } [1] = { key = 0x823b2978657fc12f (int)1 value = 0x0000000100001030 @"one" } [2] = { key = 0x823b2978657fc62f (int)6 value = 0x00000001000010d0 @"six" } [3] = { key = 0x823b2978657fc22f (int)2 value = 0x0000000100001050 @"two" } [4] = { key = 0x823b2978657fc72f (int)7 value = 0x00000001000010f0 @"seven" } [5] = { key = 0x823b2978657fc32f (int)3 value = 0x0000000100001070 @"three" } [6] = { key = 0x823b2978657fc42f (int)4 value = 0x0000000100001090 @"four" } }

Hide Details

Hide Details

<bound method SBProcess.Kill of <lldb.SBProcess; proxy of <Swig Object of type 'lldb::SBProcess *' at 0x11ed07990> >>: success

Hide Details

Executing tearDown hook: def cleanup(): self.runCmd('type format clear', check=False) self.runCmd('type summary clear', check=False) self.runCmd('type synth clear', check=False)

Hide Details

Hide Details

runCmd: type format clear check of return status not required output:

Hide Details

runCmd: type summary clear check of return status not required output:

Hide Details

runCmd: type synth clear check of return status not required output:

Hide Details

PASS: LLDB (/Users/buildslave/jenkins/workspace/lldb-cmake-sanitized/lldb-build/bin/clang-11-x86_64) :: test_rdar12437442_with_run_command_dsym (TestSyntheticFilterRecompute.SyntheticFilterRecomputingTestCase) runCmd: settings clear -all output:

Hide Details

runCmd: settings set symbols.enable-external-lookup false output:

Hide Details

runCmd: settings set target.auto-apply-fixits false output:

Hide Details

runCmd: settings set plugin.process.gdb-remote.packet-timeout 60 output: Assertion failed: (tokenKind == tok::kw___bridge_retain), function ParseParenExpression, file /Users/buildslave/jenkins/workspace/lldb-cmake-sanitized/llvm-project/clang/lib/Parse/ParseExpr.cpp, line 2804.

Hide Details

--

Hide Details

******************** PASS: lldb-api :: lang/cpp/typedef/TestCppTypedef.py (1922 of 2028) PASS: lldb-unit :: Core/./LLDBCoreTests/RichManglingContextTest.FromCxxMethodName (1923 of 2028) PASS: lldb-unit :: Utility/./UtilityTests/XcodeSDKTest.GetCanonicalNameAndConstruct (1924 of 2028) PASS: lldb-api :: commands/expression/deleting-implicit-copy-constructor/TestDeletingImplicitCopyConstructor.py (1925 of 2028) PASS: lldb-unit :: Utility/./UtilityTests/StreamTeeTest.Write (1926 of 2028) PASS: lldb-unit :: Utility/./UtilityTests/StringLexerTest.Next (1927 of 2028) PASS: lldb-unit :: UnwindAssembly/x86/./UnwindAssemblyx86Tests/Testx86AssemblyInspectionEngine.TestCALLNextInsn (1928 of 2028) PASS: lldb-unit :: Utility/./UtilityTests/StringListTest.ShiftStdString (1929 of 2028) PASS: lldb-unit :: Utility/./UtilityTests/StringListTest.AppendListCStringArray (1930 of 2028) PASS: lldb-unit :: UnwindAssembly/x86/./UnwindAssemblyx86Tests/Testx86AssemblyInspectionEngine.TestAddRSP (1931 of 2028) PASS: lldb-unit :: Utility/./UtilityTests/StatusTest.ErrorCodeConstructor (1932 of 2028) UNSUPPORTED: lldb-shell :: SymbolFile/PDB/vbases.test (1933 of 2028) UNSUPPORTED: lldb-api :: lang/objc/rdar-12408181/TestRdar12408181.py (1934 of 2028) PASS: lldb-unit :: UnwindAssembly/x86/./UnwindAssemblyx86Tests/Testx86AssemblyInspectionEngine.TestPushEBP (1935 of 2028) PASS: lldb-unit :: Utility/./UtilityTests/SerializationRountripTest.SerializeDeserializePodPointers (1936 of 2028) PASS: lldb-api :: functionalities/breakpoint/breakpoint_set_restart/TestBreakpointSetRestart.py (1937 of 2028) FAIL: lldb-api :: commands/expression/context-object-objc/TestContextObjectObjc.py (1938 of 2028) ******************** TEST 'lldb-api :: commands/expression/context-object-objc/TestContextObjectObjc.py' FAILED ******************** Script: -- /Users/buildslave/jenkins/workspace/lldb-cmake-sanitized/lldb-build/lldb-test-build.noindex/copied-system-python /Users/buildslave/jenkins/workspace/lldb-cmake-sanitized/llvm-project/lldb/test/API/dotest.py --arch x86_64 -s /Users/buildslave/jenkins/workspace/lldb-cmake-sanitized/lldb-build/lldb-test-traces -S nm -u CXXFLAGS -u CFLAGS --codesign-identity lldb_codesign --server /Users/buildslave/jenkins/workspace/lldb-cmake-sanitized/lldb-build/./bin/debugserver --arch x86_64 --build-dir /Users/buildslave/jenkins/workspace/lldb-cmake-sanitized/lldb-build/lldb-test-build.noindex -s=/Users/buildslave/jenkins/workspace/lldb-cmake-sanitized/test/logs -t --env TERM=vt100 --env LLVM_LIBS_DIR=/Users/buildslave/jenkins/workspace/lldb-cmake-sanitized/lldb-build/./lib --inferior-env ASAN_OPTIONS=detect_stack_use_after_return=1 --inferior-env DYLD_INSERT_LIBRARIES=/Users/buildslave/jenkins/workspace/lldb-cmake-sanitized/host-compiler/lib/clang/11.0.0/lib/darwin/libclang_rt.asan_osx_dynamic.dylib --build-dir /Users/buildslave/jenkins/workspace/lldb-cmake-sanitized/lldb-build/lldb-test-build.noindex --lldb-module-cache-dir /Users/buildslave/jenkins/workspace/lldb-cmake-sanitized/lldb-build/lldb-test-build.noindex/module-cache-lldb/lldb-api --clang-module-cache-dir /Users/buildslave/jenkins/workspace/lldb-cmake-sanitized/lldb-build/lldb-test-build.noindex/module-cache-clang/lldb-api --executable /Users/buildslave/jenkins/workspace/lldb-cmake-sanitized/lldb-build/./bin/lldb --compiler /Users/buildslave/jenkins/workspace/lldb-cmake-sanitized/lldb-build/./bin/clang --dsymutil /Users/buildslave/jenkins/workspace/lldb-cmake-sanitized/lldb-build/./bin/dsymutil --filecheck /Users/buildslave/jenkins/workspace/lldb-cmake-sanitized/lldb-build/./bin/FileCheck --lldb-libs-dir /Users/buildslave/jenkins/workspace/lldb-cmake-sanitized/lldb-build/./lib /Users/buildslave/jenkins/workspace/lldb-cmake-sanitized/llvm-project/lldb/test/API/commands/expression/context-object-objc -p TestContextObjectObjc.py -- Exit Code: -6

Hide Details

Command Output (stdout): -- lldb version 11.0.99 clang revision 92063228f85bfe22a6dfe20bf01c99ffe6ff3130 llvm revision 92063228f85bfe22a6dfe20bf01c99ffe6ff3130

Hide Details

-- Command Output (stderr): -- Assertion failed: (tokenKind == tok::kw___bridge_retain), function ParseParenExpression, file /Users/buildslave/jenkins/workspace/lldb-cmake-sanitized/llvm-project/clang/lib/Parse/ParseExpr.cpp, line 2804.

Hide Details

--

Hide Details

******************** PASS: lldb-unit :: Utility/./UtilityTests/StringExtractorTest.GetHexBytesAvail_Underflow (1939 of 2028) PASS: lldb-api :: functionalities/data-formatter/data-formatter-objc/cmtime/TestDataFormatterCMTime.py (1940 of 2028) PASS: lldb-shell :: SymbolFile/NativePDB/function-types-calling-conv.cpp (1941 of 2028) PASS: lldb-unit :: Utility/./UtilityTests/StreamTest.PutRawBytesToMixedEndian (1942 of 2028) PASS: lldb-unit :: Utility/./UtilityTests/StringListTest.LongestCommonPrefixEmpty (1943 of 2028) FAIL: lldb-api :: lang/objc/rdar-11355592/TestRdar11355592.py (1944 of 2028) ******************** TEST 'lldb-api :: lang/objc/rdar-11355592/TestRdar11355592.py' FAILED ******************** Script: -- /Users/buildslave/jenkins/workspace/lldb-cmake-sanitized/lldb-build/lldb-test-build.noindex/copied-system-python /Users/buildslave/jenkins/workspace/lldb-cmake-sanitized/llvm-project/lldb/test/API/dotest.py --arch x86_64 -s /Users/buildslave/jenkins/workspace/lldb-cmake-sanitized/lldb-build/lldb-test-traces -S nm -u CXXFLAGS -u CFLAGS --codesign-identity lldb_codesign --server /Users/buildslave/jenkins/workspace/lldb-cmake-sanitized/lldb-build/./bin/debugserver --arch x86_64 --build-dir /Users/buildslave/jenkins/workspace/lldb-cmake-sanitized/lldb-build/lldb-test-build.noindex -s=/Users/buildslave/jenkins/workspace/lldb-cmake-sanitized/test/logs -t --env TERM=vt100 --env LLVM_LIBS_DIR=/Users/buildslave/jenkins/workspace/lldb-cmake-sanitized/lldb-build/./lib --inferior-env ASAN_OPTIONS=detect_stack_use_after_return=1 --inferior-env DYLD_INSERT_LIBRARIES=/Users/buildslave/jenkins/workspace/lldb-cmake-sanitized/host-compiler/lib/clang/11.0.0/lib/darwin/libclang_rt.asan_osx_dynamic.dylib --build-dir /Users/buildslave/jenkins/workspace/lldb-cmake-sanitized/lldb-build/lldb-test-build.noindex --lldb-module-cache-dir /Users/buildslave/jenkins/workspace/lldb-cmake-sanitized/lldb-build/lldb-test-build.noindex/module-cache-lldb/lldb-api --clang-module-cache-dir /Users/buildslave/jenkins/workspace/lldb-cmake-sanitized/lldb-build/lldb-test-build.noindex/module-cache-clang/lldb-api --executable /Users/buildslave/jenkins/workspace/lldb-cmake-sanitized/lldb-build/./bin/lldb --compiler /Users/buildslave/jenkins/workspace/lldb-cmake-sanitized/lldb-build/./bin/clang --dsymutil /Users/buildslave/jenkins/workspace/lldb-cmake-sanitized/lldb-build/./bin/dsymutil --filecheck /Users/buildslave/jenkins/workspace/lldb-cmake-sanitized/lldb-build/./bin/FileCheck --lldb-libs-dir /Users/buildslave/jenkins/workspace/lldb-cmake-sanitized/lldb-build/./lib /Users/buildslave/jenkins/workspace/lldb-cmake-sanitized/llvm-project/lldb/test/API/lang/objc/rdar-11355592 -p TestRdar11355592.py -- Exit Code: -6

Hide Details

Command Output (stdout): -- lldb version 11.0.99 clang revision 92063228f85bfe22a6dfe20bf01c99ffe6ff3130 llvm revision 92063228f85bfe22a6dfe20bf01c99ffe6ff3130

Hide Details

-- Command Output (stderr): --

Hide Details

Session logs for test failures/errors/unexpected successes will go into directory '/Users/buildslave/jenkins/workspace/lldb-cmake-sanitized/test/logs' Command invoked: /Users/buildslave/jenkins/workspace/lldb-cmake-sanitized/llvm-project/lldb/test/API/dotest.py --arch x86_64 -s /Users/buildslave/jenkins/workspace/lldb-cmake-sanitized/lldb-build/lldb-test-traces -S nm -u CXXFLAGS -u CFLAGS --codesign-identity lldb_codesign --server /Users/buildslave/jenkins/workspace/lldb-cmake-sanitized/lldb-build/./bin/debugserver --arch x86_64 --build-dir /Users/buildslave/jenkins/workspace/lldb-cmake-sanitized/lldb-build/lldb-test-build.noindex -s=/Users/buildslave/jenkins/workspace/lldb-cmake-sanitized/test/logs -t --env TERM=vt100 --env LLVM_LIBS_DIR=/Users/buildslave/jenkins/workspace/lldb-cmake-sanitized/lldb-build/./lib --inferior-env ASAN_OPTIONS=detect_stack_use_after_return=1 --inferior-env DYLD_INSERT_LIBRARIES=/Users/buildslave/jenkins/workspace/lldb-cmake-sanitized/host-compiler/lib/clang/11.0.0/lib/darwin/libclang_rt.asan_osx_dynamic.dylib --build-dir /Users/buildslave/jenkins/workspace/lldb-cmake-sanitized/lldb-build/lldb-test-build.noindex --lldb-module-cache-dir /Users/buildslave/jenkins/workspace/lldb-cmake-sanitized/lldb-build/lldb-test-build.noindex/module-cache-lldb/lldb-api --clang-module-cache-dir /Users/buildslave/jenkins/workspace/lldb-cmake-sanitized/lldb-build/lldb-test-build.noindex/module-cache-clang/lldb-api --executable /Users/buildslave/jenkins/workspace/lldb-cmake-sanitized/lldb-build/./bin/lldb --compiler /Users/buildslave/jenkins/workspace/lldb-cmake-sanitized/lldb-build/./bin/clang --dsymutil /Users/buildslave/jenkins/workspace/lldb-cmake-sanitized/lldb-build/./bin/dsymutil --filecheck /Users/buildslave/jenkins/workspace/lldb-cmake-sanitized/lldb-build/./bin/FileCheck --lldb-libs-dir /Users/buildslave/jenkins/workspace/lldb-cmake-sanitized/lldb-build/./lib /Users/buildslave/jenkins/workspace/lldb-cmake-sanitized/llvm-project/lldb/test/API/lang/objc/rdar-11355592 -p TestRdar11355592.py Change dir to: /Users/buildslave/jenkins/workspace/lldb-cmake-sanitized/llvm-project/lldb/test/API/lang/objc/rdar-11355592 runCmd: settings clear -all output:

Hide Details

runCmd: settings set symbols.enable-external-lookup false output:

Hide Details

runCmd: settings set target.auto-apply-fixits false output:

Hide Details

runCmd: settings set plugin.process.gdb-remote.packet-timeout 60 output:

Hide Details

runCmd: settings set symbols.clang-modules-cache-path "/Users/buildslave/jenkins/workspace/lldb-cmake-sanitized/lldb-build/lldb-test-build.noindex/module-cache-lldb/lldb-api" output:

Hide Details

runCmd: settings set use-color false output:

Hide Details

runCmd: setting set target.prefer-dynamic-value no-dynamic-values output:

Hide Details

runCmd: settings set target.env-vars ASAN_OPTIONS=detect_stack_use_after_return=1 DYLD_INSERT_LIBRARIES=/Users/buildslave/jenkins/workspace/lldb-cmake-sanitized/host-compiler/lib/clang/11.0.0/lib/darwin/libclang_rt.asan_osx_dynamic.dylib output:

Hide Details

runCmd: file /Users/buildslave/jenkins/workspace/lldb-cmake-sanitized/lldb-build/lldb-test-build.noindex/lang/objc/rdar-11355592/TestRdar11355592.test_charstar_dyntype_dsym/test_charstar_dyntype_dsym output: Current executable set to '/Users/buildslave/jenkins/workspace/lldb-cmake-sanitized/lldb-build/lldb-test-build.noindex/lang/objc/rdar-11355592/TestRdar11355592.test_charstar_dyntype_dsym/test_charstar_dyntype_dsym' (x86_64).

Hide Details

Hide Details

runCmd: breakpoint set -f "main.m" -l 33 output: Breakpoint 1: where = test_charstar_dyntype_dsym`main + 110 at main.m:33:15, address = 0x0000000100000ebe

Hide Details

Hide Details

Expecting pattern: ^Breakpoint (?P<bpno>[0-9]+): (?P<num_locations>[0-9]+) locations\.$ Not matched

Hide Details

Expecting pattern: ^Breakpoint (?P<bpno>[0-9]+): (?P<num_locations>no) locations \(pending\)\. Not matched

Hide Details

Expecting pattern: ^Breakpoint (?P<bpno>[0-9]+): where = (?P<module>.*)`(?P<symbol>[+\-]{0,1}[^+]+)( \+ (?P<offset>[0-9]+)){0,1}( \[inlined\] (?P<inline_symbol>.*)){0,1} at (?P<file>[^:]+):(?P<line_no>[0-9]+)(?P<column>(:[0-9]+)?), address = (?P<address>0x[0-9a-fA-F]+)$ Matched

Hide Details

runCmd: run output: Process 94812 stopped * thread #1, queue = 'com.apple.main-thread', stop reason = breakpoint 1.1 frame #0: 0x0000000100000ebe test_charstar_dyntype_dsym`main(argc=1, argv=0x00007ffeefbff458) at main.m:33:15 30 FoolMeOnce *my_foolie = [[FoolMeOnce alloc] initWithFirst: 20 andSecond: 55]; 31 const char *my_string = (char *) my_foolie; 32 -> 33 my_string = "Now this is a REAL string..."; // Set breakpoint here. ^ 34 35 [pool release]; 36 return 0;

Hide Details

Process 94812 launched: '/Users/buildslave/jenkins/workspace/lldb-cmake-sanitized/lldb-build/lldb-test-build.noindex/lang/objc/rdar-11355592/TestRdar11355592.test_charstar_dyntype_dsym/test_charstar_dyntype_dsym' (x86_64)

Hide Details

Hide Details

runCmd: frame variable -raw-output my_string output: (const char *) my_string = 0x00006020000022b0

Hide Details

Hide Details

Expecting sub string: const char * Matched

Hide Details

runCmd: frame variable my_string --raw-output --dynamic-type run-target output: (const char *) my_string = 0x00006020000022b0

Hide Details

Hide Details

Expecting sub string: const char * Matched

Hide Details

runCmd: e -R -- my_string output: (const char *) $0 = 0x00006020000022b0

Hide Details

Hide Details

Expecting sub string: const char * Matched

Hide Details

runCmd: expr -R -d run -- my_string output: (const char *) $1 = 0x00006020000022b0

Hide Details

Hide Details

Expecting sub string: const char * Matched

Hide Details

runCmd: frame variable my_foolie output: (FoolMeOnce *) my_foolie = 0x00006020000022b0

Hide Details

Hide Details

Expecting sub string: FoolMeOnce * Matched

Hide Details

runCmd: frame variable my_foolie --dynamic-type run-target output: (FoolMeOnce *) my_foolie = 0x00006020000022b0

Hide Details

Hide Details

Expecting sub string: FoolMeOnce * Matched

Hide Details

runCmd: expr my_foolie output: (FoolMeOnce *) $2 = 0x00006020000022b0

Hide Details

Hide Details

Expecting sub string: FoolMeOnce * Matched

Hide Details

runCmd: expr -d run -- my_foolie output: (FoolMeOnce *) $3 = 0x00006020000022b0

Hide Details

Hide Details

Expecting sub string: FoolMeOnce * Matched

Hide Details

runCmd: next output: Process 94812 stopped * thread #1, queue = 'com.apple.main-thread', stop reason = step over frame #0: 0x0000000100000ec9 test_charstar_dyntype_dsym`main(argc=1, argv=0x00007ffeefbff458) at main.m:35:6 32 33 my_string = "Now this is a REAL string..."; // Set breakpoint here. 34 -> 35 [pool release]; ^ 36 return 0; 37 }

Hide Details

Hide Details

Hide Details

runCmd: frame variable my_string output: (const char *) my_string = 0x0000000100000f96 "Now this is a REAL string..."

Hide Details

Hide Details

Expecting sub string: const char * Matched

Hide Details

runCmd: frame variable my_string --dynamic-type run-target output: (const char *) my_string = 0x0000000100000f96 "Now this is a REAL string..."

Hide Details

Hide Details

Expecting sub string: const char * Matched

Hide Details

runCmd: expr my_string output: (const char *) $4 = 0x0000000100000f96 "Now this is a REAL string..."

Hide Details

Hide Details

Expecting sub string: const char * Matched

Hide Details

runCmd: expr -d run -- my_string output: (const char *) $5 = 0x0000000100000f96 "Now this is a REAL string..."

Hide Details

Hide Details

Expecting sub string: const char * Matched

Hide Details

runCmd: frame variable my_foolie output: (FoolMeOnce *) my_foolie = 0x00006020000022b0

Hide Details

Hide Details

Expecting sub string: FoolMeOnce * Matched

Hide Details

runCmd: frame variable my_foolie --dynamic-type run-target output: (FoolMeOnce *) my_foolie = 0x00006020000022b0

Hide Details

Hide Details

Expecting sub string: FoolMeOnce * Matched

Hide Details

runCmd: expr my_foolie output: (FoolMeOnce *) $6 = 0x00006020000022b0

Hide Details

Hide Details

Expecting sub string: FoolMeOnce * Matched

Hide Details

runCmd: expr -d run -- my_foolie output: (FoolMeOnce *) $7 = 0x00006020000022b0

Hide Details

Hide Details

Expecting sub string: FoolMeOnce * Matched

Hide Details

<bound method SBProcess.Kill of <lldb.SBProcess; proxy of <Swig Object of type 'lldb::SBProcess *' at 0x10ea26990> >>: success

Hide Details

PASS: LLDB (/Users/buildslave/jenkins/workspace/lldb-cmake-sanitized/lldb-build/bin/clang-11-x86_64) :: test_charstar_dyntype_dsym (TestRdar11355592.Rdar10967107TestCase) runCmd: settings clear -all output:

Hide Details

runCmd: settings set symbols.enable-external-lookup false output:

Hide Details

runCmd: settings set target.auto-apply-fixits false output:

Hide Details

runCmd: settings set plugin.process.gdb-remote.packet-timeout 60 output:

Hide Details

runCmd: settings set symbols.clang-modules-cache-path "/Users/buildslave/jenkins/workspace/lldb-cmake-sanitized/lldb-build/lldb-test-build.noindex/module-cache-lldb/lldb-api" output: Assertion failed: (tokenKind == tok::kw___bridge_retain), function ParseParenExpression, file /Users/buildslave/jenkins/workspace/lldb-cmake-sanitized/llvm-project/clang/lib/Parse/ParseExpr.cpp, line 2804.

Hide Details

--

Hide Details

******************** PASS: lldb-api :: functionalities/thread/concurrent_events/TestConcurrentWatchBreakDelay.py (1945 of 2028) PASS: lldb-unit :: Process/minidump/./LLDBMinidumpTests/MinidumpParserTest.GetArchitecture (1946 of 2028) PASS: lldb-api :: lang/cpp/class-template-parameter-pack/TestClassTemplateParameterPack.py (1947 of 2028) PASS: lldb-unit :: Utility/./UtilityTests/RangeTest.ContainsEndInclusive (1948 of 2028) UNSUPPORTED: lldb-api :: functionalities/tsan/basic/TestTsanBasic.py (1949 of 2028) PASS: lldb-api :: functionalities/data-formatter/data-formatter-stl/libcxx/variant/TestDataFormatterLibcxxVariant.py (1950 of 2028) PASS: lldb-api :: commands/quit/TestQuit.py (1951 of 2028) PASS: lldb-unit :: Host/./HostTests/NativeProcessProtocolTest.ReadMemoryWithoutTrap (1952 of 2028) PASS: lldb-api :: functionalities/data-formatter/data-formatter-objc/TestDataFormatterObjCNSDate.py (1953 of 2028) PASS: lldb-shell :: ObjectFile/wasm/basic.yaml (1954 of 2028) PASS: lldb-unit :: Symbol/./SymbolTests/TestTypeSystemClang.TestGetBasicTypeFromName (1955 of 2028) PASS: lldb-unit :: Utility/./UtilityTests/StructuredDataTest.StringDump (1956 of 2028) PASS: lldb-unit :: Process/gdb-remote/./ProcessGdbRemoteTests/GDBRemoteCommunicationClientTest.SyncThreadState (1957 of 2028) PASS: lldb-api :: functionalities/archives/TestBSDArchives.py (1958 of 2028) PASS: lldb-unit :: UnwindAssembly/x86/./UnwindAssemblyx86Tests/Testx86AssemblyInspectionEngine.TestPushR13 (1959 of 2028) PASS: lldb-api :: commands/expression/import-std-module/sysroot/TestStdModuleSysroot.py (1960 of 2028) PASS: lldb-api :: functionalities/tail_call_frames/unambiguous_sequence/TestUnambiguousTailCalls.py (1961 of 2028) PASS: lldb-api :: lang/cpp/global_operators/TestCppGlobalOperators.py (1962 of 2028) PASS: lldb-api :: driver/batch_mode/TestBatchMode.py (1963 of 2028) PASS: lldb-api :: functionalities/data-formatter/compactvectors/TestCompactVectors.py (1964 of 2028) PASS: lldb-api :: functionalities/data-formatter/data-formatter-stl/libcxx/string/TestDataFormatterLibcxxString.py (1965 of 2028) PASS: lldb-unit :: Utility/./UtilityTests/ArchSpecTest.OperatorBool (1966 of 2028) PASS: lldb-unit :: ScriptInterpreter/Python/./ScriptInterpreterPythonTests/PythonDataObjectsTest.TestPythonDictionaryValueEquality (1967 of 2028) PASS: lldb-unit :: Host/./HostTests/NativeProcessProtocolTest.SetBreakpointFailRead (1968 of 2028) UNSUPPORTED: lldb-api :: functionalities/darwin_log/filter/exact_match/activity/TestDarwinLogFilterMatchActivity.py (1969 of 2028) PASS: lldb-api :: python_api/formatters/TestFormattersSBAPI.py (1970 of 2028) PASS: lldb-shell :: Commands/CommandScriptImmediateOutput/CommandScriptImmediateOutputFile.test (1971 of 2028) PASS: lldb-api :: functionalities/inferior-crashing/TestInferiorCrashingStep.py (1972 of 2028) PASS: lldb-unit :: Utility/./UtilityTests/UriParserTest.BracketedHostnameWithPortIPv4 (1973 of 2028) UNSUPPORTED: lldb-api :: functionalities/data-formatter/data-formatter-stl/libstdcpp/unique_ptr/TestDataFormatterStdUniquePtr.py (1974 of 2028) PASS: lldb-unit :: Process/minidump/./LLDBMinidumpTests/MinidumpParserTest.GetMiscInfo_no_stream (1975 of 2028) PASS: lldb-api :: functionalities/param_entry_vals/basic_entry_values/TestBasicEntryValues.py (1976 of 2028) PASS: lldb-api :: types/TestIntegerTypeExpr.py (1977 of 2028) PASS: lldb-api :: functionalities/breakpoint/breakpoint_ignore_count/TestBreakpointIgnoreCount.py (1978 of 2028) PASS: lldb-api :: lang/objc/single-entry-dictionary/TestObjCSingleEntryDictionary.py (1979 of 2028) PASS: lldb-unit :: Utility/./UtilityTests/SerializationRountripTest.SerializeDeserializeObjectReference (1980 of 2028) PASS: lldb-api :: lang/objc/modules-app-update/TestClangModulesAppUpdate.py (1981 of 2028) PASS: lldb-unit :: SymbolFile/NativePDB/./SymbolFileNativePDBTests/PDBFPOProgramToDWARFExpressionTests.MultipleDependentAssignments (1982 of 2028) PASS: lldb-unit :: Utility/./UtilityTests/ConstStringTest.MangledCounterpart (1983 of 2028) PASS: lldb-unit :: SymbolFile/NativePDB/./SymbolFileNativePDBTests/PDBFPOProgramToDWARFExpressionTests.InvalidOpUnary (1984 of 2028) PASS: lldb-unit :: Process/minidump/./LLDBMinidumpTests/MinidumpParserTest.GetMemoryRegionInfoLinuxMaps (1985 of 2028) PASS: lldb-api :: commands/expression/vector_of_enums/TestVectorOfEnums.py (1986 of 2028) PASS: lldb-api :: functionalities/inferior-crashing/recursive-inferior/TestRecursiveInferior.py (1987 of 2028) PASS: lldb-shell :: Unwind/trap_frame_sym_ctx.test (1988 of 2028) PASS: lldb-unit :: Utility/./UtilityTests/BinaryStreamTest.PutSLEB128MaxValue (1989 of 2028) PASS: lldb-unit :: Utility/./UtilityTests/AnsiTerminal.KnownPrefix (1990 of 2028) PASS: lldb-api :: tools/lldb-vscode/breakpoint/TestVSCode_setBreakpoints.py (1991 of 2028) PASS: lldb-shell :: SymbolFile/Breakpad/unwind-via-stack-win.test (1992 of 2028) PASS: lldb-api :: functionalities/breakpoint/breakpoint_locations/TestBreakpointLocations.py (1993 of 2028) PASS: lldb-unit :: Utility/./UtilityTests/StringExtractorTest.GetHexU8_Exact_NoEof (1994 of 2028) UNSUPPORTED: lldb-shell :: Register/x86-64-zmm-read.test (1995 of 2028) PASS: lldb-unit :: Language/Highlighting/./HighlighterTests/HighlighterTest.DefaultHighlighterWithCursor (1996 of 2028) PASS: lldb-unit :: Utility/./UtilityTests/ScalarTest.RightShiftOperator (1997 of 2028) PASS: lldb-api :: functionalities/breakpoint/scripted_bkpt/TestScriptedResolver.py (1998 of 2028) PASS: lldb-api :: functionalities/breakpoint/step_over_breakpoint/TestStepOverBreakpoint.py (1999 of 2028) PASS: lldb-api :: commands/expression/issue_11588/Test11588.py (2000 of 2028) PASS: lldb-api :: commands/expression/import-std-module/no-std-module/TestMissingStdModule.py (2001 of 2028) PASS: lldb-unit :: Utility/./UtilityTests/StreamTest.PutRawBytesToBigEndian (2002 of 2028) PASS: lldb-unit :: Utility/./UtilityTests/NameMatchesTest.Equals (2003 of 2028) PASS: lldb-unit :: Utility/./UtilityTests/StringListTest.AppendStringCString (2004 of 2028) PASS: lldb-unit :: Utility/./UtilityTests/BinaryStreamTest.PutSLEB128ThreeBytes (2005 of 2028) FAIL: lldb-api :: commands/expression/namespace_local_var_same_name_obj_c/TestNamespaceLocalVarSameNameObjC.py (2006 of 2028) ******************** TEST 'lldb-api :: commands/expression/namespace_local_var_same_name_obj_c/TestNamespaceLocalVarSameNameObjC.py' FAILED ******************** Script: -- /Users/buildslave/jenkins/workspace/lldb-cmake-sanitized/lldb-build/lldb-test-build.noindex/copied-system-python /Users/buildslave/jenkins/workspace/lldb-cmake-sanitized/llvm-project/lldb/test/API/dotest.py --arch x86_64 -s /Users/buildslave/jenkins/workspace/lldb-cmake-sanitized/lldb-build/lldb-test-traces -S nm -u CXXFLAGS -u CFLAGS --codesign-identity lldb_codesign --server /Users/buildslave/jenkins/workspace/lldb-cmake-sanitized/lldb-build/./bin/debugserver --arch x86_64 --build-dir /Users/buildslave/jenkins/workspace/lldb-cmake-sanitized/lldb-build/lldb-test-build.noindex -s=/Users/buildslave/jenkins/workspace/lldb-cmake-sanitized/test/logs -t --env TERM=vt100 --env LLVM_LIBS_DIR=/Users/buildslave/jenkins/workspace/lldb-cmake-sanitized/lldb-build/./lib --inferior-env ASAN_OPTIONS=detect_stack_use_after_return=1 --inferior-env DYLD_INSERT_LIBRARIES=/Users/buildslave/jenkins/workspace/lldb-cmake-sanitized/host-compiler/lib/clang/11.0.0/lib/darwin/libclang_rt.asan_osx_dynamic.dylib --build-dir /Users/buildslave/jenkins/workspace/lldb-cmake-sanitized/lldb-build/lldb-test-build.noindex --lldb-module-cache-dir /Users/buildslave/jenkins/workspace/lldb-cmake-sanitized/lldb-build/lldb-test-build.noindex/module-cache-lldb/lldb-api --clang-module-cache-dir /Users/buildslave/jenkins/workspace/lldb-cmake-sanitized/lldb-build/lldb-test-build.noindex/module-cache-clang/lldb-api --executable /Users/buildslave/jenkins/workspace/lldb-cmake-sanitized/lldb-build/./bin/lldb --compiler /Users/buildslave/jenkins/workspace/lldb-cmake-sanitized/lldb-build/./bin/clang --dsymutil /Users/buildslave/jenkins/workspace/lldb-cmake-sanitized/lldb-build/./bin/dsymutil --filecheck /Users/buildslave/jenkins/workspace/lldb-cmake-sanitized/lldb-build/./bin/FileCheck --lldb-libs-dir /Users/buildslave/jenkins/workspace/lldb-cmake-sanitized/lldb-build/./lib /Users/buildslave/jenkins/workspace/lldb-cmake-sanitized/llvm-project/lldb/test/API/commands/expression/namespace_local_var_same_name_obj_c -p TestNamespaceLocalVarSameNameObjC.py -- Exit Code: -6

Hide Details

Command Output (stdout): -- lldb version 11.0.99 clang revision 92063228f85bfe22a6dfe20bf01c99ffe6ff3130 llvm revision 92063228f85bfe22a6dfe20bf01c99ffe6ff3130

Hide Details

-- Command Output (stderr): -- Assertion failed: (tokenKind == tok::kw___bridge_retain), function ParseParenExpression, file /Users/buildslave/jenkins/workspace/lldb-cmake-sanitized/llvm-project/clang/lib/Parse/ParseExpr.cpp, line 2804.

Hide Details

--

Hide Details

******************** PASS: lldb-unit :: Utility/./UtilityTests/StreamTeeTest.GetStreamAtIndexOutOfBoundsEmpty (2007 of 2028) PASS: lldb-api :: commands/platform/process/list/TestProcessList.py (2008 of 2028) PASS: lldb-unit :: Utility/./UtilityTests/ScalarTest.GetValue (2009 of 2028) PASS: lldb-api :: functionalities/inferior-crashing/recursive-inferior/TestRecursiveInferiorStep.py (2010 of 2028) PASS: lldb-unit :: SymbolFile/NativePDB/./SymbolFileNativePDBTests/PDBFPOProgramToDWARFExpressionTests.InvalidAssignmentSingle (2011 of 2028) PASS: lldb-api :: sample_test/TestSampleTest.py (2012 of 2028) PASS: lldb-unit :: Utility/./UtilityTests/Flags.Test (2013 of 2028) PASS: lldb-unit :: Utility/./UtilityTests/ArgsTest.ReplaceArgumentAtIndexOutOfRange (2014 of 2028) PASS: lldb-unit :: UnwindAssembly/x86/./UnwindAssemblyx86Tests/Testx86AssemblyInspectionEngine.TestSimplei386ugmented (2015 of 2028) PASS: lldb-api :: functionalities/thread/concurrent_events/TestConcurrentBreakpointOneDelayBreakpointThreads.py (2016 of 2028) PASS: lldb-api :: commands/breakpoint/set/func-regex/TestBreakpointRegexError.py (2017 of 2028) UNSUPPORTED: lldb-api :: linux/add-symbols/TestTargetSymbolsAddCommand.py (2018 of 2028) PASS: lldb-unit :: Utility/./UtilityTests/FileSpecTest.Yaml (2019 of 2028) PASS: lldb-unit :: SymbolFile/DWARF/./SymbolFileDWARFTests/DWARFASTParserClangTests.EnsureAllDIEsInDeclContextHaveBeenParsedParsesOnlyMatchingEntries (2020 of 2028) PASS: lldb-unit :: Utility/./UtilityTests/StreamTest.AddressNoSuffix (2021 of 2028) PASS: lldb-api :: lang/objc/global_ptrs/TestGlobalObjects.py (2022 of 2028) PASS: lldb-unit :: Utility/./UtilityTests/GeneratorTest.Create (2023 of 2028) UNSUPPORTED: lldb-shell :: Expr/TestIRMemoryMapWindows.test (2024 of 2028) PASS: lldb-shell :: Minidump/fb-dump.test (2025 of 2028) PASS: lldb-api :: commands/expression/argument_passing_restrictions/TestArgumentPassingRestrictions.py (2026 of 2028) PASS: lldb-api :: functionalities/breakpoint/breakpoint_conditions/TestBreakpointConditions.py (2027 of 2028) PASS: lldb-api :: lang/objc/objc-ivar-offsets/TestObjCIvarOffsets.py (2028 of 2028) Slowest Tests: -------------------------------------------------------------------------- 483.59s: lldb-api :: tools/lldb-server/TestLldbGdbServer.py 413.54s: lldb-api :: api/multithreaded/TestMultithreaded.py 411.84s: lldb-api :: lang/cpp/enum_types/TestCPP11EnumTypes.py 270.24s: lldb-api :: tools/lldb-server/TestGdbRemoteThreadsInStopReply.py 244.62s: lldb-api :: lang/objc/exceptions/TestObjCExceptions.py 225.61s: lldb-api :: lang/objc/real-definition/TestRealDefinition.py 223.98s: lldb-api :: lang/cpp/namespace/TestNamespaceLookup.py 177.48s: lldb-api :: lang/objc/foundation/TestObjCMethods.py 174.14s: lldb-api :: types/TestLongTypesExpr.py 149.95s: lldb-api :: functionalities/data-formatter/poarray/TestPrintObjectArray.py 140.14s: lldb-api :: lang/objc/conflicting-definition/TestConflictingDefinition.py 138.23s: lldb-api :: api/check_public_api_headers/TestPublicAPIHeaders.py 137.68s: lldb-api :: commands/settings/TestSettings.py 136.80s: lldb-api :: functionalities/data-formatter/compactvectors/TestCompactVectors.py 129.57s: lldb-api :: tools/lldb-server/TestGdbRemote_qThreadStopInfo.py 125.65s: lldb-api :: lang/objc/forward-decl/TestForwardDecl.py 124.26s: lldb-api :: python_api/lldbutil/iter/TestLLDBIterator.py 121.41s: lldb-api :: commands/expression/import-std-module/stack/TestStackFromStdModule.py 119.58s: lldb-api :: types/TestLongTypes.py 113.77s: lldb-api :: commands/expression/import-std-module/queue/TestQueueFromStdModule.py

Hide Details

Tests Times: -------------------------------------------------------------------------- [ Range ] :: [ Percentage ] :: [ Count ] -------------------------------------------------------------------------- [480s,500s) :: [ ] :: [ 1/2028] [460s,480s) :: [ ] :: [ 0/2028] [440s,460s) :: [ ] :: [ 0/2028] [420s,440s) :: [ ] :: [ 2/2028] [400s,420s) :: [ ] :: [ 0/2028] [380s,400s) :: [ ] :: [ 0/2028] [360s,380s) :: [ ] :: [ 0/2028] [340s,360s) :: [ ] :: [ 0/2028] [320s,340s) :: [ ] :: [ 0/2028] [300s,320s) :: [ ] :: [ 0/2028] [280s,300s) :: [ ] :: [ 0/2028] [260s,280s) :: [ ] :: [ 1/2028] [240s,260s) :: [ ] :: [ 1/2028] [220s,240s) :: [ ] :: [ 2/2028] [200s,220s) :: [ ] :: [ 0/2028] [180s,200s) :: [ ] :: [ 2/2028] [160s,180s) :: [ ] :: [ 0/2028] [140s,160s) :: [ ] :: [ 5/2028] [120s,140s) :: [ ] :: [ 5/2028] [100s,120s) :: [ ] :: [ 7/2028] [ 80s,100s) :: [ ] :: [ 38/2028] [ 60s, 80s) :: [* ] :: [ 84/2028] [ 40s, 60s) :: [ ] :: [ 46/2028] [ 20s, 40s) :: [** ] :: [ 121/2028] [ 0s, 20s) :: [********************************* ] :: [1713/2028] -------------------------------------------------------------------------- ******************** Failing Tests (53): lldb-api :: functionalities/data-formatter/poarray/TestPrintObjectArray.py lldb-api :: commands/expression/persist_objc_pointeetype/TestPersistObjCPointeeType.py lldb-api :: lang/objc/foundation/TestObjCMethodsNSArray.py lldb-api :: lang/objc/objc-struct-argument/TestObjCStructArgument.py lldb-api :: lang/objc/objc-class-method/TestObjCClassMethod.py lldb-api :: lang/objc/objc-property/TestObjCProperty.py lldb-api :: commands/expression/diagnostics/TestExprDiagnostics.py lldb-api :: lang/objc/foundation/TestObjCMethods.py lldb-api :: lang/objc/print-obj/TestPrintObj.py lldb-api :: functionalities/set-data/TestSetData.py lldb-api :: lang/objc/unicode-string/TestUnicodeString.py lldb-api :: lang/objc/objc-super/TestObjCSuper.py lldb-api :: functionalities/data-formatter/data-formatter-objc/TestDataFormatterObjCExpr.py lldb-api :: lang/objc/conflicting-definition/TestConflictingDefinition.py lldb-api :: lang/objc/bitfield_ivars/TestBitfieldIvars.py lldb-api :: lang/objc/objc_direct-methods/TestObjCDirectMethods.py lldb-api :: commands/expression/import_builtin_fileid/TestImportBuiltinFileID.py lldb-api :: lang/objc/orderedset/TestOrderedSet.py lldb-api :: lang/objc/radar-9691614/TestObjCMethodReturningBOOL.py lldb-api :: lang/objc/objc-new-syntax/TestObjCNewSyntaxArray.py lldb-api :: lang/objc/foundation/TestObjCMethodsNSError.py lldb-api :: lang/objc/objc-static-method/TestObjCStaticMethod.py lldb-api :: lang/objc/modules/TestObjCModules.py lldb-api :: lang/objc/hidden-ivars/TestHiddenIvars.py lldb-api :: lang/objc/foundation/TestRuntimeTypes.py lldb-api :: lang/objc/modules-non-objc-target/TestObjCModulesNonObjCTarget.py lldb-api :: lang/objc/objc-runtime-ivars/TestRuntimeIvars.py lldb-api :: functionalities/data-formatter/data-formatter-objc/TestDataFormatterObjCNSError.py lldb-api :: functionalities/data-formatter/data-formatter-objc/TestDataFormatterObjCCF.py lldb-api :: lang/objc/blocks/TestObjCIvarsInBlocks.py lldb-api :: commands/expression/call-throws/TestCallThatThrows.py lldb-api :: lang/objc/objc-new-syntax/TestObjCNewSyntaxDictionary.py lldb-api :: functionalities/data-formatter/data-formatter-objc/nsindexpath/TestDataFormatterNSIndexPath.py lldb-api :: lang/objc/variadic_methods/TestVariadicMethods.py lldb-api :: lang/objc/objc-new-syntax/TestObjCNewSyntaxLiteral.py lldb-api :: lang/objc/objc-ivar-protocols/TestIvarProtocols.py lldb-api :: commands/expression/two-files/TestObjCTypeQueryFromOtherCompileUnit.py lldb-api :: lang/objc/objc-struct-return/TestObjCStructReturn.py lldb-api :: lang/objc/foundation/TestObjCMethodsString.py lldb-api :: lang/objc/objc++/TestObjCXX.py lldb-api :: lang/objcxx/objcxx-ivar-vector/TestIvarVector.py lldb-api :: lang/objc/self/TestObjCSelf.py lldb-api :: lang/objc/forward-decl/TestForwardDecl.py lldb-api :: commands/expression/po_verbosity/TestPoVerbosity.py lldb-api :: lang/objc/foundation/TestConstStrings.py lldb-api :: lang/objcxx/cxx-bridged-po/TestObjCXXBridgedPO.py lldb-api :: lang/objc/objc-optimized/TestObjcOptimized.py lldb-api :: python_api/exprpath_synthetic/TestExprPathSynthetic.py lldb-api :: functionalities/data-formatter/data-formatter-objc/TestDataFormatterObjCNSContainer.py lldb-api :: functionalities/data-formatter/synthupdate/TestSyntheticFilterRecompute.py lldb-api :: commands/expression/context-object-objc/TestContextObjectObjc.py lldb-api :: lang/objc/rdar-11355592/TestRdar11355592.py lldb-api :: commands/expression/namespace_local_var_same_name_obj_c/TestNamespaceLocalVarSameNameObjC.py

Hide Details

Hide Details

Testing Time: 6169.54s Unsupported Tests : 170 Expected Passes : 1799 Expected Failures : 6 Unexpected Failures: 53 FAILED: tools/lldb/test/CMakeFiles/check-lldb-lit cd /Users/buildslave/jenkins/workspace/lldb-cmake-sanitized/lldb-build/tools/lldb/test && /usr/local/Frameworks/Python.framework/Versions/3.7/bin/python3.7 /Users/buildslave/jenkins/workspace/lldb-cmake-sanitized/lldb-build/./bin/llvm-lit -v --time-tests --shuffle --xunit-xml-output=/Users/buildslave/jenkins/workspace/lldb-cmake-sanitized/test/results.xml -v -j 4 --timeout 1200 /Users/buildslave/jenkins/workspace/lldb-cmake-sanitized/lldb-build/tools/lldb/test ninja: build stopped: subcommand failed. Command failed: Command '['/usr/bin/env', 'TERM=vt100', '/usr/local/bin/ninja', '-v', 'check-lldb']' returned non-zero exit status 1. Command: ['/usr/bin/env', 'TERM=vt100', '/usr/local/bin/ninja', '-v', 'check-lldb'] [Pipeline] } [Pipeline] // timeout [Pipeline] } [Pipeline] // stage [Pipeline] stage [Pipeline] { (Declarative: Post Actions) [Pipeline] scanForIssues [Clang (LLVM based)] Sleeping for 5 seconds due to JENKINS-32191... [Clang (LLVM based)] Parsing console log (workspace: '/Users/buildslave/jenkins/workspace/lldb-cmake-sanitized') [Clang (LLVM based)] Successfully parsed console log [Clang (LLVM based)] -> found 2 issues (skipped 0 duplicates) [Clang (LLVM based)] Post processing issues on 'green-dragon-23' with source code encoding 'UTF-8' [Clang (LLVM based)] Creating SCM blamer to obtain author and commit information for affected files [Clang (LLVM based)] Creating SCM miner to obtain statistics for affected repository files [Clang (LLVM based)] Resolving file names for all issues in source directory '/Users/buildslave/jenkins/workspace/lldb-cmake-sanitized' [Clang (LLVM based)] -> resolved paths in source directory (1 found, 0 not found) [Clang (LLVM based)] Resolving module names from module definitions (build.xml, pom.xml, or Manifest.mf files) [Clang (LLVM based)] -> resolved module names for 2 issues [Clang (LLVM based)] Resolving package names (or namespaces) by parsing the affected files [Clang (LLVM based)] -> resolved package names of 1 affected files [Clang (LLVM based)] No filter has been set, publishing all 2 issues [Clang (LLVM based)] Creating fingerprints for all affected code blocks to track issues over different builds [Clang (LLVM based)] -> created fingerprints for 2 issues (skipped 0 issues) [Clang (LLVM based)] Copying affected files to Jenkins' build folder '/Users/Shared/Jenkins/Home/jobs/lldb-cmake-sanitized/builds/1492/files-with-issues' [Clang (LLVM based)] -> 1 copied, 0 not in workspace, 0 not-found, 0 with I/O error [Pipeline] junit Recording test results [Pipeline] } [Pipeline] // stage [Pipeline] } [Pipeline] // withEnv [Pipeline] } [Pipeline] // node [Pipeline] End of Pipeline ERROR: script returned exit code 1 Finished: FAILURE