FailedConsole Output

Skipping 8,928 KB.. Full Log
ior/TestRecursiveInferior.py (1597 of 2028)
PASS: lldb-api :: functionalities/gdb_remote_client/TestTargetXMLArch.py (1598 of 2028)
PASS: lldb-api :: python_api/sbstructureddata/TestStructuredDataAPI.py (1599 of 2028)
PASS: lldb-api :: macosx/duplicate-archive-members/TestDuplicateMembers.py (1600 of 2028)
PASS: lldb-unit :: Utility/./UtilityTests/StringExtractorTest.GetHexBytes_FullString (1601 of 2028)
PASS: lldb-unit :: Utility/./UtilityTests/StreamTest.Indent (1602 of 2028)
PASS: lldb-unit :: Utility/./UtilityTests/ArgsTest.TestInsertArg (1603 of 2028)
PASS: lldb-shell :: SymbolFile/DWARF/module-ownership.mm (1604 of 2028)
PASS: lldb-api :: commands/frame/diagnose/dereference-this/TestDiagnoseDereferenceThis.py (1605 of 2028)
PASS: lldb-unit :: ObjectFile/ELF/./ObjectFileELFTests/ObjectFileELFTest.GetSymtab_NoSymEntryPointArmThumbAddressClass (1606 of 2028)
PASS: lldb-api :: lang/cpp/stl/TestSTL.py (1607 of 2028)
PASS: lldb-unit :: Symbol/./SymbolTests/TestTypeSystemClang.TestGetTypeClassDeclType (1608 of 2028)
PASS: lldb-api :: functionalities/data-formatter/type_summary_list_arg/TestTypeSummaryListArg.py (1609 of 2028)
UNSUPPORTED: lldb-api :: functionalities/darwin_log/basic/TestDarwinLogBasic.py (1610 of 2028)
PASS: lldb-api :: lang/objc/objc-checker/TestObjCCheckers.py (1611 of 2028)
PASS: lldb-unit :: Utility/./UtilityTests/LogChannelEnabledTest.LogVerboseThread (1612 of 2028)
UNSUPPORTED: lldb-api :: functionalities/tsan/global_location/TestTsanGlobalLocation.py (1613 of 2028)
PASS: lldb-unit :: Language/Highlighting/./HighlighterTests/HighlighterTest.ClangSquareBrackets (1614 of 2028)
UNSUPPORTED: lldb-shell :: SymbolFile/NativePDB/stack_unwinding01.cpp (1615 of 2028)
FAIL: lldb-api :: lang/objc/radar-9691614/TestObjCMethodReturningBOOL.py (1616 of 2028)
******************** TEST 'lldb-api :: lang/objc/radar-9691614/TestObjCMethodReturningBOOL.py' FAILED ********************
Script:
--
/Users/buildslave/jenkins/workspace/lldb-cmake-sanitized/lldb-build/lldb-test-build.noindex/copied-system-python /Users/buildslave/jenkins/workspace/lldb-cmake-sanitized/llvm-project/lldb/test/API/dotest.py --arch x86_64 -s /Users/buildslave/jenkins/workspace/lldb-cmake-sanitized/lldb-build/lldb-test-traces -S nm -u CXXFLAGS -u CFLAGS --codesign-identity lldb_codesign --server /Users/buildslave/jenkins/workspace/lldb-cmake-sanitized/lldb-build/./bin/debugserver --arch x86_64 --build-dir /Users/buildslave/jenkins/workspace/lldb-cmake-sanitized/lldb-build/lldb-test-build.noindex -s=/Users/buildslave/jenkins/workspace/lldb-cmake-sanitized/test/logs -t --env TERM=vt100 --env LLVM_LIBS_DIR=/Users/buildslave/jenkins/workspace/lldb-cmake-sanitized/lldb-build/./lib --inferior-env ASAN_OPTIONS=detect_stack_use_after_return=1 --inferior-env DYLD_INSERT_LIBRARIES=/Users/buildslave/jenkins/workspace/lldb-cmake-sanitized/host-compiler/lib/clang/11.0.0/lib/darwin/libclang_rt.asan_osx_dynamic.dylib --build-dir /Users/buildslave/jenkins/workspace/lldb-cmake-sanitized/lldb-build/lldb-test-build.noindex --lldb-module-cache-dir /Users/buildslave/jenkins/workspace/lldb-cmake-sanitized/lldb-build/lldb-test-build.noindex/module-cache-lldb/lldb-api --clang-module-cache-dir /Users/buildslave/jenkins/workspace/lldb-cmake-sanitized/lldb-build/lldb-test-build.noindex/module-cache-clang/lldb-api --executable /Users/buildslave/jenkins/workspace/lldb-cmake-sanitized/lldb-build/./bin/lldb --compiler /Users/buildslave/jenkins/workspace/lldb-cmake-sanitized/lldb-build/./bin/clang --dsymutil /Users/buildslave/jenkins/workspace/lldb-cmake-sanitized/lldb-build/./bin/dsymutil --filecheck /Users/buildslave/jenkins/workspace/lldb-cmake-sanitized/lldb-build/./bin/FileCheck --lldb-libs-dir /Users/buildslave/jenkins/workspace/lldb-cmake-sanitized/lldb-build/./lib /Users/buildslave/jenkins/workspace/lldb-cmake-sanitized/llvm-project/lldb/test/API/lang/objc/radar-9691614 -p TestObjCMethodReturningBOOL.py
--
Exit Code: -6

Hide Details

Command Output (stdout): -- lldb version 11.0.99 clang revision 07e8a780d81bb58a0c7bd4da6cc0b9beaec3c788 llvm revision 07e8a780d81bb58a0c7bd4da6cc0b9beaec3c788

Hide Details

-- Command Output (stderr): -- Assertion failed: (tokenKind == tok::kw___bridge_retain), function ParseParenExpression, file /Users/buildslave/jenkins/workspace/lldb-cmake-sanitized/llvm-project/clang/lib/Parse/ParseExpr.cpp, line 2804.

Hide Details

--

Hide Details

******************** PASS: lldb-shell :: ObjectFile/ELF/compressed-sections.yaml (1617 of 2028) PASS: lldb-unit :: Utility/./UtilityTests/StreamTest.ShiftOperatorStrings (1618 of 2028) PASS: lldb-api :: commands/settings/use_source_cache/TestUseSourceCache.py (1619 of 2028) PASS: lldb-api :: commands/expression/import_base_class_when_class_has_derived_member/TestImportBaseClassWhenClassHasDerivedMember.py (1620 of 2028) FAIL: lldb-api :: lang/objc/foundation/TestObjCMethods.py (1621 of 2028) ******************** TEST 'lldb-api :: lang/objc/foundation/TestObjCMethods.py' FAILED ******************** Script: -- /Users/buildslave/jenkins/workspace/lldb-cmake-sanitized/lldb-build/lldb-test-build.noindex/copied-system-python /Users/buildslave/jenkins/workspace/lldb-cmake-sanitized/llvm-project/lldb/test/API/dotest.py --arch x86_64 -s /Users/buildslave/jenkins/workspace/lldb-cmake-sanitized/lldb-build/lldb-test-traces -S nm -u CXXFLAGS -u CFLAGS --codesign-identity lldb_codesign --server /Users/buildslave/jenkins/workspace/lldb-cmake-sanitized/lldb-build/./bin/debugserver --arch x86_64 --build-dir /Users/buildslave/jenkins/workspace/lldb-cmake-sanitized/lldb-build/lldb-test-build.noindex -s=/Users/buildslave/jenkins/workspace/lldb-cmake-sanitized/test/logs -t --env TERM=vt100 --env LLVM_LIBS_DIR=/Users/buildslave/jenkins/workspace/lldb-cmake-sanitized/lldb-build/./lib --inferior-env ASAN_OPTIONS=detect_stack_use_after_return=1 --inferior-env DYLD_INSERT_LIBRARIES=/Users/buildslave/jenkins/workspace/lldb-cmake-sanitized/host-compiler/lib/clang/11.0.0/lib/darwin/libclang_rt.asan_osx_dynamic.dylib --build-dir /Users/buildslave/jenkins/workspace/lldb-cmake-sanitized/lldb-build/lldb-test-build.noindex --lldb-module-cache-dir /Users/buildslave/jenkins/workspace/lldb-cmake-sanitized/lldb-build/lldb-test-build.noindex/module-cache-lldb/lldb-api --clang-module-cache-dir /Users/buildslave/jenkins/workspace/lldb-cmake-sanitized/lldb-build/lldb-test-build.noindex/module-cache-clang/lldb-api --executable /Users/buildslave/jenkins/workspace/lldb-cmake-sanitized/lldb-build/./bin/lldb --compiler /Users/buildslave/jenkins/workspace/lldb-cmake-sanitized/lldb-build/./bin/clang --dsymutil /Users/buildslave/jenkins/workspace/lldb-cmake-sanitized/lldb-build/./bin/dsymutil --filecheck /Users/buildslave/jenkins/workspace/lldb-cmake-sanitized/lldb-build/./bin/FileCheck --lldb-libs-dir /Users/buildslave/jenkins/workspace/lldb-cmake-sanitized/lldb-build/./lib /Users/buildslave/jenkins/workspace/lldb-cmake-sanitized/llvm-project/lldb/test/API/lang/objc/foundation -p TestObjCMethods.py -- Exit Code: -6

Hide Details

Command Output (stdout): -- lldb version 11.0.99 clang revision 07e8a780d81bb58a0c7bd4da6cc0b9beaec3c788 llvm revision 07e8a780d81bb58a0c7bd4da6cc0b9beaec3c788

Hide Details

-- Command Output (stderr): --

Hide Details

Session logs for test failures/errors/unexpected successes will go into directory '/Users/buildslave/jenkins/workspace/lldb-cmake-sanitized/test/logs' Command invoked: /Users/buildslave/jenkins/workspace/lldb-cmake-sanitized/llvm-project/lldb/test/API/dotest.py --arch x86_64 -s /Users/buildslave/jenkins/workspace/lldb-cmake-sanitized/lldb-build/lldb-test-traces -S nm -u CXXFLAGS -u CFLAGS --codesign-identity lldb_codesign --server /Users/buildslave/jenkins/workspace/lldb-cmake-sanitized/lldb-build/./bin/debugserver --arch x86_64 --build-dir /Users/buildslave/jenkins/workspace/lldb-cmake-sanitized/lldb-build/lldb-test-build.noindex -s=/Users/buildslave/jenkins/workspace/lldb-cmake-sanitized/test/logs -t --env TERM=vt100 --env LLVM_LIBS_DIR=/Users/buildslave/jenkins/workspace/lldb-cmake-sanitized/lldb-build/./lib --inferior-env ASAN_OPTIONS=detect_stack_use_after_return=1 --inferior-env DYLD_INSERT_LIBRARIES=/Users/buildslave/jenkins/workspace/lldb-cmake-sanitized/host-compiler/lib/clang/11.0.0/lib/darwin/libclang_rt.asan_osx_dynamic.dylib --build-dir /Users/buildslave/jenkins/workspace/lldb-cmake-sanitized/lldb-build/lldb-test-build.noindex --lldb-module-cache-dir /Users/buildslave/jenkins/workspace/lldb-cmake-sanitized/lldb-build/lldb-test-build.noindex/module-cache-lldb/lldb-api --clang-module-cache-dir /Users/buildslave/jenkins/workspace/lldb-cmake-sanitized/lldb-build/lldb-test-build.noindex/module-cache-clang/lldb-api --executable /Users/buildslave/jenkins/workspace/lldb-cmake-sanitized/lldb-build/./bin/lldb --compiler /Users/buildslave/jenkins/workspace/lldb-cmake-sanitized/lldb-build/./bin/clang --dsymutil /Users/buildslave/jenkins/workspace/lldb-cmake-sanitized/lldb-build/./bin/dsymutil --filecheck /Users/buildslave/jenkins/workspace/lldb-cmake-sanitized/lldb-build/./bin/FileCheck --lldb-libs-dir /Users/buildslave/jenkins/workspace/lldb-cmake-sanitized/lldb-build/./lib /Users/buildslave/jenkins/workspace/lldb-cmake-sanitized/llvm-project/lldb/test/API/lang/objc/foundation -p TestObjCMethods.py Change dir to: /Users/buildslave/jenkins/workspace/lldb-cmake-sanitized/llvm-project/lldb/test/API/lang/objc/foundation runCmd: settings clear -all output:

Hide Details

runCmd: settings set symbols.enable-external-lookup false output:

Hide Details

runCmd: settings set target.auto-apply-fixits false output:

Hide Details

runCmd: settings set plugin.process.gdb-remote.packet-timeout 60 output:

Hide Details

runCmd: settings set symbols.clang-modules-cache-path "/Users/buildslave/jenkins/workspace/lldb-cmake-sanitized/lldb-build/lldb-test-build.noindex/module-cache-lldb/lldb-api" output:

Hide Details

runCmd: settings set use-color false output:

Hide Details

runCmd: setting set target.prefer-dynamic-value no-dynamic-values output:

Hide Details

runCmd: settings set target.env-vars ASAN_OPTIONS=detect_stack_use_after_return=1 DYLD_INSERT_LIBRARIES=/Users/buildslave/jenkins/workspace/lldb-cmake-sanitized/host-compiler/lib/clang/11.0.0/lib/darwin/libclang_rt.asan_osx_dynamic.dylib output:

Hide Details

runCmd: file /Users/buildslave/jenkins/workspace/lldb-cmake-sanitized/lldb-build/lldb-test-build.noindex/lang/objc/foundation/TestObjCMethods.test_break_dsym/a.out output: Current executable set to '/Users/buildslave/jenkins/workspace/lldb-cmake-sanitized/lldb-build/lldb-test-build.noindex/lang/objc/foundation/TestObjCMethods.test_break_dsym/a.out' (x86_64).

Hide Details

Hide Details

runCmd: _regexp-break +[NSString stringWithFormat:] output: Breakpoint 1: where = Foundation`+[NSString stringWithFormat:], address = 0x0000000000004708

Hide Details

Hide Details

Expecting pattern: ^Breakpoint (?P<bpno>[0-9]+): (?P<num_locations>[0-9]+) locations\.$ Not matched

Hide Details

Expecting pattern: ^Breakpoint (?P<bpno>[0-9]+): (?P<num_locations>no) locations \(pending\)\. Not matched

Hide Details

Expecting pattern: ^Breakpoint (?P<bpno>[0-9]+): where = (?P<module>.*)`(?P<symbol>[+\-]{0,1}[^+]+)( \+ (?P<offset>[0-9]+)){0,1}( \[inlined\] (?P<inline_symbol>.*)){0,1} at (?P<file>[^:]+):(?P<line_no>[0-9]+)(?P<column>(:[0-9]+)?), address = (?P<address>0x[0-9a-fA-F]+)$ Not matched

Hide Details

Expecting pattern: ^Breakpoint (?P<bpno>[0-9]+): where = (?P<module>.*)`(?P<symbol>.*)( \+ (?P<offset>[0-9]+)){0,1}, address = (?P<address>0x[0-9a-fA-F]+)$ Matched

Hide Details

runCmd: breakpoint set -n "-[MyString initWithNSString:]" output: Breakpoint 2: where = a.out`-[MyString initWithNSString:] + 20 at main.m:23:16, address = 0x00000001000014b4

Hide Details

Hide Details

Expecting pattern: ^Breakpoint (?P<bpno>[0-9]+): (?P<num_locations>[0-9]+) locations\.$ Not matched

Hide Details

Expecting pattern: ^Breakpoint (?P<bpno>[0-9]+): (?P<num_locations>no) locations \(pending\)\. Not matched

Hide Details

Expecting pattern: ^Breakpoint (?P<bpno>[0-9]+): where = (?P<module>.*)`(?P<symbol>[+\-]{0,1}[^+]+)( \+ (?P<offset>[0-9]+)){0,1}( \[inlined\] (?P<inline_symbol>.*)){0,1} at (?P<file>[^:]+):(?P<line_no>[0-9]+)(?P<column>(:[0-9]+)?), address = (?P<address>0x[0-9a-fA-F]+)$ Matched

Hide Details

runCmd: breakpoint set -S "description" --shlib "a.out" output: Breakpoint 3: where = a.out`-[MyString description] + 16 at main.m:43:7, address = 0x00000001000015e0

Hide Details

Hide Details

Expecting pattern: ^Breakpoint (?P<bpno>[0-9]+): (?P<num_locations>[0-9]+) locations\.$ Not matched

Hide Details

Expecting pattern: ^Breakpoint (?P<bpno>[0-9]+): (?P<num_locations>no) locations \(pending\)\. Not matched

Hide Details

Expecting pattern: ^Breakpoint (?P<bpno>[0-9]+): where = (?P<module>.*)`(?P<symbol>[+\-]{0,1}[^+]+)( \+ (?P<offset>[0-9]+)){0,1}( \[inlined\] (?P<inline_symbol>.*)){0,1} at (?P<file>[^:]+):(?P<line_no>[0-9]+)(?P<column>(:[0-9]+)?), address = (?P<address>0x[0-9a-fA-F]+)$ Matched

Hide Details

runCmd: _regexp-break -[NSAutoreleasePool release] output: Breakpoint 4: where = Foundation`-[NSAutoreleasePool release], address = 0x0000000000003cee

Hide Details

Hide Details

Expecting pattern: ^Breakpoint (?P<bpno>[0-9]+): (?P<num_locations>[0-9]+) locations\.$ Not matched

Hide Details

Expecting pattern: ^Breakpoint (?P<bpno>[0-9]+): (?P<num_locations>no) locations \(pending\)\. Not matched

Hide Details

Expecting pattern: ^Breakpoint (?P<bpno>[0-9]+): where = (?P<module>.*)`(?P<symbol>[+\-]{0,1}[^+]+)( \+ (?P<offset>[0-9]+)){0,1}( \[inlined\] (?P<inline_symbol>.*)){0,1} at (?P<file>[^:]+):(?P<line_no>[0-9]+)(?P<column>(:[0-9]+)?), address = (?P<address>0x[0-9a-fA-F]+)$ Not matched

Hide Details

Expecting pattern: ^Breakpoint (?P<bpno>[0-9]+): where = (?P<module>.*)`(?P<symbol>.*)( \+ (?P<offset>[0-9]+)){0,1}, address = (?P<address>0x[0-9a-fA-F]+)$ Matched

Hide Details

runCmd: run output: Process 52760 stopped * thread #1, queue = 'com.apple.main-thread', stop reason = breakpoint 1.1 frame #0: 0x00007fff4e5f1708 Foundation`+[NSString stringWithFormat:] Foundation`+[NSString stringWithFormat:]: -> 0x7fff4e5f1708 <+0>: pushq %rbp 0x7fff4e5f1709 <+1>: movq %rsp, %rbp 0x7fff4e5f170c <+4>: pushq %r15 0x7fff4e5f170e <+6>: pushq %r14

Hide Details

Process 52760 launched: '/Users/buildslave/jenkins/workspace/lldb-cmake-sanitized/lldb-build/lldb-test-build.noindex/lang/objc/foundation/TestObjCMethods.test_break_dsym/a.out' (x86_64)

Hide Details

Hide Details

runCmd: thread backtrace output: * thread #1, queue = 'com.apple.main-thread', stop reason = breakpoint 1.1 * frame #0: 0x00007fff4e5f1708 Foundation`+[NSString stringWithFormat:] frame #1: 0x000000010000179b a.out`Test_NSString(program="/Users/buildslave/jenkins/workspace/lldb-cmake-sanitized/lldb-build/lldb-test-build.noindex/lang/objc/foundation/TestObjCMethods.test_break_dsym/a.out") at main.m:69:21 frame #2: 0x0000000100001b45 a.out`main(argc=1, argv=0x00007ffeefbff4a0) at main.m:132:5 frame #3: 0x00007fff793be085 libdyld.dylib`start + 1

Hide Details

Hide Details

Expecting sub string: Foundation`+[NSString stringWithFormat:] Matched

Hide Details

runCmd: process continue output: Process 52760 resuming Process 52760 stopped * thread #1, queue = 'com.apple.main-thread', stop reason = breakpoint 1.1 frame #0: 0x00007fff4e5f1708 Foundation`+[NSString stringWithFormat:] Foundation`+[NSString stringWithFormat:]: -> 0x7fff4e5f1708 <+0>: pushq %rbp 0x7fff4e5f1709 <+1>: movq %rsp, %rbp 0x7fff4e5f170c <+4>: pushq %r15 0x7fff4e5f170e <+6>: pushq %r14

Hide Details

Hide Details

Hide Details

runCmd: thread backtrace output: * thread #1, queue = 'com.apple.main-thread', stop reason = breakpoint 1.1 * frame #0: 0x00007fff4e5f1708 Foundation`+[NSString stringWithFormat:] frame #1: 0x00000001000018c9 a.out`Test_MyString(program="/Users/buildslave/jenkins/workspace/lldb-cmake-sanitized/lldb-build/lldb-test-build.noindex/lang/objc/foundation/TestObjCMethods.test_break_dsym/a.out") at main.m:94:21 frame #2: 0x0000000100001b54 a.out`main(argc=1, argv=0x00007ffeefbff4a0) at main.m:133:5 frame #3: 0x00007fff793be085 libdyld.dylib`start + 1

Hide Details

Hide Details

Expecting sub string: Foundation`+[NSString stringWithFormat:] Matched

Hide Details

runCmd: process continue output: Process 52760 resuming Process 52760 stopped * thread #1, queue = 'com.apple.main-thread', stop reason = breakpoint 2.1 frame #0: 0x00000001000014b4 a.out`-[MyString initWithNSString:](self=0x0000604000001cd0, _cmd="initWithNSString:", string=@"Hello from '/Users/buildslave/jenkins/workspace/lldb-cmake-sanitized/lldb-build/lldb-test-build.noindex/lang/objc/foundation/TestObjCMethods.test_break_dsym/a.out'") at main.m:23:16 20 21 - (id)initWithNSString:(NSString *)string 22 { -> 23 if (self = [super init]) ^ 24 { 25 str = [NSString stringWithString:string]; 26 date = [NSDate date];

Hide Details

Hide Details

Hide Details

runCmd: thread backtrace output: * thread #1, queue = 'com.apple.main-thread', stop reason = breakpoint 2.1 * frame #0: 0x00000001000014b4 a.out`-[MyString initWithNSString:](self=0x0000604000001cd0, _cmd="initWithNSString:", string=@"Hello from '/Users/buildslave/jenkins/workspace/lldb-cmake-sanitized/lldb-build/lldb-test-build.noindex/lang/objc/foundation/TestObjCMethods.test_break_dsym/a.out'") at main.m:23:16 frame #1: 0x00000001000018f0 a.out`Test_MyString(program="/Users/buildslave/jenkins/workspace/lldb-cmake-sanitized/lldb-build/lldb-test-build.noindex/lang/objc/foundation/TestObjCMethods.test_break_dsym/a.out") at main.m:95:20 frame #2: 0x0000000100001b54 a.out`main(argc=1, argv=0x00007ffeefbff4a0) at main.m:133:5 frame #3: 0x00007fff793be085 libdyld.dylib`start + 1

Hide Details

Hide Details

Expecting sub string: a.out`-[MyString initWithNSString:] Matched

Hide Details

runCmd: process continue output: Process 52760 resuming Process 52760 stopped * thread #1, queue = 'com.apple.main-thread', stop reason = breakpoint 3.1 frame #0: 0x00000001000015e0 a.out`-[MyString description](self=0x0000604000001cd0, _cmd="description") at main.m:43:7 40 { 41 // Set a breakpoint on '-[MyString description]' and test expressions: 42 // expression (char *)sel_getName(_cmd) -> 43 if (self.descriptionPauses) // Break here for description test ^ 44 { 45 printf ("\nAbout to sleep.\n"); 46 usleep(100000);

Hide Details

Hide Details

Hide Details

runCmd: thread backtrace output: * thread #1, queue = 'com.apple.main-thread', stop reason = breakpoint 3.1 * frame #0: 0x00000001000015e0 a.out`-[MyString description](self=0x0000604000001cd0, _cmd="description") at main.m:43:7 frame #1: 0x0000000100001908 a.out`Test_MyString(program="/Users/buildslave/jenkins/workspace/lldb-cmake-sanitized/lldb-build/lldb-test-build.noindex/lang/objc/foundation/TestObjCMethods.test_break_dsym/a.out") at main.m:96:37 frame #2: 0x0000000100001b54 a.out`main(argc=1, argv=0x00007ffeefbff4a0) at main.m:133:5 frame #3: 0x00007fff793be085 libdyld.dylib`start + 1

Hide Details

Hide Details

Expecting sub string: a.out`-[MyString description] Matched

Hide Details

runCmd: process continue output: Process 52760 resuming Process 52760 stopped * thread #1, queue = 'com.apple.main-thread', stop reason = breakpoint 3.1 frame #0: 0x00000001000015e0 a.out`-[MyString description](self=0x0000604000001cd0, _cmd="description") at main.m:43:7 40 { 41 // Set a breakpoint on '-[MyString description]' and test expressions: 42 // expression (char *)sel_getName(_cmd) -> 43 if (self.descriptionPauses) // Break here for description test ^ 44 { 45 printf ("\nAbout to sleep.\n"); 46 usleep(100000);

Hide Details

Hide Details

Hide Details

runCmd: thread backtrace output: * thread #1, queue = 'com.apple.main-thread', stop reason = breakpoint 3.1 * frame #0: 0x00000001000015e0 a.out`-[MyString description](self=0x0000604000001cd0, _cmd="description") at main.m:43:7 frame #1: 0x0000000100001949 a.out`Test_MyString(program="/Users/buildslave/jenkins/workspace/lldb-cmake-sanitized/lldb-build/lldb-test-build.noindex/lang/objc/foundation/TestObjCMethods.test_break_dsym/a.out") at main.m:98:37 frame #2: 0x0000000100001b54 a.out`main(argc=1, argv=0x00007ffeefbff4a0) at main.m:133:5 frame #3: 0x00007fff793be085 libdyld.dylib`start + 1

Hide Details

Hide Details

Expecting sub string: a.out`-[MyString description] Matched

Hide Details

runCmd: process continue output: Process 52760 resuming Process 52760 stopped * thread #1, queue = 'com.apple.main-thread', stop reason = breakpoint 4.1 frame #0: 0x00007fff4e5f0cee Foundation`-[NSAutoreleasePool release] Foundation`-[NSAutoreleasePool release]: -> 0x7fff4e5f0cee <+0>: pushq %rbp 0x7fff4e5f0cef <+1>: movq %rsp, %rbp 0x7fff4e5f0cf2 <+4>: pushq %r15 0x7fff4e5f0cf4 <+6>: pushq %r14

Hide Details

Hide Details

Hide Details

runCmd: thread backtrace output: * thread #1, queue = 'com.apple.main-thread', stop reason = breakpoint 4.1 * frame #0: 0x00007fff4e5f0cee Foundation`-[NSAutoreleasePool release] frame #1: 0x0000000100001ba3 a.out`main(argc=1, argv=0x00007ffeefbff4a0) at main.m:139:5 frame #2: 0x00007fff793be085 libdyld.dylib`start + 1

Hide Details

Hide Details

Expecting sub string: Foundation`-[NSAutoreleasePool release] Matched

Hide Details

<bound method SBProcess.Kill of <lldb.SBProcess; proxy of <Swig Object of type 'lldb::SBProcess *' at 0x1278c0cf0> >>: success

Hide Details

PASS: LLDB (/Users/buildslave/jenkins/workspace/lldb-cmake-sanitized/lldb-build/bin/clang-11-x86_64) :: test_break_dsym (TestObjCMethods.FoundationTestCase) runCmd: settings clear -all output:

Hide Details

runCmd: settings set symbols.enable-external-lookup false output:

Hide Details

runCmd: settings set target.auto-apply-fixits false output:

Hide Details

runCmd: settings set plugin.process.gdb-remote.packet-timeout 60 output:

Hide Details

runCmd: settings set symbols.clang-modules-cache-path "/Users/buildslave/jenkins/workspace/lldb-cmake-sanitized/lldb-build/lldb-test-build.noindex/module-cache-lldb/lldb-api" output:

Hide Details

runCmd: settings set use-color false output:

Hide Details

runCmd: setting set target.prefer-dynamic-value no-dynamic-values output:

Hide Details

runCmd: settings set target.env-vars ASAN_OPTIONS=detect_stack_use_after_return=1 DYLD_INSERT_LIBRARIES=/Users/buildslave/jenkins/workspace/lldb-cmake-sanitized/host-compiler/lib/clang/11.0.0/lib/darwin/libclang_rt.asan_osx_dynamic.dylib output:

Hide Details

runCmd: file /Users/buildslave/jenkins/workspace/lldb-cmake-sanitized/lldb-build/lldb-test-build.noindex/lang/objc/foundation/TestObjCMethods.test_break_dwarf/a.out output: Current executable set to '/Users/buildslave/jenkins/workspace/lldb-cmake-sanitized/lldb-build/lldb-test-build.noindex/lang/objc/foundation/TestObjCMethods.test_break_dwarf/a.out' (x86_64).

Hide Details

Hide Details

runCmd: _regexp-break +[NSString stringWithFormat:] output: Breakpoint 1: where = Foundation`+[NSString stringWithFormat:], address = 0x0000000000004708

Hide Details

Hide Details

Expecting pattern: ^Breakpoint (?P<bpno>[0-9]+): (?P<num_locations>[0-9]+) locations\.$ Not matched

Hide Details

Expecting pattern: ^Breakpoint (?P<bpno>[0-9]+): (?P<num_locations>no) locations \(pending\)\. Not matched

Hide Details

Expecting pattern: ^Breakpoint (?P<bpno>[0-9]+): where = (?P<module>.*)`(?P<symbol>[+\-]{0,1}[^+]+)( \+ (?P<offset>[0-9]+)){0,1}( \[inlined\] (?P<inline_symbol>.*)){0,1} at (?P<file>[^:]+):(?P<line_no>[0-9]+)(?P<column>(:[0-9]+)?), address = (?P<address>0x[0-9a-fA-F]+)$ Not matched

Hide Details

Expecting pattern: ^Breakpoint (?P<bpno>[0-9]+): where = (?P<module>.*)`(?P<symbol>.*)( \+ (?P<offset>[0-9]+)){0,1}, address = (?P<address>0x[0-9a-fA-F]+)$ Matched

Hide Details

runCmd: breakpoint set -n "-[MyString initWithNSString:]" output: Breakpoint 2: where = a.out`-[MyString initWithNSString:] + 20 at main.m:23:16, address = 0x00000001000014b4

Hide Details

Hide Details

Expecting pattern: ^Breakpoint (?P<bpno>[0-9]+): (?P<num_locations>[0-9]+) locations\.$ Not matched

Hide Details

Expecting pattern: ^Breakpoint (?P<bpno>[0-9]+): (?P<num_locations>no) locations \(pending\)\. Not matched

Hide Details

Expecting pattern: ^Breakpoint (?P<bpno>[0-9]+): where = (?P<module>.*)`(?P<symbol>[+\-]{0,1}[^+]+)( \+ (?P<offset>[0-9]+)){0,1}( \[inlined\] (?P<inline_symbol>.*)){0,1} at (?P<file>[^:]+):(?P<line_no>[0-9]+)(?P<column>(:[0-9]+)?), address = (?P<address>0x[0-9a-fA-F]+)$ Matched

Hide Details

runCmd: breakpoint set -S "description" --shlib "a.out" output: Breakpoint 3: where = a.out`-[MyString description] + 16 at main.m:43:7, address = 0x00000001000015e0

Hide Details

Hide Details

Expecting pattern: ^Breakpoint (?P<bpno>[0-9]+): (?P<num_locations>[0-9]+) locations\.$ Not matched

Hide Details

Expecting pattern: ^Breakpoint (?P<bpno>[0-9]+): (?P<num_locations>no) locations \(pending\)\. Not matched

Hide Details

Expecting pattern: ^Breakpoint (?P<bpno>[0-9]+): where = (?P<module>.*)`(?P<symbol>[+\-]{0,1}[^+]+)( \+ (?P<offset>[0-9]+)){0,1}( \[inlined\] (?P<inline_symbol>.*)){0,1} at (?P<file>[^:]+):(?P<line_no>[0-9]+)(?P<column>(:[0-9]+)?), address = (?P<address>0x[0-9a-fA-F]+)$ Matched

Hide Details

runCmd: _regexp-break -[NSAutoreleasePool release] output: Breakpoint 4: where = Foundation`-[NSAutoreleasePool release], address = 0x0000000000003cee

Hide Details

Hide Details

Expecting pattern: ^Breakpoint (?P<bpno>[0-9]+): (?P<num_locations>[0-9]+) locations\.$ Not matched

Hide Details

Expecting pattern: ^Breakpoint (?P<bpno>[0-9]+): (?P<num_locations>no) locations \(pending\)\. Not matched

Hide Details

Expecting pattern: ^Breakpoint (?P<bpno>[0-9]+): where = (?P<module>.*)`(?P<symbol>[+\-]{0,1}[^+]+)( \+ (?P<offset>[0-9]+)){0,1}( \[inlined\] (?P<inline_symbol>.*)){0,1} at (?P<file>[^:]+):(?P<line_no>[0-9]+)(?P<column>(:[0-9]+)?), address = (?P<address>0x[0-9a-fA-F]+)$ Not matched

Hide Details

Expecting pattern: ^Breakpoint (?P<bpno>[0-9]+): where = (?P<module>.*)`(?P<symbol>.*)( \+ (?P<offset>[0-9]+)){0,1}, address = (?P<address>0x[0-9a-fA-F]+)$ Matched

Hide Details

runCmd: run output: Process 53689 stopped * thread #1, queue = 'com.apple.main-thread', stop reason = breakpoint 1.1 frame #0: 0x00007fff4e5f1708 Foundation`+[NSString stringWithFormat:] Foundation`+[NSString stringWithFormat:]: -> 0x7fff4e5f1708 <+0>: pushq %rbp 0x7fff4e5f1709 <+1>: movq %rsp, %rbp 0x7fff4e5f170c <+4>: pushq %r15 0x7fff4e5f170e <+6>: pushq %r14

Hide Details

Process 53689 launched: '/Users/buildslave/jenkins/workspace/lldb-cmake-sanitized/lldb-build/lldb-test-build.noindex/lang/objc/foundation/TestObjCMethods.test_break_dwarf/a.out' (x86_64)

Hide Details

Hide Details

runCmd: thread backtrace output: * thread #1, queue = 'com.apple.main-thread', stop reason = breakpoint 1.1 * frame #0: 0x00007fff4e5f1708 Foundation`+[NSString stringWithFormat:] frame #1: 0x000000010000179b a.out`Test_NSString(program="/Users/buildslave/jenkins/workspace/lldb-cmake-sanitized/lldb-build/lldb-test-build.noindex/lang/objc/foundation/TestObjCMethods.test_break_dwarf/a.out") at main.m:69:21 frame #2: 0x0000000100001b45 a.out`main(argc=1, argv=0x00007ffeefbff4a0) at main.m:132:5 frame #3: 0x00007fff793be085 libdyld.dylib`start + 1

Hide Details

Hide Details

Expecting sub string: Foundation`+[NSString stringWithFormat:] Matched

Hide Details

runCmd: process continue output: Process 53689 resuming Process 53689 stopped * thread #1, queue = 'com.apple.main-thread', stop reason = breakpoint 1.1 frame #0: 0x00007fff4e5f1708 Foundation`+[NSString stringWithFormat:] Foundation`+[NSString stringWithFormat:]: -> 0x7fff4e5f1708 <+0>: pushq %rbp 0x7fff4e5f1709 <+1>: movq %rsp, %rbp 0x7fff4e5f170c <+4>: pushq %r15 0x7fff4e5f170e <+6>: pushq %r14

Hide Details

Hide Details

Hide Details

runCmd: thread backtrace output: * thread #1, queue = 'com.apple.main-thread', stop reason = breakpoint 1.1 * frame #0: 0x00007fff4e5f1708 Foundation`+[NSString stringWithFormat:] frame #1: 0x00000001000018c9 a.out`Test_MyString(program="/Users/buildslave/jenkins/workspace/lldb-cmake-sanitized/lldb-build/lldb-test-build.noindex/lang/objc/foundation/TestObjCMethods.test_break_dwarf/a.out") at main.m:94:21 frame #2: 0x0000000100001b54 a.out`main(argc=1, argv=0x00007ffeefbff4a0) at main.m:133:5 frame #3: 0x00007fff793be085 libdyld.dylib`start + 1

Hide Details

Hide Details

Expecting sub string: Foundation`+[NSString stringWithFormat:] Matched

Hide Details

runCmd: process continue output: Process 53689 resuming Process 53689 stopped * thread #1, queue = 'com.apple.main-thread', stop reason = breakpoint 2.1 frame #0: 0x00000001000014b4 a.out`-[MyString initWithNSString:](self=0x0000604000001cd0, _cmd="initWithNSString:", string=@"Hello from '/Users/buildslave/jenkins/workspace/lldb-cmake-sanitized/lldb-build/lldb-test-build.noindex/lang/objc/foundation/TestObjCMethods.test_break_dwarf/a.out'") at main.m:23:16 20 21 - (id)initWithNSString:(NSString *)string 22 { -> 23 if (self = [super init]) ^ 24 { 25 str = [NSString stringWithString:string]; 26 date = [NSDate date];

Hide Details

Hide Details

Hide Details

runCmd: thread backtrace output: * thread #1, queue = 'com.apple.main-thread', stop reason = breakpoint 2.1 * frame #0: 0x00000001000014b4 a.out`-[MyString initWithNSString:](self=0x0000604000001cd0, _cmd="initWithNSString:", string=@"Hello from '/Users/buildslave/jenkins/workspace/lldb-cmake-sanitized/lldb-build/lldb-test-build.noindex/lang/objc/foundation/TestObjCMethods.test_break_dwarf/a.out'") at main.m:23:16 frame #1: 0x00000001000018f0 a.out`Test_MyString(program="/Users/buildslave/jenkins/workspace/lldb-cmake-sanitized/lldb-build/lldb-test-build.noindex/lang/objc/foundation/TestObjCMethods.test_break_dwarf/a.out") at main.m:95:20 frame #2: 0x0000000100001b54 a.out`main(argc=1, argv=0x00007ffeefbff4a0) at main.m:133:5 frame #3: 0x00007fff793be085 libdyld.dylib`start + 1

Hide Details

Hide Details

Expecting sub string: a.out`-[MyString initWithNSString:] Matched

Hide Details

runCmd: process continue output: Process 53689 resuming Process 53689 stopped * thread #1, queue = 'com.apple.main-thread', stop reason = breakpoint 3.1 frame #0: 0x00000001000015e0 a.out`-[MyString description](self=0x0000604000001cd0, _cmd="description") at main.m:43:7 40 { 41 // Set a breakpoint on '-[MyString description]' and test expressions: 42 // expression (char *)sel_getName(_cmd) -> 43 if (self.descriptionPauses) // Break here for description test ^ 44 { 45 printf ("\nAbout to sleep.\n"); 46 usleep(100000);

Hide Details

Hide Details

Hide Details

runCmd: thread backtrace output: * thread #1, queue = 'com.apple.main-thread', stop reason = breakpoint 3.1 * frame #0: 0x00000001000015e0 a.out`-[MyString description](self=0x0000604000001cd0, _cmd="description") at main.m:43:7 frame #1: 0x0000000100001908 a.out`Test_MyString(program="/Users/buildslave/jenkins/workspace/lldb-cmake-sanitized/lldb-build/lldb-test-build.noindex/lang/objc/foundation/TestObjCMethods.test_break_dwarf/a.out") at main.m:96:37 frame #2: 0x0000000100001b54 a.out`main(argc=1, argv=0x00007ffeefbff4a0) at main.m:133:5 frame #3: 0x00007fff793be085 libdyld.dylib`start + 1

Hide Details

Hide Details

Expecting sub string: a.out`-[MyString description] Matched

Hide Details

runCmd: process continue output: Process 53689 resuming Process 53689 stopped * thread #1, queue = 'com.apple.main-thread', stop reason = breakpoint 3.1 frame #0: 0x00000001000015e0 a.out`-[MyString description](self=0x0000604000001cd0, _cmd="description") at main.m:43:7 40 { 41 // Set a breakpoint on '-[MyString description]' and test expressions: 42 // expression (char *)sel_getName(_cmd) -> 43 if (self.descriptionPauses) // Break here for description test ^ 44 { 45 printf ("\nAbout to sleep.\n"); 46 usleep(100000);

Hide Details

Hide Details

Hide Details

runCmd: thread backtrace output: * thread #1, queue = 'com.apple.main-thread', stop reason = breakpoint 3.1 * frame #0: 0x00000001000015e0 a.out`-[MyString description](self=0x0000604000001cd0, _cmd="description") at main.m:43:7 frame #1: 0x0000000100001949 a.out`Test_MyString(program="/Users/buildslave/jenkins/workspace/lldb-cmake-sanitized/lldb-build/lldb-test-build.noindex/lang/objc/foundation/TestObjCMethods.test_break_dwarf/a.out") at main.m:98:37 frame #2: 0x0000000100001b54 a.out`main(argc=1, argv=0x00007ffeefbff4a0) at main.m:133:5 frame #3: 0x00007fff793be085 libdyld.dylib`start + 1

Hide Details

Hide Details

Expecting sub string: a.out`-[MyString description] Matched

Hide Details

runCmd: process continue output: Process 53689 resuming Process 53689 stopped * thread #1, queue = 'com.apple.main-thread', stop reason = breakpoint 4.1 frame #0: 0x00007fff4e5f0cee Foundation`-[NSAutoreleasePool release] Foundation`-[NSAutoreleasePool release]: -> 0x7fff4e5f0cee <+0>: pushq %rbp 0x7fff4e5f0cef <+1>: movq %rsp, %rbp 0x7fff4e5f0cf2 <+4>: pushq %r15 0x7fff4e5f0cf4 <+6>: pushq %r14

Hide Details

Hide Details

Hide Details

runCmd: thread backtrace output: * thread #1, queue = 'com.apple.main-thread', stop reason = breakpoint 4.1 * frame #0: 0x00007fff4e5f0cee Foundation`-[NSAutoreleasePool release] frame #1: 0x0000000100001ba3 a.out`main(argc=1, argv=0x00007ffeefbff4a0) at main.m:139:5 frame #2: 0x00007fff793be085 libdyld.dylib`start + 1

Hide Details

Hide Details

Expecting sub string: Foundation`-[NSAutoreleasePool release] Matched

Hide Details

<bound method SBProcess.Kill of <lldb.SBProcess; proxy of <Swig Object of type 'lldb::SBProcess *' at 0x110ee61e0> >>: success

Hide Details

PASS: LLDB (/Users/buildslave/jenkins/workspace/lldb-cmake-sanitized/lldb-build/bin/clang-11-x86_64) :: test_break_dwarf (TestObjCMethods.FoundationTestCase) UNSUPPORTED: LLDB (/Users/buildslave/jenkins/workspace/lldb-cmake-sanitized/lldb-build/bin/clang-11-x86_64) :: test_break_dwo (TestObjCMethods.FoundationTestCase) (test case does not fall in any category of interest for this run) runCmd: settings clear -all output:

Hide Details

runCmd: settings set symbols.enable-external-lookup false output:

Hide Details

runCmd: settings set target.auto-apply-fixits false output:

Hide Details

runCmd: settings set plugin.process.gdb-remote.packet-timeout 60 output:

Hide Details

runCmd: settings set symbols.clang-modules-cache-path "/Users/buildslave/jenkins/workspace/lldb-cmake-sanitized/lldb-build/lldb-test-build.noindex/module-cache-lldb/lldb-api" output:

Hide Details

runCmd: settings set use-color false output:

Hide Details

runCmd: setting set target.prefer-dynamic-value no-dynamic-values output:

Hide Details

runCmd: settings set target.env-vars ASAN_OPTIONS=detect_stack_use_after_return=1 DYLD_INSERT_LIBRARIES=/Users/buildslave/jenkins/workspace/lldb-cmake-sanitized/host-compiler/lib/clang/11.0.0/lib/darwin/libclang_rt.asan_osx_dynamic.dylib output:

Hide Details

runCmd: file /Users/buildslave/jenkins/workspace/lldb-cmake-sanitized/lldb-build/lldb-test-build.noindex/lang/objc/foundation/TestObjCMethods.test_break_gmodules/a.out output: Current executable set to '/Users/buildslave/jenkins/workspace/lldb-cmake-sanitized/lldb-build/lldb-test-build.noindex/lang/objc/foundation/TestObjCMethods.test_break_gmodules/a.out' (x86_64).

Hide Details

Hide Details

runCmd: _regexp-break +[NSString stringWithFormat:] output: Breakpoint 1: where = Foundation`+[NSString stringWithFormat:], address = 0x0000000000004708

Hide Details

Hide Details

Expecting pattern: ^Breakpoint (?P<bpno>[0-9]+): (?P<num_locations>[0-9]+) locations\.$ Not matched

Hide Details

Expecting pattern: ^Breakpoint (?P<bpno>[0-9]+): (?P<num_locations>no) locations \(pending\)\. Not matched

Hide Details

Expecting pattern: ^Breakpoint (?P<bpno>[0-9]+): where = (?P<module>.*)`(?P<symbol>[+\-]{0,1}[^+]+)( \+ (?P<offset>[0-9]+)){0,1}( \[inlined\] (?P<inline_symbol>.*)){0,1} at (?P<file>[^:]+):(?P<line_no>[0-9]+)(?P<column>(:[0-9]+)?), address = (?P<address>0x[0-9a-fA-F]+)$ Not matched

Hide Details

Expecting pattern: ^Breakpoint (?P<bpno>[0-9]+): where = (?P<module>.*)`(?P<symbol>.*)( \+ (?P<offset>[0-9]+)){0,1}, address = (?P<address>0x[0-9a-fA-F]+)$ Matched

Hide Details

runCmd: breakpoint set -n "-[MyString initWithNSString:]" output: Breakpoint 2: where = a.out`-[MyString initWithNSString:] + 20 at main.m:23:16, address = 0x00000001000014b4

Hide Details

Hide Details

Expecting pattern: ^Breakpoint (?P<bpno>[0-9]+): (?P<num_locations>[0-9]+) locations\.$ Not matched

Hide Details

Expecting pattern: ^Breakpoint (?P<bpno>[0-9]+): (?P<num_locations>no) locations \(pending\)\. Not matched

Hide Details

Expecting pattern: ^Breakpoint (?P<bpno>[0-9]+): where = (?P<module>.*)`(?P<symbol>[+\-]{0,1}[^+]+)( \+ (?P<offset>[0-9]+)){0,1}( \[inlined\] (?P<inline_symbol>.*)){0,1} at (?P<file>[^:]+):(?P<line_no>[0-9]+)(?P<column>(:[0-9]+)?), address = (?P<address>0x[0-9a-fA-F]+)$ Matched

Hide Details

runCmd: breakpoint set -S "description" --shlib "a.out" output: Breakpoint 3: where = a.out`-[MyString description] + 16 at main.m:43:7, address = 0x00000001000015e0

Hide Details

Hide Details

Expecting pattern: ^Breakpoint (?P<bpno>[0-9]+): (?P<num_locations>[0-9]+) locations\.$ Not matched

Hide Details

Expecting pattern: ^Breakpoint (?P<bpno>[0-9]+): (?P<num_locations>no) locations \(pending\)\. Not matched

Hide Details

Expecting pattern: ^Breakpoint (?P<bpno>[0-9]+): where = (?P<module>.*)`(?P<symbol>[+\-]{0,1}[^+]+)( \+ (?P<offset>[0-9]+)){0,1}( \[inlined\] (?P<inline_symbol>.*)){0,1} at (?P<file>[^:]+):(?P<line_no>[0-9]+)(?P<column>(:[0-9]+)?), address = (?P<address>0x[0-9a-fA-F]+)$ Matched

Hide Details

runCmd: _regexp-break -[NSAutoreleasePool release] output: Breakpoint 4: where = Foundation`-[NSAutoreleasePool release], address = 0x0000000000003cee

Hide Details

Hide Details

Expecting pattern: ^Breakpoint (?P<bpno>[0-9]+): (?P<num_locations>[0-9]+) locations\.$ Not matched

Hide Details

Expecting pattern: ^Breakpoint (?P<bpno>[0-9]+): (?P<num_locations>no) locations \(pending\)\. Not matched

Hide Details

Expecting pattern: ^Breakpoint (?P<bpno>[0-9]+): where = (?P<module>.*)`(?P<symbol>[+\-]{0,1}[^+]+)( \+ (?P<offset>[0-9]+)){0,1}( \[inlined\] (?P<inline_symbol>.*)){0,1} at (?P<file>[^:]+):(?P<line_no>[0-9]+)(?P<column>(:[0-9]+)?), address = (?P<address>0x[0-9a-fA-F]+)$ Not matched

Hide Details

Expecting pattern: ^Breakpoint (?P<bpno>[0-9]+): where = (?P<module>.*)`(?P<symbol>.*)( \+ (?P<offset>[0-9]+)){0,1}, address = (?P<address>0x[0-9a-fA-F]+)$ Matched

Hide Details

runCmd: run output: Process 54168 stopped * thread #1, queue = 'com.apple.main-thread', stop reason = breakpoint 1.1 frame #0: 0x00007fff4e5f1708 Foundation`+[NSString stringWithFormat:] Foundation`+[NSString stringWithFormat:]: -> 0x7fff4e5f1708 <+0>: pushq %rbp 0x7fff4e5f1709 <+1>: movq %rsp, %rbp 0x7fff4e5f170c <+4>: pushq %r15 0x7fff4e5f170e <+6>: pushq %r14

Hide Details

Process 54168 launched: '/Users/buildslave/jenkins/workspace/lldb-cmake-sanitized/lldb-build/lldb-test-build.noindex/lang/objc/foundation/TestObjCMethods.test_break_gmodules/a.out' (x86_64)

Hide Details

Hide Details

runCmd: thread backtrace output: * thread #1, queue = 'com.apple.main-thread', stop reason = breakpoint 1.1 * frame #0: 0x00007fff4e5f1708 Foundation`+[NSString stringWithFormat:] frame #1: 0x000000010000179b a.out`Test_NSString(program="/Users/buildslave/jenkins/workspace/lldb-cmake-sanitized/lldb-build/lldb-test-build.noindex/lang/objc/foundation/TestObjCMethods.test_break_gmodules/a.out") at main.m:69:21 frame #2: 0x0000000100001b45 a.out`main(argc=1, argv=0x00007ffeefbff498) at main.m:132:5 frame #3: 0x00007fff793be085 libdyld.dylib`start + 1 frame #4: 0x00007fff793be085 libdyld.dylib`start + 1

Hide Details

Hide Details

Expecting sub string: Foundation`+[NSString stringWithFormat:] Matched

Hide Details

runCmd: process continue output: Process 54168 resuming Process 54168 stopped * thread #1, queue = 'com.apple.main-thread', stop reason = breakpoint 1.1 frame #0: 0x00007fff4e5f1708 Foundation`+[NSString stringWithFormat:] Foundation`+[NSString stringWithFormat:]: -> 0x7fff4e5f1708 <+0>: pushq %rbp 0x7fff4e5f1709 <+1>: movq %rsp, %rbp 0x7fff4e5f170c <+4>: pushq %r15 0x7fff4e5f170e <+6>: pushq %r14

Hide Details

Hide Details

Hide Details

runCmd: thread backtrace output: * thread #1, queue = 'com.apple.main-thread', stop reason = breakpoint 1.1 * frame #0: 0x00007fff4e5f1708 Foundation`+[NSString stringWithFormat:] frame #1: 0x00000001000018c9 a.out`Test_MyString(program="/Users/buildslave/jenkins/workspace/lldb-cmake-sanitized/lldb-build/lldb-test-build.noindex/lang/objc/foundation/TestObjCMethods.test_break_gmodules/a.out") at main.m:94:21 frame #2: 0x0000000100001b54 a.out`main(argc=1, argv=0x00007ffeefbff498) at main.m:133:5 frame #3: 0x00007fff793be085 libdyld.dylib`start + 1 frame #4: 0x00007fff793be085 libdyld.dylib`start + 1

Hide Details

Hide Details

Expecting sub string: Foundation`+[NSString stringWithFormat:] Matched

Hide Details

runCmd: process continue output: Process 54168 resuming Process 54168 stopped * thread #1, queue = 'com.apple.main-thread', stop reason = breakpoint 2.1 frame #0: 0x00000001000014b4 a.out`-[MyString initWithNSString:](self=0x0000604000001cd0, _cmd="initWithNSString:", string=@"Hello from '/Users/buildslave/jenkins/workspace/lldb-cmake-sanitized/lldb-build/lldb-test-build.noindex/lang/objc/foundation/TestObjCMethods.test_break_gmodules/a.out'") at main.m:23:16 20 21 - (id)initWithNSString:(NSString *)string 22 { -> 23 if (self = [super init]) ^ 24 { 25 str = [NSString stringWithString:string]; 26 date = [NSDate date];

Hide Details

Hide Details

Hide Details

runCmd: thread backtrace output: * thread #1, queue = 'com.apple.main-thread', stop reason = breakpoint 2.1 * frame #0: 0x00000001000014b4 a.out`-[MyString initWithNSString:](self=0x0000604000001cd0, _cmd="initWithNSString:", string=@"Hello from '/Users/buildslave/jenkins/workspace/lldb-cmake-sanitized/lldb-build/lldb-test-build.noindex/lang/objc/foundation/TestObjCMethods.test_break_gmodules/a.out'") at main.m:23:16 frame #1: 0x00000001000018f0 a.out`Test_MyString(program="/Users/buildslave/jenkins/workspace/lldb-cmake-sanitized/lldb-build/lldb-test-build.noindex/lang/objc/foundation/TestObjCMethods.test_break_gmodules/a.out") at main.m:95:20 frame #2: 0x0000000100001b54 a.out`main(argc=1, argv=0x00007ffeefbff498) at main.m:133:5 frame #3: 0x00007fff793be085 libdyld.dylib`start + 1 frame #4: 0x00007fff793be085 libdyld.dylib`start + 1

Hide Details

Hide Details

Expecting sub string: a.out`-[MyString initWithNSString:] Matched

Hide Details

runCmd: process continue output: Process 54168 resuming Process 54168 stopped * thread #1, queue = 'com.apple.main-thread', stop reason = breakpoint 3.1 frame #0: 0x00000001000015e0 a.out`-[MyString description](self=0x0000604000001cd0, _cmd="description") at main.m:43:7 40 { 41 // Set a breakpoint on '-[MyString description]' and test expressions: 42 // expression (char *)sel_getName(_cmd) -> 43 if (self.descriptionPauses) // Break here for description test ^ 44 { 45 printf ("\nAbout to sleep.\n"); 46 usleep(100000);

Hide Details

Hide Details

Hide Details

runCmd: thread backtrace output: * thread #1, queue = 'com.apple.main-thread', stop reason = breakpoint 3.1 * frame #0: 0x00000001000015e0 a.out`-[MyString description](self=0x0000604000001cd0, _cmd="description") at main.m:43:7 frame #1: 0x0000000100001908 a.out`Test_MyString(program="/Users/buildslave/jenkins/workspace/lldb-cmake-sanitized/lldb-build/lldb-test-build.noindex/lang/objc/foundation/TestObjCMethods.test_break_gmodules/a.out") at main.m:96:37 frame #2: 0x0000000100001b54 a.out`main(argc=1, argv=0x00007ffeefbff498) at main.m:133:5 frame #3: 0x00007fff793be085 libdyld.dylib`start + 1 frame #4: 0x00007fff793be085 libdyld.dylib`start + 1

Hide Details

Hide Details

Expecting sub string: a.out`-[MyString description] Matched

Hide Details

runCmd: process continue output: Process 54168 resuming Process 54168 stopped * thread #1, queue = 'com.apple.main-thread', stop reason = breakpoint 3.1 frame #0: 0x00000001000015e0 a.out`-[MyString description](self=0x0000604000001cd0, _cmd="description") at main.m:43:7 40 { 41 // Set a breakpoint on '-[MyString description]' and test expressions: 42 // expression (char *)sel_getName(_cmd) -> 43 if (self.descriptionPauses) // Break here for description test ^ 44 { 45 printf ("\nAbout to sleep.\n"); 46 usleep(100000);

Hide Details

Hide Details

Hide Details

runCmd: thread backtrace output: * thread #1, queue = 'com.apple.main-thread', stop reason = breakpoint 3.1 * frame #0: 0x00000001000015e0 a.out`-[MyString description](self=0x0000604000001cd0, _cmd="description") at main.m:43:7 frame #1: 0x0000000100001949 a.out`Test_MyString(program="/Users/buildslave/jenkins/workspace/lldb-cmake-sanitized/lldb-build/lldb-test-build.noindex/lang/objc/foundation/TestObjCMethods.test_break_gmodules/a.out") at main.m:98:37 frame #2: 0x0000000100001b54 a.out`main(argc=1, argv=0x00007ffeefbff498) at main.m:133:5 frame #3: 0x00007fff793be085 libdyld.dylib`start + 1 frame #4: 0x00007fff793be085 libdyld.dylib`start + 1

Hide Details

Hide Details

Expecting sub string: a.out`-[MyString description] Matched

Hide Details

runCmd: process continue output: Process 54168 resuming Process 54168 stopped * thread #1, queue = 'com.apple.main-thread', stop reason = breakpoint 4.1 frame #0: 0x00007fff4e5f0cee Foundation`-[NSAutoreleasePool release] Foundation`-[NSAutoreleasePool release]: -> 0x7fff4e5f0cee <+0>: pushq %rbp 0x7fff4e5f0cef <+1>: movq %rsp, %rbp 0x7fff4e5f0cf2 <+4>: pushq %r15 0x7fff4e5f0cf4 <+6>: pushq %r14

Hide Details

Hide Details

Hide Details

runCmd: thread backtrace output: * thread #1, queue = 'com.apple.main-thread', stop reason = breakpoint 4.1 * frame #0: 0x00007fff4e5f0cee Foundation`-[NSAutoreleasePool release] frame #1: 0x0000000100001ba3 a.out`main(argc=1, argv=0x00007ffeefbff498) at main.m:139:5 frame #2: 0x00007fff793be085 libdyld.dylib`start + 1 frame #3: 0x00007fff793be085 libdyld.dylib`start + 1

Hide Details

Hide Details

Expecting sub string: Foundation`-[NSAutoreleasePool release] Matched

Hide Details

<bound method SBProcess.Kill of <lldb.SBProcess; proxy of <Swig Object of type 'lldb::SBProcess *' at 0x110ed2c60> >>: success

Hide Details

PASS: LLDB (/Users/buildslave/jenkins/workspace/lldb-cmake-sanitized/lldb-build/bin/clang-11-x86_64) :: test_break_gmodules (TestObjCMethods.FoundationTestCase) runCmd: settings clear -all output:

Hide Details

runCmd: settings set symbols.enable-external-lookup false output:

Hide Details

runCmd: settings set target.auto-apply-fixits false output:

Hide Details

runCmd: settings set plugin.process.gdb-remote.packet-timeout 60 output:

Hide Details

runCmd: settings set symbols.clang-modules-cache-path "/Users/buildslave/jenkins/workspace/lldb-cmake-sanitized/lldb-build/lldb-test-build.noindex/module-cache-lldb/lldb-api" output:

Hide Details

runCmd: settings set use-color false output:

Hide Details

runCmd: setting set target.prefer-dynamic-value no-dynamic-values output:

Hide Details

runCmd: settings set target.env-vars ASAN_OPTIONS=detect_stack_use_after_return=1 DYLD_INSERT_LIBRARIES=/Users/buildslave/jenkins/workspace/lldb-cmake-sanitized/host-compiler/lib/clang/11.0.0/lib/darwin/libclang_rt.asan_osx_dynamic.dylib output:

Hide Details

runCmd: file /Users/buildslave/jenkins/workspace/lldb-cmake-sanitized/lldb-build/lldb-test-build.noindex/lang/objc/foundation/TestObjCMethods.test_data_type_and_expr_dsym/a.out output: Current executable set to '/Users/buildslave/jenkins/workspace/lldb-cmake-sanitized/lldb-build/lldb-test-build.noindex/lang/objc/foundation/TestObjCMethods.test_data_type_and_expr_dsym/a.out' (x86_64).

Hide Details

Hide Details

runCmd: breakpoint set -n "-[MyString description]" output: Breakpoint 1: where = a.out`-[MyString description] + 16 at main.m:43:7, address = 0x00000001000015e0

Hide Details

Hide Details

Expecting pattern: ^Breakpoint (?P<bpno>[0-9]+): (?P<num_locations>[0-9]+) locations\.$ Not matched

Hide Details

Expecting pattern: ^Breakpoint (?P<bpno>[0-9]+): (?P<num_locations>no) locations \(pending\)\. Not matched

Hide Details

Expecting pattern: ^Breakpoint (?P<bpno>[0-9]+): where = (?P<module>.*)`(?P<symbol>[+\-]{0,1}[^+]+)( \+ (?P<offset>[0-9]+)){0,1}( \[inlined\] (?P<inline_symbol>.*)){0,1} at (?P<file>[^:]+):(?P<line_no>[0-9]+)(?P<column>(:[0-9]+)?), address = (?P<address>0x[0-9a-fA-F]+)$ Matched

Hide Details

runCmd: run output: Process 54920 stopped * thread #1, queue = 'com.apple.main-thread', stop reason = breakpoint 1.1 frame #0: 0x00000001000015e0 a.out`-[MyString description](self=0x0000604000001cd0, _cmd="description") at main.m:43:7 40 { 41 // Set a breakpoint on '-[MyString description]' and test expressions: 42 // expression (char *)sel_getName(_cmd) -> 43 if (self.descriptionPauses) // Break here for description test ^ 44 { 45 printf ("\nAbout to sleep.\n"); 46 usleep(100000);

Hide Details

Process 54920 launched: '/Users/buildslave/jenkins/workspace/lldb-cmake-sanitized/lldb-build/lldb-test-build.noindex/lang/objc/foundation/TestObjCMethods.test_data_type_and_expr_dsym/a.out' (x86_64)

Hide Details

Hide Details

runCmd: thread backtrace output: * thread #1, queue = 'com.apple.main-thread', stop reason = breakpoint 1.1 * frame #0: 0x00000001000015e0 a.out`-[MyString description](self=0x0000604000001cd0, _cmd="description") at main.m:43:7 frame #1: 0x0000000100001908 a.out`Test_MyString(program="/Users/buildslave/jenkins/workspace/lldb-cmake-sanitized/lldb-build/lldb-test-build.noindex/lang/objc/foundation/TestObjCMethods.test_data_type_and_expr_dsym/a.out") at main.m:96:37 frame #2: 0x0000000100001b54 a.out`main(argc=1, argv=0x00007ffeefbff488) at main.m:133:5 frame #3: 0x00007fff793be085 libdyld.dylib`start + 1 frame #4: 0x00007fff793be085 libdyld.dylib`start + 1

Hide Details

Hide Details

Expecting sub string: a.out`-[MyString description] Matched

Hide Details

runCmd: image lookup -t NSString output: Best match found in /Users/buildslave/jenkins/workspace/lldb-cmake-sanitized/lldb-build/lldb-test-build.noindex/lang/objc/foundation/TestObjCMethods.test_data_type_and_expr_dsym/a.out: id = {0x7fffffff0000004d}, name = "NSString", byte-size = 8, decl = NSString.h:99, compiler_type = "@interface NSString : NSObject @property(readonly, getter = length, setter = <null selector>) NSUInteger length; @end"

Hide Details

Hide Details

Hide Details

Expecting sub string: name = "NSString" Matched

Hide Details

Expecting sub string: compiler_type = "@interface NSString Matched

Hide Details

runCmd: image lookup -t MyString output: Best match found in /Users/buildslave/jenkins/workspace/lldb-cmake-sanitized/lldb-build/lldb-test-build.noindex/lang/objc/foundation/TestObjCMethods.test_data_type_and_expr_dsym/a.out: id = {0x7fffffff000000a9}, name = "MyString", byte-size = 32, decl = main.m:5, compiler_type = "@interface MyString : MyBase{ NSString * str; NSDate * date; BOOL _desc_pauses; } @property(retain, readwrite, getter = str_property, setter = setStr_property:) NSString *str_property; @property(assign, readwrite, getter = descriptionPauses, setter = setDescriptionPauses:) BOOL descriptionPauses; @end"

Hide Details

Hide Details

Hide Details

Expecting sub string: name = "MyString" Matched

Hide Details

Expecting sub string: compiler_type = "@interface MyString Matched

Hide Details

Expecting sub string: NSString * str; Matched

Hide Details

Expecting sub string: NSDate * date; Matched

Hide Details

runCmd: frame variable --show-types --scope output: ARG: (MyString *) self = 0x0000604000001cd0 ARG: (SEL) _cmd = "description"

Hide Details

Hide Details

Expecting sub string: ARG: (MyString *) self Matched

Hide Details

Expecting pattern: ARG: \(.*\) _cmd Matched

Hide Details

Expecting pattern: (objc_selector *)|(SEL) Matched

Hide Details

runCmd: frame variable *_cmd output: (SEL) *_cmd = ""

Hide Details

Hide Details

runCmd: frame variable --show-types self->str output: (NSString *) self->str = 0x0000611000002980 @"Hello from '/Users/buildslave/jenkins/workspace/lldb-cmake-sanitized/lldb-build/lldb-test-build.noindex/lang/objc/foundation/TestObjCMethods.test_data_type_and_expr_dsym/a.out'"

Hide Details

Hide Details

Expecting start string: (NSString *) self->str Matched

Hide Details

runCmd: frame variable --show-types self->date output: (NSDate *) self->date = 0x00006020000024d0 2020-05-31 01:01:09 UTC

Hide Details

Hide Details

Expecting start string: (NSDate *) self->date Matched

Hide Details

runCmd: frame variable --show-types *self output: (MyString) *self = { (MyBase) MyBase = { (NSObject) NSObject = { (Class) isa = MyString } (int) propertyMovesThings = 0 } (NSString *) str = 0x0000611000002980 @"Hello from '/Users/buildslave/jenkins/workspace/lldb-cmake-sanitized/lldb-build/lldb-test-build.noindex/lang/objc/foundation/TestObjCMethods.test_data_type_and_expr_dsym/a.out'" (NSDate *) date = 0x00006020000024d0 2020-05-31 01:01:09 UTC (BOOL) _desc_pauses = NO }

Hide Details

Hide Details

Expecting sub string: (MyString) *self Matched

Hide Details

Expecting sub string: (NSString *) str Matched

Hide Details

Expecting sub string: (NSDate *) date Matched

Hide Details

runCmd: expression self->isa output: (Class) $0 = MyString

Hide Details

Hide Details

Expecting sub string: Class) Matched

Hide Details

runCmd: expression self->non_existent_member check of return status not required runCmd failed! error: <user expression 1>:1:7: 'MyString' does not have a member named 'non_existent_member' self->non_existent_member ~~~~ ^

Hide Details

Hide Details

Expecting sub string: error: Matched

Hide Details

Expecting sub string: 'MyString' does not have a member named 'non_existent_member' Matched

Hide Details

runCmd: expression self->str output: (NSString *) $1 = 0x0000611000002980 @"Hello from '/Users/buildslave/jenkins/workspace/lldb-cmake-sanitized/lldb-build/lldb-test-build.noindex/lang/objc/foundation/TestObjCMethods.test_data_type_and_expr_dsym/a.out'"

Hide Details

Hide Details

runCmd: expression self->date output: (NSDate *) $2 = 0x00006020000024d0 2020-05-31 01:01:09 UTC

Hide Details

Hide Details

runCmd: breakpoint delete 1 output: 1 breakpoints deleted; 0 breakpoint locations disabled.

Hide Details

Hide Details

runCmd: breakpoint set -f "main.m" -l 97 output: Breakpoint 2: where = a.out`Test_MyString + 156 at main.m:97:5, address = 0x000000010000191c

Hide Details

Hide Details

Expecting pattern: ^Breakpoint (?P<bpno>[0-9]+): (?P<num_locations>[0-9]+) locations\.$ Not matched

Hide Details

Expecting pattern: ^Breakpoint (?P<bpno>[0-9]+): (?P<num_locations>no) locations \(pending\)\. Not matched

Hide Details

Expecting pattern: ^Breakpoint (?P<bpno>[0-9]+): where = (?P<module>.*)`(?P<symbol>[+\-]{0,1}[^+]+)( \+ (?P<offset>[0-9]+)){0,1}( \[inlined\] (?P<inline_symbol>.*)){0,1} at (?P<file>[^:]+):(?P<line_no>[0-9]+)(?P<column>(:[0-9]+)?), address = (?P<address>0x[0-9a-fA-F]+)$ Matched

Hide Details

runCmd: process continue output: Process 54920 resuming Process 54920 stopped * thread #1, queue = 'com.apple.main-thread', stop reason = breakpoint 2.1 frame #0: 0x000000010000191c a.out`Test_MyString(program="/Users/buildslave/jenkins/workspace/lldb-cmake-sanitized/lldb-build/lldb-test-build.noindex/lang/objc/foundation/TestObjCMethods.test_data_type_and_expr_dsym/a.out") at main.m:97:5 94 NSString *str = [NSString stringWithFormat:@"Hello from '%s'", program]; 95 MyString *my = [[MyString alloc] initWithNSString:str]; 96 NSLog(@"MyString instance: %@", [my description]); -> 97 my.descriptionPauses = YES; // Set break point at this line. Test 'expression -o -- my'. ^ 98 NSLog(@"MyString instance: %@", [my description]); 99 } 100

Hide Details

Hide Details

Hide Details

runCmd: expression --object-description -- my output: Hello from '/Users/buildslave/jenkins/workspace/lldb-cmake-sanitized/lldb-build/lldb-test-build.noindex/lang/objc/foundation/TestObjCMethods.test_data_type_and_expr_dsym/a.out' with timestamp: 2020-05-31 01:01:09 +0000

Hide Details

Hide Details

Hide Details

Expecting pattern: Hello from.*a.out.*with timestamp: Matched

Hide Details

<bound method SBProcess.Kill of <lldb.SBProcess; proxy of <Swig Object of type 'lldb::SBProcess *' at 0x110ee61b0> >>: success

Hide Details

PASS: LLDB (/Users/buildslave/jenkins/workspace/lldb-cmake-sanitized/lldb-build/bin/clang-11-x86_64) :: test_data_type_and_expr_dsym (TestObjCMethods.FoundationTestCase) runCmd: settings clear -all output:

Hide Details

runCmd: settings set symbols.enable-external-lookup false output:

Hide Details

runCmd: settings set target.auto-apply-fixits false output:

Hide Details

runCmd: settings set plugin.process.gdb-remote.packet-timeout 60 output:

Hide Details

runCmd: settings set symbols.clang-modules-cache-path "/Users/buildslave/jenkins/workspace/lldb-cmake-sanitized/lldb-build/lldb-test-build.noindex/module-cache-lldb/lldb-api" output:

Hide Details

runCmd: settings set use-color false output:

Hide Details

runCmd: setting set target.prefer-dynamic-value no-dynamic-values output:

Hide Details

runCmd: settings set target.env-vars ASAN_OPTIONS=detect_stack_use_after_return=1 DYLD_INSERT_LIBRARIES=/Users/buildslave/jenkins/workspace/lldb-cmake-sanitized/host-compiler/lib/clang/11.0.0/lib/darwin/libclang_rt.asan_osx_dynamic.dylib output:

Hide Details

runCmd: file /Users/buildslave/jenkins/workspace/lldb-cmake-sanitized/lldb-build/lldb-test-build.noindex/lang/objc/foundation/TestObjCMethods.test_data_type_and_expr_dwarf/a.out output: Current executable set to '/Users/buildslave/jenkins/workspace/lldb-cmake-sanitized/lldb-build/lldb-test-build.noindex/lang/objc/foundation/TestObjCMethods.test_data_type_and_expr_dwarf/a.out' (x86_64).

Hide Details

Hide Details

runCmd: breakpoint set -n "-[MyString description]" output: Breakpoint 1: where = a.out`-[MyString description] + 16 at main.m:43:7, address = 0x00000001000015e0

Hide Details

Hide Details

Expecting pattern: ^Breakpoint (?P<bpno>[0-9]+): (?P<num_locations>[0-9]+) locations\.$ Not matched

Hide Details

Expecting pattern: ^Breakpoint (?P<bpno>[0-9]+): (?P<num_locations>no) locations \(pending\)\. Not matched

Hide Details

Expecting pattern: ^Breakpoint (?P<bpno>[0-9]+): where = (?P<module>.*)`(?P<symbol>[+\-]{0,1}[^+]+)( \+ (?P<offset>[0-9]+)){0,1}( \[inlined\] (?P<inline_symbol>.*)){0,1} at (?P<file>[^:]+):(?P<line_no>[0-9]+)(?P<column>(:[0-9]+)?), address = (?P<address>0x[0-9a-fA-F]+)$ Matched

Hide Details

runCmd: run output: Process 55423 stopped * thread #1, queue = 'com.apple.main-thread', stop reason = breakpoint 1.1 frame #0: 0x00000001000015e0 a.out`-[MyString description](self=0x0000604000001cd0, _cmd="description") at main.m:43:7 40 { 41 // Set a breakpoint on '-[MyString description]' and test expressions: 42 // expression (char *)sel_getName(_cmd) -> 43 if (self.descriptionPauses) // Break here for description test ^ 44 { 45 printf ("\nAbout to sleep.\n"); 46 usleep(100000);

Hide Details

Process 55423 launched: '/Users/buildslave/jenkins/workspace/lldb-cmake-sanitized/lldb-build/lldb-test-build.noindex/lang/objc/foundation/TestObjCMethods.test_data_type_and_expr_dwarf/a.out' (x86_64)

Hide Details

Hide Details

runCmd: thread backtrace output: * thread #1, queue = 'com.apple.main-thread', stop reason = breakpoint 1.1 * frame #0: 0x00000001000015e0 a.out`-[MyString description](self=0x0000604000001cd0, _cmd="description") at main.m:43:7 frame #1: 0x0000000100001908 a.out`Test_MyString(program="/Users/buildslave/jenkins/workspace/lldb-cmake-sanitized/lldb-build/lldb-test-build.noindex/lang/objc/foundation/TestObjCMethods.test_data_type_and_expr_dwarf/a.out") at main.m:96:37 frame #2: 0x0000000100001b54 a.out`main(argc=1, argv=0x00007ffeefbff480) at main.m:133:5 frame #3: 0x00007fff793be085 libdyld.dylib`start + 1

Hide Details

Hide Details

Expecting sub string: a.out`-[MyString description] Matched

Hide Details

runCmd: image lookup -t NSString output: Best match found in /Users/buildslave/jenkins/workspace/lldb-cmake-sanitized/lldb-build/lldb-test-build.noindex/lang/objc/foundation/TestObjCMethods.test_data_type_and_expr_dwarf/a.out: id = {0x10000004d}, name = "NSString", byte-size = 8, decl = NSString.h:99, compiler_type = "@interface NSString : NSObject @property(readonly, getter = length, setter = <null selector>) NSUInteger length; @end"

Hide Details

Hide Details

Assertion failed: (tokenKind == tok::kw___bridge_retain), function ParseParenExpression, file /Users/buildslave/jenkins/workspace/lldb-cmake-sanitized/llvm-project/clang/lib/Parse/ParseExpr.cpp, line 2804.

Hide Details

--

Hide Details

******************** PASS: lldb-unit :: Utility/./UtilityTests/ArgsTest.DoubleQuotedItem (1622 of 2028) PASS: lldb-shell :: Unwind/trap_frame_sym_ctx.test (1623 of 2028) PASS: lldb-api :: commands/frame/language/TestGuessLanguage.py (1624 of 2028) PASS: lldb-api :: commands/expression/result_numbering/TestResultNumbering.py (1625 of 2028) PASS: lldb-unit :: Utility/./UtilityTests/StringListTest.AppendListCStringArrayEmpty (1626 of 2028) UNSUPPORTED: lldb-api :: lang/cpp/printf/TestPrintf.py (1627 of 2028) PASS: lldb-unit :: Utility/./UtilityTests/StringLexerTest.HasAtLeast (1628 of 2028) PASS: lldb-unit :: Utility/./UtilityTests/XcodeSDKTest.SDKSupportsSwift (1629 of 2028) PASS: lldb-shell :: Reproducer/TestReuseDirectory.test (1630 of 2028) PASS: lldb-shell :: Breakpoint/jitbp_elf.test (1631 of 2028) PASS: lldb-shell :: ObjectFile/ELF/aarch64-relocations.yaml (1632 of 2028) PASS: lldb-shell :: SymbolFile/DWARF/find-method-local-struct.cpp (1633 of 2028) FAIL: lldb-api :: lang/objc/objc-new-syntax/TestObjCNewSyntaxArray.py (1634 of 2028) ******************** TEST 'lldb-api :: lang/objc/objc-new-syntax/TestObjCNewSyntaxArray.py' FAILED ******************** Script: -- /Users/buildslave/jenkins/workspace/lldb-cmake-sanitized/lldb-build/lldb-test-build.noindex/copied-system-python /Users/buildslave/jenkins/workspace/lldb-cmake-sanitized/llvm-project/lldb/test/API/dotest.py --arch x86_64 -s /Users/buildslave/jenkins/workspace/lldb-cmake-sanitized/lldb-build/lldb-test-traces -S nm -u CXXFLAGS -u CFLAGS --codesign-identity lldb_codesign --server /Users/buildslave/jenkins/workspace/lldb-cmake-sanitized/lldb-build/./bin/debugserver --arch x86_64 --build-dir /Users/buildslave/jenkins/workspace/lldb-cmake-sanitized/lldb-build/lldb-test-build.noindex -s=/Users/buildslave/jenkins/workspace/lldb-cmake-sanitized/test/logs -t --env TERM=vt100 --env LLVM_LIBS_DIR=/Users/buildslave/jenkins/workspace/lldb-cmake-sanitized/lldb-build/./lib --inferior-env ASAN_OPTIONS=detect_stack_use_after_return=1 --inferior-env DYLD_INSERT_LIBRARIES=/Users/buildslave/jenkins/workspace/lldb-cmake-sanitized/host-compiler/lib/clang/11.0.0/lib/darwin/libclang_rt.asan_osx_dynamic.dylib --build-dir /Users/buildslave/jenkins/workspace/lldb-cmake-sanitized/lldb-build/lldb-test-build.noindex --lldb-module-cache-dir /Users/buildslave/jenkins/workspace/lldb-cmake-sanitized/lldb-build/lldb-test-build.noindex/module-cache-lldb/lldb-api --clang-module-cache-dir /Users/buildslave/jenkins/workspace/lldb-cmake-sanitized/lldb-build/lldb-test-build.noindex/module-cache-clang/lldb-api --executable /Users/buildslave/jenkins/workspace/lldb-cmake-sanitized/lldb-build/./bin/lldb --compiler /Users/buildslave/jenkins/workspace/lldb-cmake-sanitized/lldb-build/./bin/clang --dsymutil /Users/buildslave/jenkins/workspace/lldb-cmake-sanitized/lldb-build/./bin/dsymutil --filecheck /Users/buildslave/jenkins/workspace/lldb-cmake-sanitized/lldb-build/./bin/FileCheck --lldb-libs-dir /Users/buildslave/jenkins/workspace/lldb-cmake-sanitized/lldb-build/./lib /Users/buildslave/jenkins/workspace/lldb-cmake-sanitized/llvm-project/lldb/test/API/lang/objc/objc-new-syntax -p TestObjCNewSyntaxArray.py -- Exit Code: -6

Hide Details

Command Output (stdout): -- lldb version 11.0.99 clang revision 07e8a780d81bb58a0c7bd4da6cc0b9beaec3c788 llvm revision 07e8a780d81bb58a0c7bd4da6cc0b9beaec3c788

Hide Details

-- Command Output (stderr): -- Assertion failed: (tokenKind == tok::kw___bridge_retain), function ParseParenExpression, file /Users/buildslave/jenkins/workspace/lldb-cmake-sanitized/llvm-project/clang/lib/Parse/ParseExpr.cpp, line 2804.

Hide Details

--

Hide Details

******************** PASS: lldb-unit :: Utility/./UtilityTests/FileSpecTest.IsRelative (1635 of 2028) PASS: lldb-api :: types/TestCharType.py (1636 of 2028) UNSUPPORTED: lldb-shell :: Unwind/eh-frame-small-fde.test (1637 of 2028) PASS: lldb-api :: functionalities/data-formatter/parray/TestPrintArray.py (1638 of 2028) PASS: lldb-api :: lang/cpp/this/TestCPPThis.py (1639 of 2028) PASS: lldb-api :: macosx/dyld-trie-symbols/TestDyldTrieSymbols.py (1640 of 2028) FAIL: lldb-api :: lang/objc/objc++/TestObjCXX.py (1641 of 2028) ******************** TEST 'lldb-api :: lang/objc/objc++/TestObjCXX.py' FAILED ******************** Script: -- /Users/buildslave/jenkins/workspace/lldb-cmake-sanitized/lldb-build/lldb-test-build.noindex/copied-system-python /Users/buildslave/jenkins/workspace/lldb-cmake-sanitized/llvm-project/lldb/test/API/dotest.py --arch x86_64 -s /Users/buildslave/jenkins/workspace/lldb-cmake-sanitized/lldb-build/lldb-test-traces -S nm -u CXXFLAGS -u CFLAGS --codesign-identity lldb_codesign --server /Users/buildslave/jenkins/workspace/lldb-cmake-sanitized/lldb-build/./bin/debugserver --arch x86_64 --build-dir /Users/buildslave/jenkins/workspace/lldb-cmake-sanitized/lldb-build/lldb-test-build.noindex -s=/Users/buildslave/jenkins/workspace/lldb-cmake-sanitized/test/logs -t --env TERM=vt100 --env LLVM_LIBS_DIR=/Users/buildslave/jenkins/workspace/lldb-cmake-sanitized/lldb-build/./lib --inferior-env ASAN_OPTIONS=detect_stack_use_after_return=1 --inferior-env DYLD_INSERT_LIBRARIES=/Users/buildslave/jenkins/workspace/lldb-cmake-sanitized/host-compiler/lib/clang/11.0.0/lib/darwin/libclang_rt.asan_osx_dynamic.dylib --build-dir /Users/buildslave/jenkins/workspace/lldb-cmake-sanitized/lldb-build/lldb-test-build.noindex --lldb-module-cache-dir /Users/buildslave/jenkins/workspace/lldb-cmake-sanitized/lldb-build/lldb-test-build.noindex/module-cache-lldb/lldb-api --clang-module-cache-dir /Users/buildslave/jenkins/workspace/lldb-cmake-sanitized/lldb-build/lldb-test-build.noindex/module-cache-clang/lldb-api --executable /Users/buildslave/jenkins/workspace/lldb-cmake-sanitized/lldb-build/./bin/lldb --compiler /Users/buildslave/jenkins/workspace/lldb-cmake-sanitized/lldb-build/./bin/clang --dsymutil /Users/buildslave/jenkins/workspace/lldb-cmake-sanitized/lldb-build/./bin/dsymutil --filecheck /Users/buildslave/jenkins/workspace/lldb-cmake-sanitized/lldb-build/./bin/FileCheck --lldb-libs-dir /Users/buildslave/jenkins/workspace/lldb-cmake-sanitized/lldb-build/./lib /Users/buildslave/jenkins/workspace/lldb-cmake-sanitized/llvm-project/lldb/test/API/lang/objc/objc++ -p TestObjCXX.py -- Exit Code: -6

Hide Details

Command Output (stdout): -- lldb version 11.0.99 clang revision 07e8a780d81bb58a0c7bd4da6cc0b9beaec3c788 llvm revision 07e8a780d81bb58a0c7bd4da6cc0b9beaec3c788

Hide Details

-- Command Output (stderr): -- Assertion failed: (tokenKind == tok::kw___bridge_retain), function ParseParenExpression, file /Users/buildslave/jenkins/workspace/lldb-cmake-sanitized/llvm-project/clang/lib/Parse/ParseExpr.cpp, line 2804.

Hide Details

--

Hide Details

******************** PASS: lldb-unit :: Utility/./UtilityTests/DataExtractorTest.GetCStrAtEnd (1642 of 2028) PASS: lldb-shell :: SymbolFile/Breakpad/unwind-via-stack-win-no-memory-info.yaml (1643 of 2028) PASS: lldb-unit :: Utility/./UtilityTests/RangeTest.Copy (1644 of 2028) PASS: lldb-unit :: Symbol/./SymbolTests/TestTypeSystemClang.TestGetEnumIntegerTypeInvalid (1645 of 2028) PASS: lldb-api :: lang/cpp/typedef/TestCppTypedef.py (1646 of 2028) PASS: lldb-unit :: Utility/./UtilityTests/ConstStringTest.format_provider (1647 of 2028) PASS: lldb-unit :: UnwindAssembly/x86/./UnwindAssemblyx86Tests/Testx86AssemblyInspectionEngine.TestPopESI (1648 of 2028) PASS: lldb-unit :: UnwindAssembly/x86/./UnwindAssemblyx86Tests/Testx86AssemblyInspectionEngine.Test64bitFramelessSmallStackFrame (1649 of 2028) PASS: lldb-api :: functionalities/data-formatter/data-formatter-stl/libcxx/map/TestDataFormatterLibccMap.py (1650 of 2028) FAIL: lldb-api :: lang/objc/objc-property/TestObjCProperty.py (1651 of 2028) ******************** TEST 'lldb-api :: lang/objc/objc-property/TestObjCProperty.py' FAILED ******************** Script: -- /Users/buildslave/jenkins/workspace/lldb-cmake-sanitized/lldb-build/lldb-test-build.noindex/copied-system-python /Users/buildslave/jenkins/workspace/lldb-cmake-sanitized/llvm-project/lldb/test/API/dotest.py --arch x86_64 -s /Users/buildslave/jenkins/workspace/lldb-cmake-sanitized/lldb-build/lldb-test-traces -S nm -u CXXFLAGS -u CFLAGS --codesign-identity lldb_codesign --server /Users/buildslave/jenkins/workspace/lldb-cmake-sanitized/lldb-build/./bin/debugserver --arch x86_64 --build-dir /Users/buildslave/jenkins/workspace/lldb-cmake-sanitized/lldb-build/lldb-test-build.noindex -s=/Users/buildslave/jenkins/workspace/lldb-cmake-sanitized/test/logs -t --env TERM=vt100 --env LLVM_LIBS_DIR=/Users/buildslave/jenkins/workspace/lldb-cmake-sanitized/lldb-build/./lib --inferior-env ASAN_OPTIONS=detect_stack_use_after_return=1 --inferior-env DYLD_INSERT_LIBRARIES=/Users/buildslave/jenkins/workspace/lldb-cmake-sanitized/host-compiler/lib/clang/11.0.0/lib/darwin/libclang_rt.asan_osx_dynamic.dylib --build-dir /Users/buildslave/jenkins/workspace/lldb-cmake-sanitized/lldb-build/lldb-test-build.noindex --lldb-module-cache-dir /Users/buildslave/jenkins/workspace/lldb-cmake-sanitized/lldb-build/lldb-test-build.noindex/module-cache-lldb/lldb-api --clang-module-cache-dir /Users/buildslave/jenkins/workspace/lldb-cmake-sanitized/lldb-build/lldb-test-build.noindex/module-cache-clang/lldb-api --executable /Users/buildslave/jenkins/workspace/lldb-cmake-sanitized/lldb-build/./bin/lldb --compiler /Users/buildslave/jenkins/workspace/lldb-cmake-sanitized/lldb-build/./bin/clang --dsymutil /Users/buildslave/jenkins/workspace/lldb-cmake-sanitized/lldb-build/./bin/dsymutil --filecheck /Users/buildslave/jenkins/workspace/lldb-cmake-sanitized/lldb-build/./bin/FileCheck --lldb-libs-dir /Users/buildslave/jenkins/workspace/lldb-cmake-sanitized/lldb-build/./lib /Users/buildslave/jenkins/workspace/lldb-cmake-sanitized/llvm-project/lldb/test/API/lang/objc/objc-property -p TestObjCProperty.py -- Exit Code: -6

Hide Details

Command Output (stdout): -- lldb version 11.0.99 clang revision 07e8a780d81bb58a0c7bd4da6cc0b9beaec3c788 llvm revision 07e8a780d81bb58a0c7bd4da6cc0b9beaec3c788

Hide Details

-- Command Output (stderr): -- Assertion failed: (tokenKind == tok::kw___bridge_retain), function ParseParenExpression, file /Users/buildslave/jenkins/workspace/lldb-cmake-sanitized/llvm-project/clang/lib/Parse/ParseExpr.cpp, line 2804.

Hide Details

--

Hide Details

******************** PASS: lldb-api :: commands/expression/static-initializers/TestStaticInitializers.py (1652 of 2028) PASS: lldb-api :: functionalities/thread/num_threads/TestNumThreads.py (1653 of 2028) PASS: lldb-shell :: Commands/command-disassemble-process.yaml (1654 of 2028) PASS: lldb-shell :: BuildScript/modes.test (1655 of 2028) PASS: lldb-unit :: ScriptInterpreter/Python/./ScriptInterpreterPythonTests/PythonDataObjectsTest.TestTypeNameResolutionNoDot (1656 of 2028) PASS: lldb-unit :: Host/./HostTests/SocketTest.UDPConnect (1657 of 2028) PASS: lldb-api :: functionalities/breakpoint/breakpoint_ignore_count/TestBreakpointIgnoreCount.py (1658 of 2028) PASS: lldb-unit :: Host/./HostTests/FileSystemTest.GetPermissions (1659 of 2028) PASS: lldb-unit :: Utility/./UtilityTests/CompletionRequest.Constructor (1660 of 2028) UNSUPPORTED: lldb-api :: functionalities/tsan/cpp_global_location/TestTsanCPPGlobalLocation.py (1661 of 2028) PASS: lldb-unit :: Utility/./UtilityTests/SerializationRountripTest.SerializeDeserializeCStringArrayNullptrElem (1662 of 2028) PASS: lldb-unit :: Utility/./UtilityTests/LogChannelTest.List (1663 of 2028) PASS: lldb-api :: types/TestFloatTypesExpr.py (1664 of 2028) UNSUPPORTED: lldb-api :: functionalities/process_save_core/TestProcessSaveCore.py (1665 of 2028) PASS: lldb-unit :: Utility/./UtilityTests/StreamTest.AddressRangeSize (1666 of 2028) PASS: lldb-unit :: Utility/./UtilityTests/ScalarTest.CastOperations (1667 of 2028) PASS: lldb-api :: lang/objc/modules-cache/TestClangModulesCache.py (1668 of 2028) PASS: lldb-unit :: Utility/./UtilityTests/StringExtractorTest.GetHexBytesAvail (1669 of 2028) PASS: lldb-api :: tools/lldb-vscode/coreFile/TestVSCode_coreFile.py (1670 of 2028) FAIL: lldb-api :: lang/objc/variadic_methods/TestVariadicMethods.py (1671 of 2028) ******************** TEST 'lldb-api :: lang/objc/variadic_methods/TestVariadicMethods.py' FAILED ******************** Script: -- /Users/buildslave/jenkins/workspace/lldb-cmake-sanitized/lldb-build/lldb-test-build.noindex/copied-system-python /Users/buildslave/jenkins/workspace/lldb-cmake-sanitized/llvm-project/lldb/test/API/dotest.py --arch x86_64 -s /Users/buildslave/jenkins/workspace/lldb-cmake-sanitized/lldb-build/lldb-test-traces -S nm -u CXXFLAGS -u CFLAGS --codesign-identity lldb_codesign --server /Users/buildslave/jenkins/workspace/lldb-cmake-sanitized/lldb-build/./bin/debugserver --arch x86_64 --build-dir /Users/buildslave/jenkins/workspace/lldb-cmake-sanitized/lldb-build/lldb-test-build.noindex -s=/Users/buildslave/jenkins/workspace/lldb-cmake-sanitized/test/logs -t --env TERM=vt100 --env LLVM_LIBS_DIR=/Users/buildslave/jenkins/workspace/lldb-cmake-sanitized/lldb-build/./lib --inferior-env ASAN_OPTIONS=detect_stack_use_after_return=1 --inferior-env DYLD_INSERT_LIBRARIES=/Users/buildslave/jenkins/workspace/lldb-cmake-sanitized/host-compiler/lib/clang/11.0.0/lib/darwin/libclang_rt.asan_osx_dynamic.dylib --build-dir /Users/buildslave/jenkins/workspace/lldb-cmake-sanitized/lldb-build/lldb-test-build.noindex --lldb-module-cache-dir /Users/buildslave/jenkins/workspace/lldb-cmake-sanitized/lldb-build/lldb-test-build.noindex/module-cache-lldb/lldb-api --clang-module-cache-dir /Users/buildslave/jenkins/workspace/lldb-cmake-sanitized/lldb-build/lldb-test-build.noindex/module-cache-clang/lldb-api --executable /Users/buildslave/jenkins/workspace/lldb-cmake-sanitized/lldb-build/./bin/lldb --compiler /Users/buildslave/jenkins/workspace/lldb-cmake-sanitized/lldb-build/./bin/clang --dsymutil /Users/buildslave/jenkins/workspace/lldb-cmake-sanitized/lldb-build/./bin/dsymutil --filecheck /Users/buildslave/jenkins/workspace/lldb-cmake-sanitized/lldb-build/./bin/FileCheck --lldb-libs-dir /Users/buildslave/jenkins/workspace/lldb-cmake-sanitized/lldb-build/./lib /Users/buildslave/jenkins/workspace/lldb-cmake-sanitized/llvm-project/lldb/test/API/lang/objc/variadic_methods -p TestVariadicMethods.py -- Exit Code: -6

Hide Details

Command Output (stdout): -- lldb version 11.0.99 clang revision 07e8a780d81bb58a0c7bd4da6cc0b9beaec3c788 llvm revision 07e8a780d81bb58a0c7bd4da6cc0b9beaec3c788

Hide Details

-- Command Output (stderr): -- Assertion failed: (tokenKind == tok::kw___bridge_retain), function ParseParenExpression, file /Users/buildslave/jenkins/workspace/lldb-cmake-sanitized/llvm-project/clang/lib/Parse/ParseExpr.cpp, line 2804.

Hide Details

--

Hide Details

******************** PASS: lldb-api :: tools/lldb-server/TestGdbRemoteAttach.py (1672 of 2028) PASS: lldb-unit :: ScriptInterpreter/Python/./ScriptInterpreterPythonTests/PythonDataObjectsTest.TestScript (1673 of 2028) PASS: lldb-api :: commands/frame/diagnose/complicated-expression/TestComplicatedExpression.py (1674 of 2028) PASS: lldb-api :: functionalities/type_completion/TestTypeCompletion.py (1675 of 2028) PASS: lldb-unit :: Utility/./UtilityTests/StringExtractorTest.GetHexBytes (1676 of 2028) FAIL: lldb-api :: commands/expression/import_builtin_fileid/TestImportBuiltinFileID.py (1677 of 2028) ******************** TEST 'lldb-api :: commands/expression/import_builtin_fileid/TestImportBuiltinFileID.py' FAILED ******************** Script: -- /Users/buildslave/jenkins/workspace/lldb-cmake-sanitized/lldb-build/lldb-test-build.noindex/copied-system-python /Users/buildslave/jenkins/workspace/lldb-cmake-sanitized/llvm-project/lldb/test/API/dotest.py --arch x86_64 -s /Users/buildslave/jenkins/workspace/lldb-cmake-sanitized/lldb-build/lldb-test-traces -S nm -u CXXFLAGS -u CFLAGS --codesign-identity lldb_codesign --server /Users/buildslave/jenkins/workspace/lldb-cmake-sanitized/lldb-build/./bin/debugserver --arch x86_64 --build-dir /Users/buildslave/jenkins/workspace/lldb-cmake-sanitized/lldb-build/lldb-test-build.noindex -s=/Users/buildslave/jenkins/workspace/lldb-cmake-sanitized/test/logs -t --env TERM=vt100 --env LLVM_LIBS_DIR=/Users/buildslave/jenkins/workspace/lldb-cmake-sanitized/lldb-build/./lib --inferior-env ASAN_OPTIONS=detect_stack_use_after_return=1 --inferior-env DYLD_INSERT_LIBRARIES=/Users/buildslave/jenkins/workspace/lldb-cmake-sanitized/host-compiler/lib/clang/11.0.0/lib/darwin/libclang_rt.asan_osx_dynamic.dylib --build-dir /Users/buildslave/jenkins/workspace/lldb-cmake-sanitized/lldb-build/lldb-test-build.noindex --lldb-module-cache-dir /Users/buildslave/jenkins/workspace/lldb-cmake-sanitized/lldb-build/lldb-test-build.noindex/module-cache-lldb/lldb-api --clang-module-cache-dir /Users/buildslave/jenkins/workspace/lldb-cmake-sanitized/lldb-build/lldb-test-build.noindex/module-cache-clang/lldb-api --executable /Users/buildslave/jenkins/workspace/lldb-cmake-sanitized/lldb-build/./bin/lldb --compiler /Users/buildslave/jenkins/workspace/lldb-cmake-sanitized/lldb-build/./bin/clang --dsymutil /Users/buildslave/jenkins/workspace/lldb-cmake-sanitized/lldb-build/./bin/dsymutil --filecheck /Users/buildslave/jenkins/workspace/lldb-cmake-sanitized/lldb-build/./bin/FileCheck --lldb-libs-dir /Users/buildslave/jenkins/workspace/lldb-cmake-sanitized/lldb-build/./lib /Users/buildslave/jenkins/workspace/lldb-cmake-sanitized/llvm-project/lldb/test/API/commands/expression/import_builtin_fileid -p TestImportBuiltinFileID.py -- Exit Code: -6

Hide Details

Command Output (stdout): -- lldb version 11.0.99 clang revision 07e8a780d81bb58a0c7bd4da6cc0b9beaec3c788 llvm revision 07e8a780d81bb58a0c7bd4da6cc0b9beaec3c788

Hide Details

-- Command Output (stderr): -- Assertion failed: (tokenKind == tok::kw___bridge_retain), function ParseParenExpression, file /Users/buildslave/jenkins/workspace/lldb-cmake-sanitized/llvm-project/clang/lib/Parse/ParseExpr.cpp, line 2804.

Hide Details

--

Hide Details

******************** PASS: lldb-unit :: Utility/./UtilityTests/PassiveReplayTest.InstrumentedBar (1678 of 2028) PASS: lldb-unit :: ScriptInterpreter/Python/./ScriptInterpreterPythonTests/PythonDataObjectsTest.TestPythonBoolean (1679 of 2028) PASS: lldb-shell :: Quit/TestQuitExitCode30.test (1680 of 2028) PASS: lldb-api :: commands/watchpoints/watchpoint_disable/TestWatchpointDisable.py (1681 of 2028) PASS: lldb-unit :: Utility/./UtilityTests/UriParserTest.SchemeHostSeparator3 (1682 of 2028) PASS: lldb-api :: lang/cpp/namespace_conflicts/TestNamespaceConflicts.py (1683 of 2028) PASS: lldb-api :: commands/expression/completion/TestExprCompletion.py (1684 of 2028) UNSUPPORTED: lldb-api :: functionalities/darwin_log/filter/exact_match/activity/TestDarwinLogFilterMatchActivity.py (1685 of 2028) PASS: lldb-unit :: ObjectFile/Breakpad/./ObjectFileBreakpadTests/StackCFIRecord.parse (1686 of 2028) PASS: lldb-shell :: Commands/command-target-modules-dump-sections.yaml (1687 of 2028) PASS: lldb-shell :: SymbolFile/DWARF/DW_OP_piece-smaller-than-struct.s (1688 of 2028) PASS: lldb-unit :: Utility/./UtilityTests/BinaryStreamTest.PutSLEB128ThreeBytes (1689 of 2028) PASS: lldb-unit :: Process/gdb-remote/./ProcessGdbRemoteTests/GDBRemoteCommunicationClientTest.GetModulesInfoInvalidResponse (1690 of 2028) PASS: lldb-shell :: Commands/command-thread-select.test (1691 of 2028) PASS: lldb-shell :: Unwind/eh-frame-dwarf-unwind.test (1692 of 2028) PASS: lldb-unit :: Utility/./UtilityTests/StringListTest.SplitIntoLinesSingleTrailingCR (1693 of 2028) PASS: lldb-unit :: Core/./LLDBCoreTests/MangledTest.EmptyForInvalidName (1694 of 2028) UNSUPPORTED: lldb-shell :: ScriptInterpreter/Lua/nested_sessions.test (1695 of 2028) PASS: lldb-api :: tools/lldb-vscode/step/TestVSCode_step.py (1696 of 2028) PASS: lldb-api :: functionalities/thread/jump/TestThreadJump.py (1697 of 2028) PASS: lldb-unit :: Utility/./UtilityTests/OptionsWithRawTest.EmptySuffix (1698 of 2028) PASS: lldb-unit :: UnwindAssembly/x86/./UnwindAssemblyx86Tests/Testx86AssemblyInspectionEngine.TestPushEDI (1699 of 2028) PASS: lldb-unit :: Symbol/./SymbolTests/Type.CompilerContextPattern (1700 of 2028) UNSUPPORTED: lldb-shell :: SymbolFile/PDB/pointers.test (1701 of 2028) PASS: lldb-api :: functionalities/data-formatter/data-formatter-categories/TestDataFormatterCategories.py (1702 of 2028) PASS: lldb-unit :: Language/Highlighting/./HighlighterTests/HighlighterTest.DefaultHighlighterWithCursorOutOfBounds (1703 of 2028) UNSUPPORTED: lldb-shell :: Reproducer/TestLuaImport.test (1704 of 2028) PASS: lldb-api :: commands/expression/unicode-in-variable/TestUnicodeInVariable.py (1705 of 2028) PASS: lldb-unit :: UnwindAssembly/x86/./UnwindAssemblyx86Tests/Testx86AssemblyInspectionEngine.TestPopRBX (1706 of 2028) PASS: lldb-unit :: Utility/./UtilityTests/EnvironmentTest.EnvpConstruction (1707 of 2028) PASS: lldb-unit :: Target/./TargetTests/ModuleCacheTest.GetAndPutStrangeHostname (1708 of 2028) PASS: lldb-api :: lang/c/struct_types/TestStructTypes.py (1709 of 2028) PASS: lldb-api :: python_api/file_handle/TestFileHandle.py (1710 of 2028) PASS: lldb-unit :: Expression/./ExpressionTests/ClangExpressionDeclMapTest.TestPersistentDeclLookup (1711 of 2028) PASS: lldb-unit :: Utility/./UtilityTests/FileSpecTest.FormatFileSpec (1712 of 2028) PASS: lldb-shell :: Driver/TestSingleQuote.test (1713 of 2028) PASS: lldb-shell :: SymbolFile/DWARF/static_scope.s (1714 of 2028) PASS: lldb-api :: functionalities/breakpoint/address_breakpoints/TestBadAddressBreakpoints.py (1715 of 2028) FAIL: lldb-api :: functionalities/data-formatter/data-formatter-objc/TestDataFormatterObjCNSError.py (1716 of 2028) ******************** TEST 'lldb-api :: functionalities/data-formatter/data-formatter-objc/TestDataFormatterObjCNSError.py' FAILED ******************** Script: -- /Users/buildslave/jenkins/workspace/lldb-cmake-sanitized/lldb-build/lldb-test-build.noindex/copied-system-python /Users/buildslave/jenkins/workspace/lldb-cmake-sanitized/llvm-project/lldb/test/API/dotest.py --arch x86_64 -s /Users/buildslave/jenkins/workspace/lldb-cmake-sanitized/lldb-build/lldb-test-traces -S nm -u CXXFLAGS -u CFLAGS --codesign-identity lldb_codesign --server /Users/buildslave/jenkins/workspace/lldb-cmake-sanitized/lldb-build/./bin/debugserver --arch x86_64 --build-dir /Users/buildslave/jenkins/workspace/lldb-cmake-sanitized/lldb-build/lldb-test-build.noindex -s=/Users/buildslave/jenkins/workspace/lldb-cmake-sanitized/test/logs -t --env TERM=vt100 --env LLVM_LIBS_DIR=/Users/buildslave/jenkins/workspace/lldb-cmake-sanitized/lldb-build/./lib --inferior-env ASAN_OPTIONS=detect_stack_use_after_return=1 --inferior-env DYLD_INSERT_LIBRARIES=/Users/buildslave/jenkins/workspace/lldb-cmake-sanitized/host-compiler/lib/clang/11.0.0/lib/darwin/libclang_rt.asan_osx_dynamic.dylib --build-dir /Users/buildslave/jenkins/workspace/lldb-cmake-sanitized/lldb-build/lldb-test-build.noindex --lldb-module-cache-dir /Users/buildslave/jenkins/workspace/lldb-cmake-sanitized/lldb-build/lldb-test-build.noindex/module-cache-lldb/lldb-api --clang-module-cache-dir /Users/buildslave/jenkins/workspace/lldb-cmake-sanitized/lldb-build/lldb-test-build.noindex/module-cache-clang/lldb-api --executable /Users/buildslave/jenkins/workspace/lldb-cmake-sanitized/lldb-build/./bin/lldb --compiler /Users/buildslave/jenkins/workspace/lldb-cmake-sanitized/lldb-build/./bin/clang --dsymutil /Users/buildslave/jenkins/workspace/lldb-cmake-sanitized/lldb-build/./bin/dsymutil --filecheck /Users/buildslave/jenkins/workspace/lldb-cmake-sanitized/lldb-build/./bin/FileCheck --lldb-libs-dir /Users/buildslave/jenkins/workspace/lldb-cmake-sanitized/lldb-build/./lib /Users/buildslave/jenkins/workspace/lldb-cmake-sanitized/llvm-project/lldb/test/API/functionalities/data-formatter/data-formatter-objc -p TestDataFormatterObjCNSError.py -- Exit Code: -6

Hide Details

Command Output (stdout): -- lldb version 11.0.99 clang revision 07e8a780d81bb58a0c7bd4da6cc0b9beaec3c788 llvm revision 07e8a780d81bb58a0c7bd4da6cc0b9beaec3c788

Hide Details

-- Command Output (stderr): -- Assertion failed: (tokenKind == tok::kw___bridge_retain), function ParseParenExpression, file /Users/buildslave/jenkins/workspace/lldb-cmake-sanitized/llvm-project/clang/lib/Parse/ParseExpr.cpp, line 2804.

Hide Details

--

Hide Details

******************** PASS: lldb-api :: functionalities/data-formatter/user-format-vs-summary/TestUserFormatVsSummary.py (1717 of 2028) PASS: lldb-api :: functionalities/breakpoint/breakpoint_command/TestBreakpointCommand.py (1718 of 2028) PASS: lldb-unit :: ObjectFile/PECOFF/./ObjectFilePECOFFTests/PECallFrameInfoTest.Basic_eh (1719 of 2028) PASS: lldb-unit :: UnwindAssembly/x86/./UnwindAssemblyx86Tests/Testx86AssemblyInspectionEngine.TestAddRSP (1720 of 2028) PASS: lldb-api :: commands/apropos/basic/TestApropos.py (1721 of 2028) PASS: lldb-shell :: ObjectFile/ELF/duplicate-section.yaml (1722 of 2028) PASS: lldb-shell :: Minidump/no-process-id.yaml (1723 of 2028) PASS: lldb-unit :: Utility/./UtilityTests/RangeTest.LessThan (1724 of 2028) UNSUPPORTED: lldb-api :: linux/thread/create_during_instruction_step/TestCreateDuringInstructionStep.py (1725 of 2028) PASS: lldb-unit :: Utility/./UtilityTests/ConstStringTest.UpdateMangledCounterpart (1726 of 2028) UNSUPPORTED: lldb-api :: functionalities/thread/state/TestThreadStates.py (1727 of 2028) PASS: lldb-unit :: Utility/./UtilityTests/FileSpecTest.EqualDotsPosix (1728 of 2028) PASS: lldb-unit :: Symbol/./SymbolTests/TestTypeSystemClang.TestRecordHasFields (1729 of 2028) UNSUPPORTED: lldb-api :: benchmarks/libcxxlist/TestBenchmarkLibcxxList.py (1730 of 2028) PASS: lldb-shell :: SymbolFile/DWARF/dwp-separate-debug-file.cpp (1731 of 2028) PASS: lldb-api :: functionalities/breakpoint/breakpoint_conditions/TestBreakpointConditions.py (1732 of 2028) PASS: lldb-unit :: Symbol/./SymbolTests/TestClangASTImporter.MetadataPropagation (1733 of 2028) FAIL: lldb-api :: lang/objcxx/objcxx-ivar-vector/TestIvarVector.py (1734 of 2028) ******************** TEST 'lldb-api :: lang/objcxx/objcxx-ivar-vector/TestIvarVector.py' FAILED ******************** Script: -- /Users/buildslave/jenkins/workspace/lldb-cmake-sanitized/lldb-build/lldb-test-build.noindex/copied-system-python /Users/buildslave/jenkins/workspace/lldb-cmake-sanitized/llvm-project/lldb/test/API/dotest.py --arch x86_64 -s /Users/buildslave/jenkins/workspace/lldb-cmake-sanitized/lldb-build/lldb-test-traces -S nm -u CXXFLAGS -u CFLAGS --codesign-identity lldb_codesign --server /Users/buildslave/jenkins/workspace/lldb-cmake-sanitized/lldb-build/./bin/debugserver --arch x86_64 --build-dir /Users/buildslave/jenkins/workspace/lldb-cmake-sanitized/lldb-build/lldb-test-build.noindex -s=/Users/buildslave/jenkins/workspace/lldb-cmake-sanitized/test/logs -t --env TERM=vt100 --env LLVM_LIBS_DIR=/Users/buildslave/jenkins/workspace/lldb-cmake-sanitized/lldb-build/./lib --inferior-env ASAN_OPTIONS=detect_stack_use_after_return=1 --inferior-env DYLD_INSERT_LIBRARIES=/Users/buildslave/jenkins/workspace/lldb-cmake-sanitized/host-compiler/lib/clang/11.0.0/lib/darwin/libclang_rt.asan_osx_dynamic.dylib --build-dir /Users/buildslave/jenkins/workspace/lldb-cmake-sanitized/lldb-build/lldb-test-build.noindex --lldb-module-cache-dir /Users/buildslave/jenkins/workspace/lldb-cmake-sanitized/lldb-build/lldb-test-build.noindex/module-cache-lldb/lldb-api --clang-module-cache-dir /Users/buildslave/jenkins/workspace/lldb-cmake-sanitized/lldb-build/lldb-test-build.noindex/module-cache-clang/lldb-api --executable /Users/buildslave/jenkins/workspace/lldb-cmake-sanitized/lldb-build/./bin/lldb --compiler /Users/buildslave/jenkins/workspace/lldb-cmake-sanitized/lldb-build/./bin/clang --dsymutil /Users/buildslave/jenkins/workspace/lldb-cmake-sanitized/lldb-build/./bin/dsymutil --filecheck /Users/buildslave/jenkins/workspace/lldb-cmake-sanitized/lldb-build/./bin/FileCheck --lldb-libs-dir /Users/buildslave/jenkins/workspace/lldb-cmake-sanitized/lldb-build/./lib /Users/buildslave/jenkins/workspace/lldb-cmake-sanitized/llvm-project/lldb/test/API/lang/objcxx/objcxx-ivar-vector -p TestIvarVector.py -- Exit Code: -6

Hide Details

Command Output (stdout): -- lldb version 11.0.99 clang revision 07e8a780d81bb58a0c7bd4da6cc0b9beaec3c788 llvm revision 07e8a780d81bb58a0c7bd4da6cc0b9beaec3c788

Hide Details

-- Command Output (stderr): -- Assertion failed: (tokenKind == tok::kw___bridge_retain), function ParseParenExpression, file /Users/buildslave/jenkins/workspace/lldb-cmake-sanitized/llvm-project/clang/lib/Parse/ParseExpr.cpp, line 2804.

Hide Details

--

Hide Details

******************** PASS: lldb-unit :: Utility/./UtilityTests/StreamTest.PutBytesAsRawHex8ToLittleEndian (1735 of 2028) PASS: lldb-unit :: Utility/./UtilityTests/ScalarTest.ComparisonFloat (1736 of 2028) PASS: lldb-api :: macosx/find-dsym/deep-bundle/TestDeepBundle.py (1737 of 2028) PASS: lldb-unit :: Utility/./UtilityTests/AnsiTerminal.Incomplete (1738 of 2028) PASS: lldb-unit :: Process/minidump/./LLDBMinidumpTests/MinidumpParserTest.MinidumpDuplicateModuleMinAddress (1739 of 2028) PASS: lldb-unit :: Utility/./UtilityTests/StringExtractorTest.GetHexU8_Exact_NoEof (1740 of 2028) PASS: lldb-unit :: Utility/./UtilityTests/ProcessInfoTest.Constructor (1741 of 2028) PASS: lldb-unit :: Process/gdb-remote/./ProcessGdbRemoteTests/GDBRemoteClientBaseTest.SendContinueAndAsyncPacket (1742 of 2028) PASS: lldb-api :: functionalities/float-display/TestFloatDisplay.py (1743 of 2028) PASS: lldb-api :: python_api/value/change_values/TestChangeValueAPI.py (1744 of 2028) PASS: lldb-unit :: SymbolFile/NativePDB/./SymbolFileNativePDBTests/PDBFPOProgramToDWARFExpressionTests.UnknownOp (1745 of 2028) PASS: lldb-api :: lang/objc/modules-hash-mismatch/TestClangModulesHashMismatch.py (1746 of 2028) PASS: lldb-api :: functionalities/pre_run_dylibs/TestPreRunDylibs.py (1747 of 2028) PASS: lldb-shell :: ScriptInterpreter/Python/crashlog.test (1748 of 2028) UNSUPPORTED: lldb-api :: functionalities/darwin_log/filter/regex/activity/TestDarwinLogFilterRegexActivity.py (1749 of 2028) PASS: lldb-unit :: Utility/./UtilityTests/StringListTest.AppendStringStdString (1750 of 2028) PASS: lldb-unit :: Symbol/./SymbolTests/TestClangASTImporter.DeportDeclTagDecl (1751 of 2028) PASS: lldb-unit :: Utility/./UtilityTests/ArchSpecTest.YAML (1752 of 2028) PASS: lldb-api :: commands/process/launch/TestProcessLaunch.py (1753 of 2028) PASS: lldb-api :: commands/expression/persistent_variables/TestPersistentVariables.py (1754 of 2028) PASS: lldb-unit :: ScriptInterpreter/Python/./ScriptInterpreterPythonTests/PythonDataObjectsTest.TestModuleNameResolutionNoDot (1755 of 2028) PASS: lldb-shell :: SymbolFile/DWARF/debug-types-missing-signature.test (1756 of 2028) PASS: lldb-shell :: ObjectFile/ELF/short-build-id.yaml (1757 of 2028) PASS: lldb-unit :: Utility/./UtilityTests/StreamTeeTest.GetStreamAtIndexOutOfBounds (1758 of 2028) PASS: lldb-api :: commands/expression/import-std-module/vector-dbg-info-content/TestDbgInfoContentVectorFromStdModule.py (1759 of 2028) PASS: lldb-unit :: Expression/./ExpressionTests/CppModuleConfigurationTest.AmbiguousCLib (1760 of 2028) PASS: lldb-api :: python_api/value/linked_list/TestValueAPILinkedList.py (1761 of 2028) PASS: lldb-shell :: ScriptInterpreter/Python/sb_address_exception.test (1762 of 2028) PASS: lldb-api :: lang/cpp/char1632_t/TestChar1632T.py (1763 of 2028) PASS: lldb-shell :: Reproducer/TestWorkingDir.test (1764 of 2028) PASS: lldb-unit :: Utility/./UtilityTests/UriParserTest.BracketedHostnameWithPortIPv4 (1765 of 2028) PASS: lldb-api :: functionalities/breakpoint/comp_dir_symlink/TestCompDirSymLink.py (1766 of 2028) PASS: lldb-unit :: UnwindAssembly/x86/./UnwindAssemblyx86Tests/Testx86AssemblyInspectionEngine.TestPush0 (1767 of 2028) PASS: lldb-api :: commands/expression/unwind_expression/TestUnwindExpression.py (1768 of 2028) FAIL: lldb-api :: lang/objc/foundation/TestObjCMethodsNSError.py (1769 of 2028) ******************** TEST 'lldb-api :: lang/objc/foundation/TestObjCMethodsNSError.py' FAILED ******************** Script: -- /Users/buildslave/jenkins/workspace/lldb-cmake-sanitized/lldb-build/lldb-test-build.noindex/copied-system-python /Users/buildslave/jenkins/workspace/lldb-cmake-sanitized/llvm-project/lldb/test/API/dotest.py --arch x86_64 -s /Users/buildslave/jenkins/workspace/lldb-cmake-sanitized/lldb-build/lldb-test-traces -S nm -u CXXFLAGS -u CFLAGS --codesign-identity lldb_codesign --server /Users/buildslave/jenkins/workspace/lldb-cmake-sanitized/lldb-build/./bin/debugserver --arch x86_64 --build-dir /Users/buildslave/jenkins/workspace/lldb-cmake-sanitized/lldb-build/lldb-test-build.noindex -s=/Users/buildslave/jenkins/workspace/lldb-cmake-sanitized/test/logs -t --env TERM=vt100 --env LLVM_LIBS_DIR=/Users/buildslave/jenkins/workspace/lldb-cmake-sanitized/lldb-build/./lib --inferior-env ASAN_OPTIONS=detect_stack_use_after_return=1 --inferior-env DYLD_INSERT_LIBRARIES=/Users/buildslave/jenkins/workspace/lldb-cmake-sanitized/host-compiler/lib/clang/11.0.0/lib/darwin/libclang_rt.asan_osx_dynamic.dylib --build-dir /Users/buildslave/jenkins/workspace/lldb-cmake-sanitized/lldb-build/lldb-test-build.noindex --lldb-module-cache-dir /Users/buildslave/jenkins/workspace/lldb-cmake-sanitized/lldb-build/lldb-test-build.noindex/module-cache-lldb/lldb-api --clang-module-cache-dir /Users/buildslave/jenkins/workspace/lldb-cmake-sanitized/lldb-build/lldb-test-build.noindex/module-cache-clang/lldb-api --executable /Users/buildslave/jenkins/workspace/lldb-cmake-sanitized/lldb-build/./bin/lldb --compiler /Users/buildslave/jenkins/workspace/lldb-cmake-sanitized/lldb-build/./bin/clang --dsymutil /Users/buildslave/jenkins/workspace/lldb-cmake-sanitized/lldb-build/./bin/dsymutil --filecheck /Users/buildslave/jenkins/workspace/lldb-cmake-sanitized/lldb-build/./bin/FileCheck --lldb-libs-dir /Users/buildslave/jenkins/workspace/lldb-cmake-sanitized/lldb-build/./lib /Users/buildslave/jenkins/workspace/lldb-cmake-sanitized/llvm-project/lldb/test/API/lang/objc/foundation -p TestObjCMethodsNSError.py -- Exit Code: -6

Hide Details

Command Output (stdout): -- lldb version 11.0.99 clang revision 07e8a780d81bb58a0c7bd4da6cc0b9beaec3c788 llvm revision 07e8a780d81bb58a0c7bd4da6cc0b9beaec3c788

Hide Details

-- Command Output (stderr): -- Assertion failed: (tokenKind == tok::kw___bridge_retain), function ParseParenExpression, file /Users/buildslave/jenkins/workspace/lldb-cmake-sanitized/llvm-project/clang/lib/Parse/ParseExpr.cpp, line 2804.

Hide Details

--

Hide Details

******************** PASS: lldb-unit :: Utility/./UtilityTests/ArchSpecTest.TripleComponentsWereSpecified (1770 of 2028) PASS: lldb-unit :: Host/./HostTests/SocketAddressTest.GetAddressInfo (1771 of 2028) XFAIL: lldb-shell :: Register/x86-64-write.test (1772 of 2028) PASS: lldb-unit :: Utility/./UtilityTests/RangeDataVector.CustomSort (1773 of 2028) PASS: lldb-api :: api/listeners/TestListener.py (1774 of 2028) UNSUPPORTED: lldb-api :: lang/objc/ptr_refs/TestPtrRefsObjC.py (1775 of 2028) PASS: lldb-unit :: ObjectFile/ELF/./ObjectFileELFTests/ObjectFileELFTest.GetModuleSpecifications_EarlySectionHeaders (1776 of 2028) PASS: lldb-api :: commands/watchpoints/watchpoint_commands/command/TestWatchpointCommandPython.py (1777 of 2028) PASS: lldb-unit :: Utility/./UtilityTests/StringListTest.GetMaxStringLengthDecreasingSize (1778 of 2028) PASS: lldb-api :: functionalities/load_using_paths/TestLoadUsingPaths.py (1779 of 2028) PASS: lldb-unit :: Process/gdb-remote/./ProcessGdbRemoteTests/GDBRemoteClientBaseTest.SendContinueAndLateInterrupt (1780 of 2028) UNSUPPORTED: lldb-shell :: Register/arm-fp-read.test (1781 of 2028) PASS: lldb-unit :: Utility/./UtilityTests/StringExtractorTest.GetHexU8_Underflow_NoEof (1782 of 2028) PASS: lldb-api :: python_api/hello_world/TestHelloWorld.py (1783 of 2028) PASS: lldb-unit :: Utility/./UtilityTests/ArgsTest.GetArgumentArrayRef (1784 of 2028) PASS: lldb-unit :: Utility/./UtilityTests/UriParserTest.BadPort (1785 of 2028) PASS: lldb-unit :: Language/Highlighting/./HighlighterTests/HighlighterTest.DefaultHighlighterWithCursor (1786 of 2028) PASS: lldb-unit :: Utility/./UtilityTests/StringListTest.InsertStringAtIndexStdString (1787 of 2028) PASS: lldb-api :: lang/c/step_over_no_deadlock/TestStepOverDoesntBlock.py (1788 of 2028) PASS: lldb-unit :: Expression/./ExpressionTests/ClangExpressionDeclMapTest.TestUnknownIdentifierLookup (1789 of 2028) UNSUPPORTED: lldb-shell :: Watchpoint/netbsd-nouserdbregs.test (1790 of 2028) PASS: lldb-shell :: SymbolFile/DWARF/childless-compile-unit.s (1791 of 2028) PASS: lldb-api :: python_api/watchpoint/TestWatchpointIgnoreCount.py (1792 of 2028) PASS: lldb-api :: terminal/TestSTTYBeforeAndAfter.py (1793 of 2028) PASS: lldb-api :: functionalities/tail_call_frames/thread_step_out_message/TestArtificialFrameStepOutMessage.py (1794 of 2028) PASS: lldb-unit :: Utility/./UtilityTests/IndexToObjectTest.ObjectForIndex (1795 of 2028) PASS: lldb-unit :: Utility/./UtilityTests/StreamTest.AddressPrefixAndSuffix (1796 of 2028) PASS: lldb-unit :: Symbol/./SymbolTests/SymbolsTest.LocateExecutableSymbolFileForUnknownExecutableAndMissingSymbolFile (1797 of 2028) PASS: lldb-unit :: Target/./TargetTests/MCBasedABI.MapRegisterName (1798 of 2028) PASS: lldb-unit :: UnwindAssembly/x86/./UnwindAssemblyx86Tests/Testx86AssemblyInspectionEngine.TestPushR14 (1799 of 2028) FAIL: lldb-api :: commands/expression/two-files/TestObjCTypeQueryFromOtherCompileUnit.py (1800 of 2028) ******************** TEST 'lldb-api :: commands/expression/two-files/TestObjCTypeQueryFromOtherCompileUnit.py' FAILED ******************** Script: -- /Users/buildslave/jenkins/workspace/lldb-cmake-sanitized/lldb-build/lldb-test-build.noindex/copied-system-python /Users/buildslave/jenkins/workspace/lldb-cmake-sanitized/llvm-project/lldb/test/API/dotest.py --arch x86_64 -s /Users/buildslave/jenkins/workspace/lldb-cmake-sanitized/lldb-build/lldb-test-traces -S nm -u CXXFLAGS -u CFLAGS --codesign-identity lldb_codesign --server /Users/buildslave/jenkins/workspace/lldb-cmake-sanitized/lldb-build/./bin/debugserver --arch x86_64 --build-dir /Users/buildslave/jenkins/workspace/lldb-cmake-sanitized/lldb-build/lldb-test-build.noindex -s=/Users/buildslave/jenkins/workspace/lldb-cmake-sanitized/test/logs -t --env TERM=vt100 --env LLVM_LIBS_DIR=/Users/buildslave/jenkins/workspace/lldb-cmake-sanitized/lldb-build/./lib --inferior-env ASAN_OPTIONS=detect_stack_use_after_return=1 --inferior-env DYLD_INSERT_LIBRARIES=/Users/buildslave/jenkins/workspace/lldb-cmake-sanitized/host-compiler/lib/clang/11.0.0/lib/darwin/libclang_rt.asan_osx_dynamic.dylib --build-dir /Users/buildslave/jenkins/workspace/lldb-cmake-sanitized/lldb-build/lldb-test-build.noindex --lldb-module-cache-dir /Users/buildslave/jenkins/workspace/lldb-cmake-sanitized/lldb-build/lldb-test-build.noindex/module-cache-lldb/lldb-api --clang-module-cache-dir /Users/buildslave/jenkins/workspace/lldb-cmake-sanitized/lldb-build/lldb-test-build.noindex/module-cache-clang/lldb-api --executable /Users/buildslave/jenkins/workspace/lldb-cmake-sanitized/lldb-build/./bin/lldb --compiler /Users/buildslave/jenkins/workspace/lldb-cmake-sanitized/lldb-build/./bin/clang --dsymutil /Users/buildslave/jenkins/workspace/lldb-cmake-sanitized/lldb-build/./bin/dsymutil --filecheck /Users/buildslave/jenkins/workspace/lldb-cmake-sanitized/lldb-build/./bin/FileCheck --lldb-libs-dir /Users/buildslave/jenkins/workspace/lldb-cmake-sanitized/lldb-build/./lib /Users/buildslave/jenkins/workspace/lldb-cmake-sanitized/llvm-project/lldb/test/API/commands/expression/two-files -p TestObjCTypeQueryFromOtherCompileUnit.py -- Exit Code: -6

Hide Details

Command Output (stdout): -- lldb version 11.0.99 clang revision 07e8a780d81bb58a0c7bd4da6cc0b9beaec3c788 llvm revision 07e8a780d81bb58a0c7bd4da6cc0b9beaec3c788

Hide Details

-- Command Output (stderr): -- Assertion failed: (tokenKind == tok::kw___bridge_retain), function ParseParenExpression, file /Users/buildslave/jenkins/workspace/lldb-cmake-sanitized/llvm-project/clang/lib/Parse/ParseExpr.cpp, line 2804.

Hide Details

--

Hide Details

******************** FAIL: lldb-api :: functionalities/set-data/TestSetData.py (1801 of 2028) ******************** TEST 'lldb-api :: functionalities/set-data/TestSetData.py' FAILED ******************** Script: -- /Users/buildslave/jenkins/workspace/lldb-cmake-sanitized/lldb-build/lldb-test-build.noindex/copied-system-python /Users/buildslave/jenkins/workspace/lldb-cmake-sanitized/llvm-project/lldb/test/API/dotest.py --arch x86_64 -s /Users/buildslave/jenkins/workspace/lldb-cmake-sanitized/lldb-build/lldb-test-traces -S nm -u CXXFLAGS -u CFLAGS --codesign-identity lldb_codesign --server /Users/buildslave/jenkins/workspace/lldb-cmake-sanitized/lldb-build/./bin/debugserver --arch x86_64 --build-dir /Users/buildslave/jenkins/workspace/lldb-cmake-sanitized/lldb-build/lldb-test-build.noindex -s=/Users/buildslave/jenkins/workspace/lldb-cmake-sanitized/test/logs -t --env TERM=vt100 --env LLVM_LIBS_DIR=/Users/buildslave/jenkins/workspace/lldb-cmake-sanitized/lldb-build/./lib --inferior-env ASAN_OPTIONS=detect_stack_use_after_return=1 --inferior-env DYLD_INSERT_LIBRARIES=/Users/buildslave/jenkins/workspace/lldb-cmake-sanitized/host-compiler/lib/clang/11.0.0/lib/darwin/libclang_rt.asan_osx_dynamic.dylib --build-dir /Users/buildslave/jenkins/workspace/lldb-cmake-sanitized/lldb-build/lldb-test-build.noindex --lldb-module-cache-dir /Users/buildslave/jenkins/workspace/lldb-cmake-sanitized/lldb-build/lldb-test-build.noindex/module-cache-lldb/lldb-api --clang-module-cache-dir /Users/buildslave/jenkins/workspace/lldb-cmake-sanitized/lldb-build/lldb-test-build.noindex/module-cache-clang/lldb-api --executable /Users/buildslave/jenkins/workspace/lldb-cmake-sanitized/lldb-build/./bin/lldb --compiler /Users/buildslave/jenkins/workspace/lldb-cmake-sanitized/lldb-build/./bin/clang --dsymutil /Users/buildslave/jenkins/workspace/lldb-cmake-sanitized/lldb-build/./bin/dsymutil --filecheck /Users/buildslave/jenkins/workspace/lldb-cmake-sanitized/lldb-build/./bin/FileCheck --lldb-libs-dir /Users/buildslave/jenkins/workspace/lldb-cmake-sanitized/lldb-build/./lib /Users/buildslave/jenkins/workspace/lldb-cmake-sanitized/llvm-project/lldb/test/API/functionalities/set-data -p TestSetData.py -- Exit Code: -6

Hide Details

Command Output (stdout): -- lldb version 11.0.99 clang revision 07e8a780d81bb58a0c7bd4da6cc0b9beaec3c788 llvm revision 07e8a780d81bb58a0c7bd4da6cc0b9beaec3c788

Hide Details

-- Command Output (stderr): -- Assertion failed: (tokenKind == tok::kw___bridge_retain), function ParseParenExpression, file /Users/buildslave/jenkins/workspace/lldb-cmake-sanitized/llvm-project/clang/lib/Parse/ParseExpr.cpp, line 2804.

Hide Details

--

Hide Details

******************** PASS: lldb-unit :: Symbol/./SymbolTests/TestClangASTImporter.CanImportInvalidType (1802 of 2028) PASS: lldb-unit :: Utility/./UtilityTests/ScalarTest.APIntConstructor (1803 of 2028) PASS: lldb-api :: functionalities/breakpoint/cpp_exception/TestCPPExceptionBreakpoint.py (1804 of 2028) PASS: lldb-unit :: Utility/./UtilityTests/UriParserTest.TypicalPortPathIPv6 (1805 of 2028) PASS: lldb-api :: functionalities/data-formatter/compactvectors/TestCompactVectors.py (1806 of 2028) PASS: lldb-unit :: Utility/./UtilityTests/FileSpecTest.GetPath (1807 of 2028) PASS: lldb-api :: functionalities/breakpoint/serialize/TestBreakpointSerialization.py (1808 of 2028) PASS: lldb-unit :: SymbolFile/NativePDB/./SymbolFileNativePDBTests/PDBFPOProgramToDWARFExpressionTests.InvalidAssignmentSingle (1809 of 2028) PASS: lldb-api :: python_api/lldbutil/iter/TestRegistersIterator.py (1810 of 2028) PASS: lldb-unit :: Utility/./UtilityTests/DataExtractorTest.UncommonAddressSize (1811 of 2028) PASS: lldb-api :: functionalities/multidebugger_commands/TestMultipleDebuggersCommands.py (1812 of 2028) XFAIL: lldb-shell :: Register/x86-64-ymm-write.test (1813 of 2028) PASS: lldb-unit :: Utility/./UtilityTests/BinaryStreamTest.PutSLEB128SevenBytes (1814 of 2028) PASS: lldb-unit :: UnwindAssembly/x86/./UnwindAssemblyx86Tests/Testx86AssemblyInspectionEngine.TestPushExtended (1815 of 2028) PASS: lldb-api :: commands/expression/call-function/TestCallUserDefinedFunction.py (1816 of 2028) PASS: lldb-api :: commands/expression/import-std-module/weak_ptr-dbg-info-content/TestDbgInfoContentWeakPtrFromStdModule.py (1817 of 2028) PASS: lldb-unit :: Expression/./ExpressionTests/DWARFExpression.DW_OP_stack_value (1818 of 2028) PASS: lldb-api :: commands/expression/entry-bp/TestExprEntryBP.py (1819 of 2028) PASS: lldb-unit :: SymbolFile/NativePDB/./SymbolFileNativePDBTests/PDBFPOProgramToDWARFExpressionTests.DependencyChain (1820 of 2028) PASS: lldb-unit :: Process/gdb-remote/./ProcessGdbRemoteTests/GDBRemoteClientBaseTest.SendContinueAndInterrupt2PacketBug (1821 of 2028) PASS: lldb-api :: lang/cpp/static_methods/TestCPPStaticMethods.py (1822 of 2028) PASS: lldb-unit :: Process/gdb-remote/./ProcessGdbRemoteTests/GDBRemoteCommunicationServerTest.SendErrorResponse_UnimplementedError (1823 of 2028) PASS: lldb-unit :: Utility/./UtilityTests/FileSpecTest.Match (1824 of 2028) FAIL: lldb-api :: lang/objc/orderedset/TestOrderedSet.py (1825 of 2028) ******************** TEST 'lldb-api :: lang/objc/orderedset/TestOrderedSet.py' FAILED ******************** Script: -- /Users/buildslave/jenkins/workspace/lldb-cmake-sanitized/lldb-build/lldb-test-build.noindex/copied-system-python /Users/buildslave/jenkins/workspace/lldb-cmake-sanitized/llvm-project/lldb/test/API/dotest.py --arch x86_64 -s /Users/buildslave/jenkins/workspace/lldb-cmake-sanitized/lldb-build/lldb-test-traces -S nm -u CXXFLAGS -u CFLAGS --codesign-identity lldb_codesign --server /Users/buildslave/jenkins/workspace/lldb-cmake-sanitized/lldb-build/./bin/debugserver --arch x86_64 --build-dir /Users/buildslave/jenkins/workspace/lldb-cmake-sanitized/lldb-build/lldb-test-build.noindex -s=/Users/buildslave/jenkins/workspace/lldb-cmake-sanitized/test/logs -t --env TERM=vt100 --env LLVM_LIBS_DIR=/Users/buildslave/jenkins/workspace/lldb-cmake-sanitized/lldb-build/./lib --inferior-env ASAN_OPTIONS=detect_stack_use_after_return=1 --inferior-env DYLD_INSERT_LIBRARIES=/Users/buildslave/jenkins/workspace/lldb-cmake-sanitized/host-compiler/lib/clang/11.0.0/lib/darwin/libclang_rt.asan_osx_dynamic.dylib --build-dir /Users/buildslave/jenkins/workspace/lldb-cmake-sanitized/lldb-build/lldb-test-build.noindex --lldb-module-cache-dir /Users/buildslave/jenkins/workspace/lldb-cmake-sanitized/lldb-build/lldb-test-build.noindex/module-cache-lldb/lldb-api --clang-module-cache-dir /Users/buildslave/jenkins/workspace/lldb-cmake-sanitized/lldb-build/lldb-test-build.noindex/module-cache-clang/lldb-api --executable /Users/buildslave/jenkins/workspace/lldb-cmake-sanitized/lldb-build/./bin/lldb --compiler /Users/buildslave/jenkins/workspace/lldb-cmake-sanitized/lldb-build/./bin/clang --dsymutil /Users/buildslave/jenkins/workspace/lldb-cmake-sanitized/lldb-build/./bin/dsymutil --filecheck /Users/buildslave/jenkins/workspace/lldb-cmake-sanitized/lldb-build/./bin/FileCheck --lldb-libs-dir /Users/buildslave/jenkins/workspace/lldb-cmake-sanitized/lldb-build/./lib /Users/buildslave/jenkins/workspace/lldb-cmake-sanitized/llvm-project/lldb/test/API/lang/objc/orderedset -p TestOrderedSet.py -- Exit Code: -6

Hide Details

Command Output (stdout): -- lldb version 11.0.99 clang revision 07e8a780d81bb58a0c7bd4da6cc0b9beaec3c788 llvm revision 07e8a780d81bb58a0c7bd4da6cc0b9beaec3c788

Hide Details

-- Command Output (stderr): -- Assertion failed: (tokenKind == tok::kw___bridge_retain), function ParseParenExpression, file /Users/buildslave/jenkins/workspace/lldb-cmake-sanitized/llvm-project/clang/lib/Parse/ParseExpr.cpp, line 2804.

Hide Details

--

Hide Details

******************** PASS: lldb-unit :: Utility/./UtilityTests/BinaryStreamTest.PutULEB128TwoBytes (1826 of 2028) PASS: lldb-shell :: SymbolFile/NativePDB/s_constant.cpp (1827 of 2028) PASS: lldb-api :: functionalities/data-formatter/data-formatter-stl/libcxx/variant/TestDataFormatterLibcxxVariant.py (1828 of 2028) PASS: lldb-api :: functionalities/target_var/TestTargetVar.py (1829 of 2028) PASS: lldb-unit :: ScriptInterpreter/Python/./ScriptInterpreterPythonTests/PythonDataObjectsTest.TestPythonIntegerToStructuredInteger (1830 of 2028) PASS: lldb-unit :: Language/Highlighting/./HighlighterTests/HighlighterTest.ClangScalarLiterals (1831 of 2028) PASS: lldb-unit :: ScriptInterpreter/Python/./ScriptInterpreterPythonTests/PythonDataObjectsTest.TestPythonCallableCheck (1832 of 2028) PASS: lldb-api :: functionalities/thread/concurrent_events/TestConcurrentTwoBreakpointThreads.py (1833 of 2028) PASS: lldb-api :: commands/expression/expr-in-syscall/TestExpressionInSyscall.py (1834 of 2028) PASS: lldb-api :: functionalities/breakpoint/address_breakpoints/TestAddressBreakpoints.py (1835 of 2028) PASS: lldb-api :: commands/disassemble/basic/TestFrameDisassemble.py (1836 of 2028) PASS: lldb-unit :: UnwindAssembly/x86/./UnwindAssemblyx86Tests/Testx86AssemblyInspectionEngine.TestPushR12 (1837 of 2028) PASS: lldb-api :: macosx/version_zero/TestGetVersionZeroVersion.py (1838 of 2028) PASS: lldb-api :: functionalities/thread/concurrent_events/TestConcurrentTwoWatchpointsOneBreakpoint.py (1839 of 2028) PASS: lldb-api :: lang/cpp/namespace_definitions/TestNamespaceDefinitions.py (1840 of 2028) PASS: lldb-api :: python_api/lldbutil/iter/TestLLDBIterator.py (1841 of 2028) PASS: lldb-api :: lang/cpp/bool/TestCPPBool.py (1842 of 2028) PASS: lldb-shell :: ExecControl/StopHook/stop-hook.test (1843 of 2028) PASS: lldb-unit :: ScriptInterpreter/Python/./ScriptInterpreterPythonTests/PythonDataObjectsTest.TestGlobalNameResolutionNoDot (1844 of 2028) PASS: lldb-unit :: Utility/./UtilityTests/DataExtractorTest.PeekData (1845 of 2028) UNSUPPORTED: lldb-shell :: ScriptInterpreter/Lua/command_script_import.test (1846 of 2028) PASS: lldb-api :: lang/cpp/dynamic-value-same-basename/TestDynamicValueSameBase.py (1847 of 2028) PASS: lldb-unit :: UnwindAssembly/x86/./UnwindAssemblyx86Tests/Testx86AssemblyInspectionEngine.TestMovRSPtoRBP (1848 of 2028) PASS: lldb-api :: functionalities/inferior-crashing/TestInferiorCrashing.py (1849 of 2028) PASS: lldb-unit :: SymbolFile/NativePDB/./SymbolFileNativePDBTests/PDBFPOProgramToDWARFExpressionTests.UnsupportedRASearch (1850 of 2028) PASS: lldb-shell :: SymbolFile/Breakpad/line-table-mixed-path-styles.test (1851 of 2028) PASS: lldb-api :: macosx/thread-names/TestInterruptThreadNames.py (1852 of 2028) PASS: lldb-api :: lang/cpp/auto/TestCPPAuto.py (1853 of 2028) PASS: lldb-unit :: Expression/./ExpressionTests/DiagnosticManagerTest.AddDiagnostic (1854 of 2028) PASS: lldb-shell :: SymbolFile/DWARF/DW_TAG_basic_type_DW_ATE_UTF_nonC.ll (1855 of 2028) PASS: lldb-unit :: Utility/./UtilityTests/SerializationRountripTest.SerializeDeserializeObjectReference (1856 of 2028) PASS: lldb-unit :: Utility/./UtilityTests/OptionsWithRawTest.UnterminatedQuote (1857 of 2028) UNSUPPORTED: lldb-api :: lang/objc/objc-dynamic-value/TestObjCDynamicValue.py (1858 of 2028) PASS: lldb-unit :: Utility/./UtilityTests/UriParserTest.MinimalPort (1859 of 2028) PASS: lldb-unit :: Utility/./UtilityTests/ProcessInstanceInfo.DumpTable (1860 of 2028) PASS: lldb-api :: commands/gui/invalid-args/TestInvalidArgsGui.py (1861 of 2028) PASS: lldb-shell :: Watchpoint/SetErrorCases.test (1862 of 2028) PASS: lldb-api :: functionalities/thread/concurrent_events/TestConcurrentDelayedCrashWithBreakpointSignal.py (1863 of 2028) PASS: lldb-unit :: Utility/./UtilityTests/StringListTest.SplitIntoLinesEmpty (1864 of 2028) PASS: lldb-api :: functionalities/inferior-changed/TestInferiorChanged.py (1865 of 2028) PASS: lldb-unit :: Utility/./UtilityTests/FileSpecTest.OperatorBool (1866 of 2028) PASS: lldb-unit :: Process/minidump/./LLDBMinidumpTests/MinidumpParserTest.GetMemoryRegionInfoFromMemory64List (1867 of 2028) PASS: lldb-api :: functionalities/postmortem/mach-core/TestMachCore.py (1868 of 2028) PASS: lldb-unit :: Utility/./UtilityTests/StringListTest.GetMaxStringLengthMixed (1869 of 2028) PASS: lldb-unit :: ScriptInterpreter/Python/./ScriptInterpreterPythonTests/PythonDataObjectsTest.TestPythonFile (1870 of 2028) PASS: lldb-unit :: Process/minidump/./LLDBMinidumpTests/MinidumpParserTest.GetExceptionStream (1871 of 2028) PASS: lldb-api :: python_api/debugger/TestDebuggerAPI.py (1872 of 2028) PASS: lldb-unit :: Utility/./UtilityTests/ArgsTest.ReplaceArgumentAtIndexEqual (1873 of 2028) PASS: lldb-unit :: Expression/./ExpressionTests/DiagnosticManagerTest.GetStringMultipleDiags (1874 of 2028) PASS: lldb-unit :: Process/gdb-remote/./ProcessGdbRemoteTests/GDBRemoteClientBaseTest.SendPacketAndReceiveResponseWithOutputSupport (1875 of 2028) PASS: lldb-api :: commands/target/dump-symtab-demangle/TestDumpSymtabDemangle.py (1876 of 2028) PASS: lldb-unit :: Host/./HostTests/SocketAddressTest.Set (1877 of 2028) PASS: lldb-unit :: Utility/./UtilityTests/StringExtractorTest.InitEmpty (1878 of 2028) PASS: lldb-unit :: Expression/./ExpressionTests/CppModuleConfigurationTest.Xcode (1879 of 2028) PASS: lldb-unit :: Expression/./ExpressionTests/DiagnosticManagerTest.AppendMessageNoDiag (1880 of 2028) PASS: lldb-unit :: Utility/./UtilityTests/ProcessInstanceInfoMatch.Name (1881 of 2028) UNSUPPORTED: lldb-shell :: BuildScript/toolchain-msvc.test (1882 of 2028) PASS: lldb-shell :: Expr/TestMultilineExpr.test (1883 of 2028) PASS: lldb-api :: commands/command/script_alias/TestCommandScriptAlias.py (1884 of 2028) PASS: lldb-unit :: Symbol/./SymbolTests/PostfixExpression.ParseOneExpression (1885 of 2028) PASS: lldb-unit :: Utility/./UtilityTests/OptionsWithRawTest.SingleWhitespaceInput (1886 of 2028) PASS: lldb-unit :: Utility/./UtilityTests/BinaryStreamTest.PutSLEB128TwoBytes (1887 of 2028) PASS: lldb-shell :: Reproducer/TestDiscard.test (1888 of 2028) PASS: lldb-shell :: SymbolFile/Breakpad/unwind-via-stack-cfi.test (1889 of 2028) PASS: lldb-api :: functionalities/gdb_remote_client/TestNestedRegDefinitions.py (1890 of 2028) PASS: lldb-api :: commands/expression/import-std-module/deque-basic/TestDequeFromStdModule.py (1891 of 2028) PASS: lldb-unit :: Utility/./UtilityTests/FileSpecTest.CopyByAppendingPathComponent (1892 of 2028) PASS: lldb-unit :: UnwindAssembly/x86/./UnwindAssemblyx86Tests/Testx86AssemblyInspectionEngine.TestAddESP (1893 of 2028) PASS: lldb-shell :: SymbolFile/NativePDB/disassembly.cpp (1894 of 2028) PASS: lldb-unit :: Utility/./UtilityTests/Flags.IsClear (1895 of 2028) PASS: lldb-api :: tools/lldb-vscode/attach/TestVSCode_attach.py (1896 of 2028) PASS: lldb-api :: functionalities/breakpoint/breakpoint_language/TestBreakpointLanguage.py (1897 of 2028) PASS: lldb-api :: functionalities/lazy-loading/TestLazyLoading.py (1898 of 2028) PASS: lldb-unit :: Utility/./UtilityTests/CompletionRequest.FakeLastArg (1899 of 2028) UNSUPPORTED: lldb-shell :: ScriptInterpreter/Lua/breakpoint_callback.test (1900 of 2028) PASS: lldb-unit :: Utility/./UtilityTests/BinaryStreamTest.PutSLEB128Zero (1901 of 2028) PASS: lldb-api :: source-manager/TestSourceManager.py (1902 of 2028) PASS: lldb-api :: macosx/indirect_symbol/TestIndirectSymbols.py (1903 of 2028) PASS: lldb-api :: lang/cpp/gmodules-templates/TestGModules.py (1904 of 2028) FAIL: lldb-api :: lang/objc/objc-class-method/TestObjCClassMethod.py (1905 of 2028) ******************** TEST 'lldb-api :: lang/objc/objc-class-method/TestObjCClassMethod.py' FAILED ******************** Script: -- /Users/buildslave/jenkins/workspace/lldb-cmake-sanitized/lldb-build/lldb-test-build.noindex/copied-system-python /Users/buildslave/jenkins/workspace/lldb-cmake-sanitized/llvm-project/lldb/test/API/dotest.py --arch x86_64 -s /Users/buildslave/jenkins/workspace/lldb-cmake-sanitized/lldb-build/lldb-test-traces -S nm -u CXXFLAGS -u CFLAGS --codesign-identity lldb_codesign --server /Users/buildslave/jenkins/workspace/lldb-cmake-sanitized/lldb-build/./bin/debugserver --arch x86_64 --build-dir /Users/buildslave/jenkins/workspace/lldb-cmake-sanitized/lldb-build/lldb-test-build.noindex -s=/Users/buildslave/jenkins/workspace/lldb-cmake-sanitized/test/logs -t --env TERM=vt100 --env LLVM_LIBS_DIR=/Users/buildslave/jenkins/workspace/lldb-cmake-sanitized/lldb-build/./lib --inferior-env ASAN_OPTIONS=detect_stack_use_after_return=1 --inferior-env DYLD_INSERT_LIBRARIES=/Users/buildslave/jenkins/workspace/lldb-cmake-sanitized/host-compiler/lib/clang/11.0.0/lib/darwin/libclang_rt.asan_osx_dynamic.dylib --build-dir /Users/buildslave/jenkins/workspace/lldb-cmake-sanitized/lldb-build/lldb-test-build.noindex --lldb-module-cache-dir /Users/buildslave/jenkins/workspace/lldb-cmake-sanitized/lldb-build/lldb-test-build.noindex/module-cache-lldb/lldb-api --clang-module-cache-dir /Users/buildslave/jenkins/workspace/lldb-cmake-sanitized/lldb-build/lldb-test-build.noindex/module-cache-clang/lldb-api --executable /Users/buildslave/jenkins/workspace/lldb-cmake-sanitized/lldb-build/./bin/lldb --compiler /Users/buildslave/jenkins/workspace/lldb-cmake-sanitized/lldb-build/./bin/clang --dsymutil /Users/buildslave/jenkins/workspace/lldb-cmake-sanitized/lldb-build/./bin/dsymutil --filecheck /Users/buildslave/jenkins/workspace/lldb-cmake-sanitized/lldb-build/./bin/FileCheck --lldb-libs-dir /Users/buildslave/jenkins/workspace/lldb-cmake-sanitized/lldb-build/./lib /Users/buildslave/jenkins/workspace/lldb-cmake-sanitized/llvm-project/lldb/test/API/lang/objc/objc-class-method -p TestObjCClassMethod.py -- Exit Code: -6

Hide Details

Command Output (stdout): -- lldb version 11.0.99 clang revision 07e8a780d81bb58a0c7bd4da6cc0b9beaec3c788 llvm revision 07e8a780d81bb58a0c7bd4da6cc0b9beaec3c788

Hide Details

-- Command Output (stderr): -- Assertion failed: (tokenKind == tok::kw___bridge_retain), function ParseParenExpression, file /Users/buildslave/jenkins/workspace/lldb-cmake-sanitized/llvm-project/clang/lib/Parse/ParseExpr.cpp, line 2804.

Hide Details

--

Hide Details

******************** UNSUPPORTED: lldb-api :: functionalities/data-formatter/data-formatter-stl/libstdcpp/string/TestDataFormatterStdString.py (1906 of 2028) PASS: lldb-api :: commands/watchpoints/watchpoint_count/TestWatchpointCount.py (1907 of 2028) PASS: lldb-shell :: Settings/TestFrameFormatColor.test (1908 of 2028) PASS: lldb-shell :: SymbolFile/NativePDB/globals-bss.cpp (1909 of 2028) PASS: lldb-unit :: Utility/./UtilityTests/ArgsTest.ReplaceArgumentAtIndexFarOutOfRange (1910 of 2028) PASS: lldb-shell :: SymbolFile/DWARF/dir-separator-no-comp-dir-relative-name.s (1911 of 2028) PASS: lldb-api :: macosx/function-starts/TestFunctionStarts.py (1912 of 2028) PASS: lldb-unit :: ObjectFile/Breakpad/./ObjectFileBreakpadTests/FileRecord.parse (1913 of 2028) PASS: lldb-api :: functionalities/thread/concurrent_events/TestConcurrentWatchBreakDelay.py (1914 of 2028) PASS: lldb-unit :: Utility/./UtilityTests/StringListTest.AppendListCStringArray (1915 of 2028) FAIL: lldb-api :: lang/objc/foundation/TestObjCMethodsString.py (1916 of 2028) ******************** TEST 'lldb-api :: lang/objc/foundation/TestObjCMethodsString.py' FAILED ******************** Script: -- /Users/buildslave/jenkins/workspace/lldb-cmake-sanitized/lldb-build/lldb-test-build.noindex/copied-system-python /Users/buildslave/jenkins/workspace/lldb-cmake-sanitized/llvm-project/lldb/test/API/dotest.py --arch x86_64 -s /Users/buildslave/jenkins/workspace/lldb-cmake-sanitized/lldb-build/lldb-test-traces -S nm -u CXXFLAGS -u CFLAGS --codesign-identity lldb_codesign --server /Users/buildslave/jenkins/workspace/lldb-cmake-sanitized/lldb-build/./bin/debugserver --arch x86_64 --build-dir /Users/buildslave/jenkins/workspace/lldb-cmake-sanitized/lldb-build/lldb-test-build.noindex -s=/Users/buildslave/jenkins/workspace/lldb-cmake-sanitized/test/logs -t --env TERM=vt100 --env LLVM_LIBS_DIR=/Users/buildslave/jenkins/workspace/lldb-cmake-sanitized/lldb-build/./lib --inferior-env ASAN_OPTIONS=detect_stack_use_after_return=1 --inferior-env DYLD_INSERT_LIBRARIES=/Users/buildslave/jenkins/workspace/lldb-cmake-sanitized/host-compiler/lib/clang/11.0.0/lib/darwin/libclang_rt.asan_osx_dynamic.dylib --build-dir /Users/buildslave/jenkins/workspace/lldb-cmake-sanitized/lldb-build/lldb-test-build.noindex --lldb-module-cache-dir /Users/buildslave/jenkins/workspace/lldb-cmake-sanitized/lldb-build/lldb-test-build.noindex/module-cache-lldb/lldb-api --clang-module-cache-dir /Users/buildslave/jenkins/workspace/lldb-cmake-sanitized/lldb-build/lldb-test-build.noindex/module-cache-clang/lldb-api --executable /Users/buildslave/jenkins/workspace/lldb-cmake-sanitized/lldb-build/./bin/lldb --compiler /Users/buildslave/jenkins/workspace/lldb-cmake-sanitized/lldb-build/./bin/clang --dsymutil /Users/buildslave/jenkins/workspace/lldb-cmake-sanitized/lldb-build/./bin/dsymutil --filecheck /Users/buildslave/jenkins/workspace/lldb-cmake-sanitized/lldb-build/./bin/FileCheck --lldb-libs-dir /Users/buildslave/jenkins/workspace/lldb-cmake-sanitized/lldb-build/./lib /Users/buildslave/jenkins/workspace/lldb-cmake-sanitized/llvm-project/lldb/test/API/lang/objc/foundation -p TestObjCMethodsString.py -- Exit Code: -6

Hide Details

Command Output (stdout): -- lldb version 11.0.99 clang revision 07e8a780d81bb58a0c7bd4da6cc0b9beaec3c788 llvm revision 07e8a780d81bb58a0c7bd4da6cc0b9beaec3c788

Hide Details

-- Command Output (stderr): -- Assertion failed: (tokenKind == tok::kw___bridge_retain), function ParseParenExpression, file /Users/buildslave/jenkins/workspace/lldb-cmake-sanitized/llvm-project/clang/lib/Parse/ParseExpr.cpp, line 2804.

Hide Details

--

Hide Details

******************** PASS: lldb-unit :: Utility/./UtilityTests/StreamTest.AddressRange (1917 of 2028) PASS: lldb-unit :: ScriptInterpreter/Python/./ScriptInterpreterPythonTests/PythonDataObjectsTest.TestPythonStringToStr (1918 of 2028) PASS: lldb-api :: python_api/frame/get-variables/TestGetVariables.py (1919 of 2028) PASS: lldb-api :: commands/expression/import-std-module/unique_ptr-dbg-info-content/TestUniquePtrDbgInfoContent.py (1920 of 2028) PASS: lldb-unit :: Process/minidump/./LLDBMinidumpTests/MinidumpParserTest.MinidumpModuleOrder (1921 of 2028) PASS: lldb-unit :: UnwindAssembly/x86/./UnwindAssemblyx86Tests/Testx86AssemblyInspectionEngine.TestDisassemblyMidFunctionEpilogues (1922 of 2028) PASS: lldb-api :: functionalities/postmortem/minidump-new/TestMiniDumpUUID.py (1923 of 2028) PASS: lldb-api :: lang/cpp/chained-calls/TestCppChainedCalls.py (1924 of 2028) FAIL: lldb-api :: lang/objc/bitfield_ivars/TestBitfieldIvars.py (1925 of 2028) ******************** TEST 'lldb-api :: lang/objc/bitfield_ivars/TestBitfieldIvars.py' FAILED ******************** Script: -- /Users/buildslave/jenkins/workspace/lldb-cmake-sanitized/lldb-build/lldb-test-build.noindex/copied-system-python /Users/buildslave/jenkins/workspace/lldb-cmake-sanitized/llvm-project/lldb/test/API/dotest.py --arch x86_64 -s /Users/buildslave/jenkins/workspace/lldb-cmake-sanitized/lldb-build/lldb-test-traces -S nm -u CXXFLAGS -u CFLAGS --codesign-identity lldb_codesign --server /Users/buildslave/jenkins/workspace/lldb-cmake-sanitized/lldb-build/./bin/debugserver --arch x86_64 --build-dir /Users/buildslave/jenkins/workspace/lldb-cmake-sanitized/lldb-build/lldb-test-build.noindex -s=/Users/buildslave/jenkins/workspace/lldb-cmake-sanitized/test/logs -t --env TERM=vt100 --env LLVM_LIBS_DIR=/Users/buildslave/jenkins/workspace/lldb-cmake-sanitized/lldb-build/./lib --inferior-env ASAN_OPTIONS=detect_stack_use_after_return=1 --inferior-env DYLD_INSERT_LIBRARIES=/Users/buildslave/jenkins/workspace/lldb-cmake-sanitized/host-compiler/lib/clang/11.0.0/lib/darwin/libclang_rt.asan_osx_dynamic.dylib --build-dir /Users/buildslave/jenkins/workspace/lldb-cmake-sanitized/lldb-build/lldb-test-build.noindex --lldb-module-cache-dir /Users/buildslave/jenkins/workspace/lldb-cmake-sanitized/lldb-build/lldb-test-build.noindex/module-cache-lldb/lldb-api --clang-module-cache-dir /Users/buildslave/jenkins/workspace/lldb-cmake-sanitized/lldb-build/lldb-test-build.noindex/module-cache-clang/lldb-api --executable /Users/buildslave/jenkins/workspace/lldb-cmake-sanitized/lldb-build/./bin/lldb --compiler /Users/buildslave/jenkins/workspace/lldb-cmake-sanitized/lldb-build/./bin/clang --dsymutil /Users/buildslave/jenkins/workspace/lldb-cmake-sanitized/lldb-build/./bin/dsymutil --filecheck /Users/buildslave/jenkins/workspace/lldb-cmake-sanitized/lldb-build/./bin/FileCheck --lldb-libs-dir /Users/buildslave/jenkins/workspace/lldb-cmake-sanitized/lldb-build/./lib /Users/buildslave/jenkins/workspace/lldb-cmake-sanitized/llvm-project/lldb/test/API/lang/objc/bitfield_ivars -p TestBitfieldIvars.py -- Exit Code: -6

Hide Details

Command Output (stdout): -- lldb version 11.0.99 clang revision 07e8a780d81bb58a0c7bd4da6cc0b9beaec3c788 llvm revision 07e8a780d81bb58a0c7bd4da6cc0b9beaec3c788

Hide Details

-- Command Output (stderr): -- Assertion failed: (tokenKind == tok::kw___bridge_retain), function ParseParenExpression, file /Users/buildslave/jenkins/workspace/lldb-cmake-sanitized/llvm-project/clang/lib/Parse/ParseExpr.cpp, line 2804.

Hide Details

--

Hide Details

******************** UNSUPPORTED: lldb-shell :: Process/Windows/exception_access_violation.cpp (1926 of 2028) PASS: lldb-unit :: Utility/./UtilityTests/StringListTest.GetMaxStringLengthIncreasingSize (1927 of 2028) PASS: lldb-api :: commands/expression/cast_int_to_anonymous_enum/TestCastIntToAnonymousEnum.py (1928 of 2028) PASS: lldb-unit :: Utility/./UtilityTests/StreamTest.PutHex64ByteOrderLittle (1929 of 2028) PASS: lldb-api :: functionalities/thread/concurrent_events/TestConcurrentTwoWatchpointsOneDelayBreakpoint.py (1930 of 2028) PASS: lldb-api :: lang/c/shared_lib/TestSharedLib.py (1931 of 2028) UNSUPPORTED: lldb-shell :: Register/x86-gp-write.test (1932 of 2028) PASS: lldb-unit :: Utility/./UtilityTests/StringLexerTest.NextIf (1933 of 2028) FAIL: lldb-api :: python_api/exprpath_synthetic/TestExprPathSynthetic.py (1934 of 2028) ******************** TEST 'lldb-api :: python_api/exprpath_synthetic/TestExprPathSynthetic.py' FAILED ******************** Script: -- /Users/buildslave/jenkins/workspace/lldb-cmake-sanitized/lldb-build/lldb-test-build.noindex/copied-system-python /Users/buildslave/jenkins/workspace/lldb-cmake-sanitized/llvm-project/lldb/test/API/dotest.py --arch x86_64 -s /Users/buildslave/jenkins/workspace/lldb-cmake-sanitized/lldb-build/lldb-test-traces -S nm -u CXXFLAGS -u CFLAGS --codesign-identity lldb_codesign --server /Users/buildslave/jenkins/workspace/lldb-cmake-sanitized/lldb-build/./bin/debugserver --arch x86_64 --build-dir /Users/buildslave/jenkins/workspace/lldb-cmake-sanitized/lldb-build/lldb-test-build.noindex -s=/Users/buildslave/jenkins/workspace/lldb-cmake-sanitized/test/logs -t --env TERM=vt100 --env LLVM_LIBS_DIR=/Users/buildslave/jenkins/workspace/lldb-cmake-sanitized/lldb-build/./lib --inferior-env ASAN_OPTIONS=detect_stack_use_after_return=1 --inferior-env DYLD_INSERT_LIBRARIES=/Users/buildslave/jenkins/workspace/lldb-cmake-sanitized/host-compiler/lib/clang/11.0.0/lib/darwin/libclang_rt.asan_osx_dynamic.dylib --build-dir /Users/buildslave/jenkins/workspace/lldb-cmake-sanitized/lldb-build/lldb-test-build.noindex --lldb-module-cache-dir /Users/buildslave/jenkins/workspace/lldb-cmake-sanitized/lldb-build/lldb-test-build.noindex/module-cache-lldb/lldb-api --clang-module-cache-dir /Users/buildslave/jenkins/workspace/lldb-cmake-sanitized/lldb-build/lldb-test-build.noindex/module-cache-clang/lldb-api --executable /Users/buildslave/jenkins/workspace/lldb-cmake-sanitized/lldb-build/./bin/lldb --compiler /Users/buildslave/jenkins/workspace/lldb-cmake-sanitized/lldb-build/./bin/clang --dsymutil /Users/buildslave/jenkins/workspace/lldb-cmake-sanitized/lldb-build/./bin/dsymutil --filecheck /Users/buildslave/jenkins/workspace/lldb-cmake-sanitized/lldb-build/./bin/FileCheck --lldb-libs-dir /Users/buildslave/jenkins/workspace/lldb-cmake-sanitized/lldb-build/./lib /Users/buildslave/jenkins/workspace/lldb-cmake-sanitized/llvm-project/lldb/test/API/python_api/exprpath_synthetic -p TestExprPathSynthetic.py -- Exit Code: -6

Hide Details

Command Output (stdout): -- lldb version 11.0.99 clang revision 07e8a780d81bb58a0c7bd4da6cc0b9beaec3c788 llvm revision 07e8a780d81bb58a0c7bd4da6cc0b9beaec3c788

Hide Details

-- Command Output (stderr): -- Assertion failed: (tokenKind == tok::kw___bridge_retain), function ParseParenExpression, file /Users/buildslave/jenkins/workspace/lldb-cmake-sanitized/llvm-project/clang/lib/Parse/ParseExpr.cpp, line 2804.

Hide Details

--

Hide Details

******************** PASS: lldb-unit :: Utility/./UtilityTests/OptionsWithRawTest.EmptyInput (1935 of 2028) PASS: lldb-api :: python_api/sbtype_typeclass/TestSBTypeTypeClass.py (1936 of 2028) PASS: lldb-unit :: Host/./HostTests/ProcessLaunchInfoTest.Constructor (1937 of 2028) PASS: lldb-api :: functionalities/data-formatter/hexcaps/TestDataFormatterHexCaps.py (1938 of 2028) PASS: lldb-api :: commands/expression/vector_of_enums/TestVectorOfEnums.py (1939 of 2028) PASS: lldb-unit :: Utility/./UtilityTests/StreamTest.AddressRangeInvalidRange (1940 of 2028) PASS: lldb-api :: types/TestLongTypes.py (1941 of 2028) FAIL: lldb-api :: commands/expression/po_verbosity/TestPoVerbosity.py (1942 of 2028) ******************** TEST 'lldb-api :: commands/expression/po_verbosity/TestPoVerbosity.py' FAILED ******************** Script: -- /Users/buildslave/jenkins/workspace/lldb-cmake-sanitized/lldb-build/lldb-test-build.noindex/copied-system-python /Users/buildslave/jenkins/workspace/lldb-cmake-sanitized/llvm-project/lldb/test/API/dotest.py --arch x86_64 -s /Users/buildslave/jenkins/workspace/lldb-cmake-sanitized/lldb-build/lldb-test-traces -S nm -u CXXFLAGS -u CFLAGS --codesign-identity lldb_codesign --server /Users/buildslave/jenkins/workspace/lldb-cmake-sanitized/lldb-build/./bin/debugserver --arch x86_64 --build-dir /Users/buildslave/jenkins/workspace/lldb-cmake-sanitized/lldb-build/lldb-test-build.noindex -s=/Users/buildslave/jenkins/workspace/lldb-cmake-sanitized/test/logs -t --env TERM=vt100 --env LLVM_LIBS_DIR=/Users/buildslave/jenkins/workspace/lldb-cmake-sanitized/lldb-build/./lib --inferior-env ASAN_OPTIONS=detect_stack_use_after_return=1 --inferior-env DYLD_INSERT_LIBRARIES=/Users/buildslave/jenkins/workspace/lldb-cmake-sanitized/host-compiler/lib/clang/11.0.0/lib/darwin/libclang_rt.asan_osx_dynamic.dylib --build-dir /Users/buildslave/jenkins/workspace/lldb-cmake-sanitized/lldb-build/lldb-test-build.noindex --lldb-module-cache-dir /Users/buildslave/jenkins/workspace/lldb-cmake-sanitized/lldb-build/lldb-test-build.noindex/module-cache-lldb/lldb-api --clang-module-cache-dir /Users/buildslave/jenkins/workspace/lldb-cmake-sanitized/lldb-build/lldb-test-build.noindex/module-cache-clang/lldb-api --executable /Users/buildslave/jenkins/workspace/lldb-cmake-sanitized/lldb-build/./bin/lldb --compiler /Users/buildslave/jenkins/workspace/lldb-cmake-sanitized/lldb-build/./bin/clang --dsymutil /Users/buildslave/jenkins/workspace/lldb-cmake-sanitized/lldb-build/./bin/dsymutil --filecheck /Users/buildslave/jenkins/workspace/lldb-cmake-sanitized/lldb-build/./bin/FileCheck --lldb-libs-dir /Users/buildslave/jenkins/workspace/lldb-cmake-sanitized/lldb-build/./lib /Users/buildslave/jenkins/workspace/lldb-cmake-sanitized/llvm-project/lldb/test/API/commands/expression/po_verbosity -p TestPoVerbosity.py -- Exit Code: -6

Hide Details

Command Output (stdout): -- lldb version 11.0.99 clang revision 07e8a780d81bb58a0c7bd4da6cc0b9beaec3c788 llvm revision 07e8a780d81bb58a0c7bd4da6cc0b9beaec3c788

Hide Details

-- Command Output (stderr): -- Assertion failed: (tokenKind == tok::kw___bridge_retain), function ParseParenExpression, file /Users/buildslave/jenkins/workspace/lldb-cmake-sanitized/llvm-project/clang/lib/Parse/ParseExpr.cpp, line 2804.

Hide Details

--

Hide Details

******************** PASS: lldb-api :: functionalities/tail_call_frames/disambiguate_paths_to_common_sink/TestDisambiguatePathsToCommonSink.py (1943 of 2028) PASS: lldb-unit :: Language/Highlighting/./HighlighterTests/HighlighterTest.ClangCursorPosBeforeOtherToken (1944 of 2028) PASS: lldb-api :: python_api/lldbutil/process/TestPrintStackTraces.py (1945 of 2028) FAIL: lldb-api :: lang/objc/print-obj/TestPrintObj.py (1946 of 2028) ******************** TEST 'lldb-api :: lang/objc/print-obj/TestPrintObj.py' FAILED ******************** Script: -- /Users/buildslave/jenkins/workspace/lldb-cmake-sanitized/lldb-build/lldb-test-build.noindex/copied-system-python /Users/buildslave/jenkins/workspace/lldb-cmake-sanitized/llvm-project/lldb/test/API/dotest.py --arch x86_64 -s /Users/buildslave/jenkins/workspace/lldb-cmake-sanitized/lldb-build/lldb-test-traces -S nm -u CXXFLAGS -u CFLAGS --codesign-identity lldb_codesign --server /Users/buildslave/jenkins/workspace/lldb-cmake-sanitized/lldb-build/./bin/debugserver --arch x86_64 --build-dir /Users/buildslave/jenkins/workspace/lldb-cmake-sanitized/lldb-build/lldb-test-build.noindex -s=/Users/buildslave/jenkins/workspace/lldb-cmake-sanitized/test/logs -t --env TERM=vt100 --env LLVM_LIBS_DIR=/Users/buildslave/jenkins/workspace/lldb-cmake-sanitized/lldb-build/./lib --inferior-env ASAN_OPTIONS=detect_stack_use_after_return=1 --inferior-env DYLD_INSERT_LIBRARIES=/Users/buildslave/jenkins/workspace/lldb-cmake-sanitized/host-compiler/lib/clang/11.0.0/lib/darwin/libclang_rt.asan_osx_dynamic.dylib --build-dir /Users/buildslave/jenkins/workspace/lldb-cmake-sanitized/lldb-build/lldb-test-build.noindex --lldb-module-cache-dir /Users/buildslave/jenkins/workspace/lldb-cmake-sanitized/lldb-build/lldb-test-build.noindex/module-cache-lldb/lldb-api --clang-module-cache-dir /Users/buildslave/jenkins/workspace/lldb-cmake-sanitized/lldb-build/lldb-test-build.noindex/module-cache-clang/lldb-api --executable /Users/buildslave/jenkins/workspace/lldb-cmake-sanitized/lldb-build/./bin/lldb --compiler /Users/buildslave/jenkins/workspace/lldb-cmake-sanitized/lldb-build/./bin/clang --dsymutil /Users/buildslave/jenkins/workspace/lldb-cmake-sanitized/lldb-build/./bin/dsymutil --filecheck /Users/buildslave/jenkins/workspace/lldb-cmake-sanitized/lldb-build/./bin/FileCheck --lldb-libs-dir /Users/buildslave/jenkins/workspace/lldb-cmake-sanitized/lldb-build/./lib /Users/buildslave/jenkins/workspace/lldb-cmake-sanitized/llvm-project/lldb/test/API/lang/objc/print-obj -p TestPrintObj.py -- Exit Code: -6

Hide Details

Command Output (stdout): -- lldb version 11.0.99 clang revision 07e8a780d81bb58a0c7bd4da6cc0b9beaec3c788 llvm revision 07e8a780d81bb58a0c7bd4da6cc0b9beaec3c788

Hide Details

-- Command Output (stderr): -- Assertion failed: (tokenKind == tok::kw___bridge_retain), function ParseParenExpression, file /Users/buildslave/jenkins/workspace/lldb-cmake-sanitized/llvm-project/clang/lib/Parse/ParseExpr.cpp, line 2804.

Hide Details

--

Hide Details

******************** PASS: lldb-shell :: ObjectFile/Breakpad/uuid-matching-mac.test (1947 of 2028) PASS: lldb-unit :: Utility/./UtilityTests/UriParserTest.MinimalPortPath (1948 of 2028) PASS: lldb-unit :: Utility/./UtilityTests/RangeTest.DoesAdjoinOrIntersect (1949 of 2028) PASS: lldb-unit :: ScriptInterpreter/Python/./ScriptInterpreterPythonTests/PythonDataObjectsTest.TestExtractingUInt64ThroughStructuredData (1950 of 2028) PASS: lldb-unit :: Utility/./UtilityTests/StringExtractorTest.GetHexBytesAvail_OddPair2 (1951 of 2028) PASS: lldb-api :: lang/objc/objc-ivar-offsets/TestObjCIvarOffsets.py (1952 of 2028) PASS: lldb-unit :: UnwindAssembly/x86/./UnwindAssemblyx86Tests/Testx86AssemblyInspectionEngine.TestPushRBX (1953 of 2028) PASS: lldb-unit :: UnwindAssembly/x86/./UnwindAssemblyx86Tests/Testx86AssemblyInspectionEngine.TestPopR15 (1954 of 2028) PASS: lldb-api :: functionalities/mtc/simple/TestMTCSimple.py (1955 of 2028) PASS: lldb-api :: functionalities/tail_call_frames/disambiguate_tail_call_seq/TestDisambiguateTailCallSeq.py (1956 of 2028) PASS: lldb-unit :: Utility/./UtilityTests/OptionsWithRawTest.LeadingSpaceArgs (1957 of 2028) PASS: lldb-unit :: Utility/./UtilityTests/LogTest.Register (1958 of 2028) UNSUPPORTED: lldb-api :: commands/watchpoints/multi_watchpoint_slots/TestWatchpointMultipleSlots.py (1959 of 2028) PASS: lldb-unit :: Utility/./UtilityTests/StringListTest.Clear (1960 of 2028) PASS: lldb-unit :: Language/Highlighting/./HighlighterTests/HighlighterTest.ClangStringLiterals (1961 of 2028) PASS: lldb-shell :: Minidump/memory-region.yaml (1962 of 2028) PASS: lldb-api :: linux/builtin_trap/TestBuiltinTrap.py (1963 of 2028) PASS: lldb-unit :: SymbolFile/DWARF/./SymbolFileDWARFTests/SymbolFileDWARFTests.TestAbbrevValidAttrNullForm (1964 of 2028) PASS: lldb-api :: commands/watchpoints/watchpoint_commands/condition/TestWatchpointConditionCmd.py (1965 of 2028) PASS: lldb-unit :: Utility/./UtilityTests/StreamTeeTest.SetStreamAtIndexOutOfBounds (1966 of 2028) PASS: lldb-api :: tools/lldb-server/TestGdbRemoteThreadsInStopReply.py (1967 of 2028) PASS: lldb-unit :: Symbol/./SymbolTests/TestTypeSystemClang.TemplateArguments (1968 of 2028) PASS: lldb-unit :: Host/./HostTests/FileSystemTest.Exists (1969 of 2028) PASS: lldb-unit :: Symbol/./SymbolTests/LineEntryTest.GetSameLineContiguousAddressRangeOneInline (1970 of 2028) PASS: lldb-unit :: Language/Highlighting/./HighlighterTests/HighlighterTest.ClangCursorPosEndOfLine (1971 of 2028) PASS: lldb-unit :: Utility/./UtilityTests/StringListTest.InsertStringAtIndexMove (1972 of 2028) PASS: lldb-api :: python_api/frame/TestFrames.py (1973 of 2028) PASS: lldb-unit :: Host/./HostTests/FileSystemTest.Readable (1974 of 2028) XFAIL: lldb-shell :: Register/x86-mm-xmm-read.test (1975 of 2028) PASS: lldb-unit :: Symbol/./SymbolTests/TestTypeSystemClang.TestDisplayName (1976 of 2028) PASS: lldb-unit :: Host/./HostTests/NativeProcessProtocolTest.ReadCStringFromMemory_CrossPageBoundary (1977 of 2028) PASS: lldb-shell :: ObjectFile/PECOFF/invalid-export-table.yaml (1978 of 2028) UNSUPPORTED: lldb-shell :: Register/aarch64-fp-read.test (1979 of 2028) PASS: lldb-api :: functionalities/gdb_remote_client/TestArmRegisterDefinition.py (1980 of 2028) PASS: lldb-api :: commands/expression/import-std-module/shared_ptr-dbg-info-content/TestSharedPtrDbgInfoContentFromStdModule.py (1981 of 2028) PASS: lldb-unit :: Utility/./UtilityTests/OptionsWithRawTest.EmptyArgsOnlySuffix (1982 of 2028) PASS: lldb-unit :: Utility/./UtilityTests/StringListTest.Assignment (1983 of 2028) PASS: lldb-shell :: Settings/TestFrameFormatNoColor.test (1984 of 2028) PASS: lldb-api :: commands/expression/timeout/TestCallWithTimeout.py (1985 of 2028) PASS: lldb-api :: commands/command/script/import/rdar-12586188/TestRdar12586188.py (1986 of 2028) PASS: lldb-api :: commands/watchpoints/watchpoint_commands/TestWatchpointCommands.py (1987 of 2028) PASS: lldb-unit :: Utility/./UtilityTests/SerializationRountripTest.SerializeDeserializeCString (1988 of 2028) PASS: lldb-api :: functionalities/breakpoint/move_nearest/TestMoveNearest.py (1989 of 2028) PASS: lldb-unit :: Utility/./UtilityTests/ConstStringTest.CompareConstString (1990 of 2028) PASS: lldb-unit :: Utility/./UtilityTests/RangeTest.Union (1991 of 2028) PASS: lldb-unit :: Symbol/./SymbolTests/TestTypeSystemClang.TestGetEnumIntegerTypeBasicTypes (1992 of 2028) PASS: lldb-api :: functionalities/thread/concurrent_events/TestConcurrentWatchpointWithDelayWatchpointThreads.py (1993 of 2028) PASS: lldb-api :: functionalities/gdb_remote_client/TestGDBRemoteClient.py (1994 of 2028) PASS: lldb-unit :: Utility/./UtilityTests/StringListTest.PopBack (1995 of 2028) PASS: lldb-api :: python_api/process/TestProcessAPI.py (1996 of 2028) PASS: lldb-unit :: Core/./LLDBCoreTests/CommunicationTest.SynchronizeWhileClosing (1997 of 2028) PASS: lldb-shell :: Reproducer/TestGDBRemoteRepro.test (1998 of 2028) PASS: lldb-api :: functionalities/thread/concurrent_events/TestConcurrentCrashWithWatchpointBreakpointSignal.py (1999 of 2028) PASS: lldb-unit :: Process/minidump/./LLDBMinidumpTests/MinidumpParserTest.GetThreadsAndGetThreadContext (2000 of 2028) PASS: lldb-unit :: Utility/./UtilityTests/StringExtractorTest.DecodeHexU8_Extra (2001 of 2028) PASS: lldb-api :: functionalities/process_group/TestChangeProcessGroup.py (2002 of 2028) PASS: lldb-unit :: Host/./HostTests/Host.WaitStatusFormat (2003 of 2028) PASS: lldb-api :: commands/process/attach-resume/TestAttachResume.py (2004 of 2028) PASS: lldb-unit :: Utility/./UtilityTests/StreamTest.PutPtr (2005 of 2028) PASS: lldb-api :: commands/quit/TestQuit.py (2006 of 2028) PASS: lldb-shell :: SymbolFile/DWARF/apple-index-is-used.cpp (2007 of 2028) UNSUPPORTED: lldb-api :: functionalities/darwin_log/filter/exact_match/activity-chain/TestDarwinLogFilterMatchActivityChain.py (2008 of 2028) UNSUPPORTED: lldb-api :: functionalities/tty/TestTerminal.py (2009 of 2028) PASS: lldb-unit :: Utility/./UtilityTests/Flags.Test (2010 of 2028) UNSUPPORTED: lldb-api :: lang/cpp/static_members/TestCPPStaticMembers.py (2011 of 2028) PASS: lldb-unit :: Host/./HostTests/Host.GetEnvironment (2012 of 2028) PASS: lldb-unit :: Utility/./UtilityTests/StreamTest.PutHex64ByteOrderBig (2013 of 2028) PASS: lldb-shell :: Reproducer/Modules/TestModuleCXX.test (2014 of 2028) UNSUPPORTED: lldb-shell :: SymbolFile/PDB/typedefs.test (2015 of 2028) PASS: lldb-unit :: Utility/./UtilityTests/ScalarTest.Scalar_512 (2016 of 2028) PASS: lldb-shell :: VSCode/TestOptions.test (2017 of 2028) UNSUPPORTED: lldb-api :: functionalities/data-formatter/data-formatter-stl/libstdcpp/map/TestDataFormatterStdMap.py (2018 of 2028) UNSUPPORTED: lldb-shell :: ObjectFile/ELF/minidebuginfo-no-lzma.yaml (2019 of 2028) PASS: lldb-api :: functionalities/thread/concurrent_events/TestConcurrentManyBreakpoints.py (2020 of 2028) PASS: lldb-shell :: SymbolFile/DWARF/parallel-indexing-stress.s (2021 of 2028) PASS: lldb-unit :: Utility/./UtilityTests/ArgsTest.TestMultipleArgs (2022 of 2028) PASS: lldb-unit :: Symbol/./SymbolTests/TestTypeSystemClang.TestDeletingImplicitCopyCstrDueToMoveCStr (2023 of 2028) PASS: lldb-unit :: Utility/./UtilityTests/DataExtractorTest.GetCStrEmpty (2024 of 2028) PASS: lldb-api :: functionalities/process_crash_info/TestProcessCrashInfo.py (2025 of 2028) PASS: lldb-api :: lang/cpp/frame-var-anon-unions/TestFrameVariableAnonymousUnions.py (2026 of 2028) PASS: lldb-api :: commands/expression/import-std-module/deque-dbg-info-content/TestDbgInfoContentDequeFromStdModule.py (2027 of 2028) PASS: lldb-api :: lang/objc/objc-stepping/TestObjCStepping.py (2028 of 2028) Slowest Tests: -------------------------------------------------------------------------- 351.53s: lldb-api :: tools/lldb-server/TestLldbGdbServer.py 265.00s: lldb-api :: lang/cpp/enum_types/TestCPP11EnumTypes.py 254.53s: lldb-api :: api/multithreaded/TestMultithreaded.py 245.61s: lldb-api :: tools/lldb-server/TestGdbRemoteThreadsInStopReply.py 157.69s: lldb-api :: lang/objc/exceptions/TestObjCExceptions.py 154.67s: lldb-api :: lang/cpp/namespace/TestNamespaceLookup.py 142.37s: lldb-api :: lang/objc/real-definition/TestRealDefinition.py 120.62s: lldb-api :: types/TestLongTypesExpr.py 119.49s: lldb-api :: tools/lldb-server/TestGdbRemote_qThreadStopInfo.py 111.84s: lldb-api :: lang/objc/foundation/TestObjCMethods.py 103.07s: lldb-api :: lang/objcxx/class-name-clash/TestNameClash.py 100.97s: lldb-api :: lang/objc/forward-decl/TestForwardDecl.py 91.65s: lldb-api :: functionalities/gdb_remote_client/TestWasm.py 90.52s: lldb-api :: commands/settings/TestSettings.py 87.12s: lldb-api :: types/TestCharTypeExpr.py 86.35s: lldb-api :: functionalities/data-formatter/compactvectors/TestCompactVectors.py 80.07s: lldb-api :: types/TestLongTypes.py 79.56s: lldb-api :: python_api/lldbutil/iter/TestLLDBIterator.py 78.76s: lldb-api :: api/check_public_api_headers/TestPublicAPIHeaders.py 75.62s: lldb-api :: types/TestIntegerTypeExpr.py

Hide Details

Tests Times: -------------------------------------------------------------------------- [ Range ] :: [ Percentage ] :: [ Count ] -------------------------------------------------------------------------- [340s,360s) :: [ ] :: [ 1/2028] [320s,340s) :: [ ] :: [ 0/2028] [300s,320s) :: [ ] :: [ 0/2028] [280s,300s) :: [ ] :: [ 0/2028] [260s,280s) :: [ ] :: [ 2/2028] [240s,260s) :: [ ] :: [ 1/2028] [220s,240s) :: [ ] :: [ 0/2028] [200s,220s) :: [ ] :: [ 0/2028] [180s,200s) :: [ ] :: [ 0/2028] [160s,180s) :: [ ] :: [ 1/2028] [140s,160s) :: [ ] :: [ 2/2028] [120s,140s) :: [ ] :: [ 2/2028] [100s,120s) :: [ ] :: [ 3/2028] [ 80s,100s) :: [ ] :: [ 7/2028] [ 60s, 80s) :: [ ] :: [ 19/2028] [ 40s, 60s) :: [* ] :: [ 88/2028] [ 20s, 40s) :: [** ] :: [ 126/2028] [ 0s, 20s) :: [*********************************** ] :: [1776/2028] -------------------------------------------------------------------------- ******************** Failing Tests (53): lldb-api :: lang/objc/modules/TestObjCModules.py lldb-api :: lang/objc/forward-decl/TestForwardDecl.py lldb-api :: lang/objc/modules-non-objc-target/TestObjCModulesNonObjCTarget.py lldb-api :: lang/objcxx/cxx-bridged-po/TestObjCXXBridgedPO.py lldb-api :: lang/objc/hidden-ivars/TestHiddenIvars.py lldb-api :: lang/objc/objc_direct-methods/TestObjCDirectMethods.py lldb-api :: commands/expression/namespace_local_var_same_name_obj_c/TestNamespaceLocalVarSameNameObjC.py lldb-api :: lang/objc/objc-ivar-protocols/TestIvarProtocols.py lldb-api :: lang/objc/conflicting-definition/TestConflictingDefinition.py lldb-api :: lang/objc/unicode-string/TestUnicodeString.py lldb-api :: lang/objc/rdar-11355592/TestRdar11355592.py lldb-api :: lang/objc/objc-super/TestObjCSuper.py lldb-api :: lang/objc/blocks/TestObjCIvarsInBlocks.py lldb-api :: lang/objc/foundation/TestObjCMethodsNSArray.py lldb-api :: functionalities/data-formatter/data-formatter-objc/nsindexpath/TestDataFormatterNSIndexPath.py lldb-api :: lang/objc/objc-struct-argument/TestObjCStructArgument.py lldb-api :: commands/expression/persist_objc_pointeetype/TestPersistObjCPointeeType.py lldb-api :: lang/objc/self/TestObjCSelf.py lldb-api :: lang/objc/objc-new-syntax/TestObjCNewSyntaxLiteral.py lldb-api :: lang/objc/foundation/TestConstStrings.py lldb-api :: functionalities/data-formatter/data-formatter-objc/TestDataFormatterObjCCF.py lldb-api :: lang/objc/foundation/TestRuntimeTypes.py lldb-api :: lang/objc/objc-optimized/TestObjcOptimized.py lldb-api :: commands/expression/context-object-objc/TestContextObjectObjc.py lldb-api :: functionalities/data-formatter/poarray/TestPrintObjectArray.py lldb-api :: lang/objc/objc-runtime-ivars/TestRuntimeIvars.py lldb-api :: functionalities/data-formatter/synthupdate/TestSyntheticFilterRecompute.py lldb-api :: functionalities/data-formatter/data-formatter-objc/TestDataFormatterObjCExpr.py lldb-api :: lang/objc/objc-static-method/TestObjCStaticMethod.py lldb-api :: lang/objc/objc-struct-return/TestObjCStructReturn.py lldb-api :: commands/expression/call-throws/TestCallThatThrows.py lldb-api :: functionalities/data-formatter/data-formatter-objc/TestDataFormatterObjCNSContainer.py lldb-api :: commands/expression/diagnostics/TestExprDiagnostics.py lldb-api :: lang/objc/objc-new-syntax/TestObjCNewSyntaxDictionary.py lldb-api :: lang/objc/foundation/TestObjCMethods.py lldb-api :: lang/objc/radar-9691614/TestObjCMethodReturningBOOL.py lldb-api :: lang/objc/objc-new-syntax/TestObjCNewSyntaxArray.py lldb-api :: lang/objc/objc++/TestObjCXX.py lldb-api :: lang/objc/objc-property/TestObjCProperty.py lldb-api :: lang/objc/variadic_methods/TestVariadicMethods.py lldb-api :: commands/expression/import_builtin_fileid/TestImportBuiltinFileID.py lldb-api :: functionalities/data-formatter/data-formatter-objc/TestDataFormatterObjCNSError.py lldb-api :: lang/objcxx/objcxx-ivar-vector/TestIvarVector.py lldb-api :: lang/objc/foundation/TestObjCMethodsNSError.py lldb-api :: commands/expression/two-files/TestObjCTypeQueryFromOtherCompileUnit.py lldb-api :: functionalities/set-data/TestSetData.py lldb-api :: lang/objc/orderedset/TestOrderedSet.py lldb-api :: lang/objc/objc-class-method/TestObjCClassMethod.py lldb-api :: lang/objc/foundation/TestObjCMethodsString.py lldb-api :: lang/objc/bitfield_ivars/TestBitfieldIvars.py lldb-api :: python_api/exprpath_synthetic/TestExprPathSynthetic.py lldb-api :: commands/expression/po_verbosity/TestPoVerbosity.py lldb-api :: lang/objc/print-obj/TestPrintObj.py

Hide Details

Hide Details

Testing Time: 4161.94s Unsupported Tests : 170 Expected Passes : 1799 Expected Failures : 6 Unexpected Failures: 53 FAILED: tools/lldb/test/CMakeFiles/check-lldb-lit cd /Users/buildslave/jenkins/workspace/lldb-cmake-sanitized/lldb-build/tools/lldb/test && /usr/local/Frameworks/Python.framework/Versions/3.7/bin/python3.7 /Users/buildslave/jenkins/workspace/lldb-cmake-sanitized/lldb-build/./bin/llvm-lit -v --time-tests --shuffle --xunit-xml-output=/Users/buildslave/jenkins/workspace/lldb-cmake-sanitized/test/results.xml -v -j 4 --timeout 1200 /Users/buildslave/jenkins/workspace/lldb-cmake-sanitized/lldb-build/tools/lldb/test ninja: build stopped: subcommand failed. Command failed: Command '['/usr/bin/env', 'TERM=vt100', '/usr/local/bin/ninja', '-v', 'check-lldb']' returned non-zero exit status 1. Command: ['/usr/bin/env', 'TERM=vt100', '/usr/local/bin/ninja', '-v', 'check-lldb'] [Pipeline] } [Pipeline] // timeout [Pipeline] } [Pipeline] // stage [Pipeline] stage [Pipeline] { (Declarative: Post Actions) [Pipeline] scanForIssues [Clang (LLVM based)] Sleeping for 5 seconds due to JENKINS-32191... [Clang (LLVM based)] Parsing console log (workspace: '/Users/buildslave/jenkins/workspace/lldb-cmake-sanitized') [Clang (LLVM based)] Successfully parsed console log [Clang (LLVM based)] -> found 2 issues (skipped 0 duplicates) [Clang (LLVM based)] Post processing issues on 'green-dragon-23' with source code encoding 'UTF-8' [Clang (LLVM based)] Creating SCM blamer to obtain author and commit information for affected files [Clang (LLVM based)] Creating SCM miner to obtain statistics for affected repository files [Clang (LLVM based)] Resolving file names for all issues in source directory '/Users/buildslave/jenkins/workspace/lldb-cmake-sanitized' [Clang (LLVM based)] -> resolved paths in source directory (1 found, 0 not found) [Clang (LLVM based)] Resolving module names from module definitions (build.xml, pom.xml, or Manifest.mf files) [Clang (LLVM based)] -> resolved module names for 2 issues [Clang (LLVM based)] Resolving package names (or namespaces) by parsing the affected files [Clang (LLVM based)] -> resolved package names of 1 affected files [Clang (LLVM based)] No filter has been set, publishing all 2 issues [Clang (LLVM based)] Creating fingerprints for all affected code blocks to track issues over different builds [Clang (LLVM based)] -> created fingerprints for 2 issues (skipped 0 issues) [Clang (LLVM based)] Copying affected files to Jenkins' build folder '/Users/Shared/Jenkins/Home/jobs/lldb-cmake-sanitized/builds/1493/files-with-issues' [Clang (LLVM based)] -> 1 copied, 0 not in workspace, 0 not-found, 0 with I/O error [Pipeline] junit Recording test results [Pipeline] } [Pipeline] // stage [Pipeline] } [Pipeline] // withEnv [Pipeline] } [Pipeline] // node [Pipeline] End of Pipeline ERROR: script returned exit code 1 Finished: FAILURE