FailedConsole Output

Skipping 8,357 KB.. Full Log
0 u' '
  [7] = U+006d u'm'
  [8] = U+0075 u'u'
  [9] = U+0063 u'c'
  [10] = U+0068 u'h'
  [11] = U+0020 u' '
  [12] = U+0062 u'b'
  [13] = U+006f u'o'
  [14] = U+0072 u'r'
  [15] = U+0069 u'i'
  [16] = U+006e u'n'
  [17] = U+0067 u'g'
  [18] = U+0020 u' '
  [19] = U+0074 u't'
  [20] = U+0061 u'a'
  [21] = U+0073 u's'
  [22] = U+006b u'k'
  [23] = U+0020 u' '
  [24] = U+0074 u't'
  [25] = U+006f u'o'
  [26] = U+0020 u' '
  [27] = U+0077 u'w'
  [28] = U+0072 u'r'
  [29] = U+0069 u'i'
  [30] = U+0074 u't'
  [31] = U+0065 u'e'
  [32] = U+0020 u' '
  [33] = U+0061 u'a'
  [34] = U+0020 u' '
  [35] = U+0073 u's'
  [36] = U+0074 u't'
  [37] = U+0072 u'r'
  [38] = U+0069 u'i'
  [39] = U+006e u'n'
  [40] = U+0067 u'g'
  [41] = U+0020 u' '
  [42] = U+0074 u't'
  [43] = U+0068 u'h'
  [44] = U+0069 u'i'
  [45] = U+0073 u's'
  [46] = U+0020 u' '
  [47] = U+0077 u'w'
  [48] = U+0061 u'a'
  [49] = U+0079 u'y'
  [50] = U+0021 u'!'
  [51] = U+0021 u'!'
  [52] = U+03c3 u'σ'
  [53] = U+0000 u'\0'
}
(NSString *) str9 = 0x000060d000001be0 @"a very much boring task to write a string this way!!σ\0"
(const unichar [2]) myNextCharacters = {
  [0] = U+03c3 u'σ'
  [1] = U+0000 u'\0'
}
(NSString *) str10 = 0x000060c000002200 @"This is a Unicode string σ number 4 right here"
(NSString *) str11 = 0x0000603000003250 @"__NSCFString"
(NSString *) label1 = 0x0000000100006210 @"Process Name: "
(NSString *) label2 = 0x0000000100006230 @"Process Id: "
(NSString *) processName = 0x2444c7e3874b23f5 @"a.out"
(NSString *) processID = 0x244486a5d85c7bf5 @"99035"
(NSString *) str12 = 0x0000606000008f00 @"Process Name:  a.out Process Id:  99035"
(NSString *) strA1 = 0x0000606000008f60 @"A rather short ASCII NSString object is here"
(NSString *) strA2 = 0x0000606000008fc0 @"A rather short UTF8 NSString object is here"
(NSString *) strA3 = 0x0000000100006170 @"A string made with the at sign is here"
(NSString *) strA4 = 0x0000606000009020 @"This is string number 4 right here"
(NSString *) strA5 = 0x00006040000019d0 @"{{1, 1}, {5, 5}}"
(NSString *) strA6 = 0x00006030000032e0 @"1ST"
(NSString *) strA7 = 0x0000603000003310 @"σxx"
(NSString *) strA8 = 0x000061b000001580 @"hasVeryLongExtensionThisTimehasVeryLongExtensionThisTimehasVeryLongExtensionThisTimehasVeryLongExtensionThisTimehasVeryLongExtensionThisTimehasVeryLongExtensionThisTimehasVeryLongExtensionThisTimehasVeryLongExtensionThisTimehasVeryLongExtensionThisTimehasVeryLongExtensionThisTimehasVeryLongExtensionThisTimehasVeryLongExtensionThisTimehasVeryLongExtensionThisTimehasVeryLongExtensionThisTimehasVeryLongExtensionThisTimehasVeryLongExtensionThisTimehasVeryLongExtensionThisTimehasVeryLongExtensionThisTimehasVeryLongExtensionThisTimehasVeryLongExtensionThisTimehasVeryLongExtensionThisTimehasVeryLongExtensionThisTimehasVeryLongExtensionThisTimehasVeryLongExtensionThisTimehasVeryLongExtensionThisTimehasVeryLongExtensionThisTimehasVeryLongExtensionThisTimehasVeryLongExtensionThisTime"
(NSString *) strA9 = 0x000060d000001e50 @"a very much boring task to write a string this way!!σ\0"
(NSString *) strA10 = 0x000060c000002680 @"This is a Unicode string σ number 4 right here"
(NSString *) strA11 = 0x0000603000003340 @"__NSCFString"
(NSString *) strA12 = 0x0000606000009080 @"Process Name:  a.out Process Id:  99035"
(NSString *) strB1 = 0x00006060000090e0 @"A rather short ASCII NSString object is here"
(NSString *) strB2 = 0x0000606000009140 @"A rather short UTF8 NSString object is here"
(NSString *) strB3 = 0x0000000100006170 @"A string made with the at sign is here"
(NSString *) strB4 = 0x00006060000091a0 @"This is string number 4 right here"
(NSString *) strB5 = 0x0000604000001b10 @"{{1, 1}, {5, 5}}"
(NSString *) strB6 = 0x0000603000003370 @"1ST"
(NSString *) strB7 = 0x00006030000033a0 @"σxx"
(NSString *) strB8 = 0x000061b000002380 @"hasVeryLongExtensionThisTimehasVeryLongExtensionThisTimehasVeryLongExtensionThisTimehasVeryLongExtensionThisTimehasVeryLongExtensionThisTimehasVeryLongExtensionThisTimehasVeryLongExtensionThisTimehasVeryLongExtensionThisTimehasVeryLongExtensionThisTimehasVeryLongExtensionThisTimehasVeryLongExtensionThisTimehasVeryLongExtensionThisTimehasVeryLongExtensionThisTimehasVeryLongExtensionThisTimehasVeryLongExtensionThisTimehasVeryLongExtensionThisTimehasVeryLongExtensionThisTimehasVeryLongExtensionThisTimehasVeryLongExtensionThisTimehasVeryLongExtensionThisTimehasVeryLongExtensionThisTimehasVeryLongExtensionThisTimehasVeryLongExtensionThisTimehasVeryLongExtensionThisTimehasVeryLongExtensionThisTimehasVeryLongExtensionThisTimehasVeryLongExtensionThisTimehasVeryLongExtensionThisTime"
(NSString *) strB9 = 0x000060d000001f20 @"a very much boring task to write a string this way!!σ\0"
(NSString *) strB10 = 0x000060c000002a40 @"This is a Unicode string σ number 4 right here"
(NSString *) strB11 = 0x00006030000033d0 @"__NSCFString"
(NSString *) strB12 = 0x0000606000009200 @"Process Name:  a.out Process Id:  99035"
(NSString *) strC11 = 0x0000603000003400 @"__NSCFString"
(NSString *) strC12 = 0x0000606000009260 @"Process Name:  a.out Process Id:  99035"
(NSString *) strC1 = 0x00006060000092c0 @"A rather short ASCII NSString object is here"
(NSString *) strC2 = 0x0000606000009320 @"A rather short UTF8 NSString object is here"
(NSString *) strC3 = 0x0000000100006170 @"A string made with the at sign is here"
(NSString *) strC4 = 0x0000606000009380 @"This is string number 4 right here"
(NSString *) strC5 = 0x0000604000001c90 @"{{1, 1}, {5, 5}}"
(NSString *) strC6 = 0x0000603000003430 @"1ST"
(NSString *) strC7 = 0x0000603000003460 @"σxx"
(NSString *) strC8 = 0x000061b000003180 @"hasVeryLongExtensionThisTimehasVeryLongExtensionThisTimehasVeryLongExtensionThisTimehasVeryLongExtensionThisTimehasVeryLongExtensionThisTimehasVeryLongExtensionThisTimehasVeryLongExtensionThisTimehasVeryLongExtensionThisTimehasVeryLongExtensionThisTimehasVeryLongExtensionThisTimehasVeryLongExtensionThisTimehasVeryLongExtensionThisTimehasVeryLongExtensionThisTimehasVeryLongExtensionThisTimehasVeryLongExtensionThisTimehasVeryLongExtensionThisTimehasVeryLongExtensionThisTimehasVeryLongExtensionThisTimehasVeryLongExtensionThisTimehasVeryLongExtensionThisTimehasVeryLongExtensionThisTimehasVeryLongExtensionThisTimehasVeryLongExtensionThisTimehasVeryLongExtensionThisTimehasVeryLongExtensionThisTimehasVeryLongExtensionThisTimehasVeryLongExtensionThisTimehasVeryLongExtensionThisTime"
(NSString *) strC9 = 0x000060d000001ff0 @"a very much boring task to write a string this way!!σ\0"
(NSString *) strC10 = 0x000060c000002ec0 @"This is a Unicode string σ number 4 right here"
(NSString *) strD11 = 0x0000603000003490 @"__NSCFString"
(NSString *) strD12 = 0x00006060000093e0 @"Process Name:  a.out Process Id:  99035"
(NSString *) eAcute = 0x00006030000034f0 @"é"
(NSString *) randomHaziChar = 0x0000603000003550 @"鷅"
(NSString *) japanese = 0x00000001000062b0 @"色は匂へど散りぬるを"
(NSString *) italian = 0x00000001000062d0 @"L'Italia è una Repubblica democratica, fondata sul lavoro. La sovranità appartiene al popolo, che la esercita nelle forme e nei limiti della Costituzione."
(NSString *) french = 0x00000001000062f0 @"Que veut cette horde d'esclaves, De traîtres, de rois conjurés?"
(NSString *) german = 0x0000000100006310 @"Über-Ich und aus den Ansprüchen der sozialen Umwelt"
(void *[3]) data_set = ([0] = 0x0000606000008ba0, [1] = 0x0000606000008c00, [2] = 0x0000000100006170)
(NSString *) hebrew = 0x0000000100006330 @"לילה טוב"
(NSArray *) newArray = 0x0000604000001dd0 @"50 elements"
(NSDictionary *) newDictionary = 0x0000619000001980 12 key/value pairs
(NSDictionary *) newMutableDictionary = 0x0000603000003610 21 key/value pairs
(id [4]) cfKeys = {
  [0] = 0x0000000100006350
  [1] = 0x0000000100006610
  [2] = 0x0000000100006630
  [3] = 0x0000000100006650
}
(id [4]) cfValues = {
  [0] = 0x0000000100006350
  [1] = 0x0000000100006610
  [2] = 0x0000000100006630
  [3] = 0x0000000100006650
}
(NSDictionary *) nsDictionary = 0x00006060000095c0 2 key/value pairs
(NSDictionary *) nscfDictionary = 0x0000606000009620 4 key/value pairs
(CFDictionaryRef) cfDictionaryRef = 0x00006060000095c0 2 key/value pairs
(NSAttributedString *) attrString = 0x00006030000036a0 @"hello world from foo"
(NSAttributedString *) mutableAttrString = 0x00006030000037f0 @"hello world from foo"
(NSString *) mutableString = 0x0000604000001f90 @"foo said this string needs to be very long so much longer than whatever other string has been seen ever before by anyone of the mankind that of course this is still not long enough given what foo our friend foo our lovely dearly friend foo desired of us so i am adding more stuff here for the sake of it and for the joy of our friend who is named guess what just foo. hence, dear friend foo, stay safe, your string is now  long enough to accommodate your testing need and I will make sure that if not we extend it with even more fuzzy random meaningless words pasted one after the other from a long tiresome friday evening spent working in my office. my office mate went home but I am still randomly typing just for the fun of seeing what happens of the length of a Mutable String in Cocoa if it goes beyond one byte.. so be it, dear foo"
(NSString *) mutableGetConst = 0x0000618000000080 @"foo said this string needs to be very long so much longer than whatever other string has been seen ever before by anyone of the mankind that of course this is still not long enough given what foo our friend foo our lovely dearly friend foo desired of us so i am adding more stuff here for the sake of it and for the joy of our friend who is named guess what just foo. hence, dear friend foo, stay safe, your string is now  long enough to accommodate your testing need and I will make sure that if not we extend it with even more fuzzy random meaningless words pasted one after the other from a long tiresome friday evening spent working in my office. my office mate went home but I am still randomly typing just for the fun of seeing what happens of the length of a Mutable String in Cocoa if it goes beyond one byte.. so be it, dear foo"
(NSData *) immutableData = 0x0000603000003850 5 bytes
(NSData *) mutableData = 0x0000604000002010 14 bytes
(unsigned int) concreteLength = 100000
(void *) zeroes1 = 0x0000633000000800
(NSData *) concreteData = 0x0000603000003880 100000 bytes
(void *) zeroes2 = 0x000063300001c800
(NSMutableData *) concreteMutableData = 0x0000604000002050 100000 bytes
(NSSet *) nsset = 0x0000604000002090 3 elements
(NSSet *) nsmutableset = 0x00006030000038e0 4 elements
(NSSet *) nscfSet = 0x00006040000020d0 2 elements
(CFSetRef) cfSetRef = 0x00006040000020d0 2 elements
(CFDataRef) data_ref = 0x0000607000003f20 @"5 bytes"
(CFMutableDataRef) mutable_data_ref = 0x0000607000003f90 @"5 bytes"
(CFMutableStringRef) mutable_string_ref = 0x0000604000002110 @"Wish ya knew"
(CFStringRef) cfstring_ref = 0x00000001000066d0 @"HELLO WORLD"
(CFArrayRef) cfarray_ref = 0x0000607000004000 @"3 elements"
(CFMutableArrayRef) mutable_array_ref = 0x0000604000002150 @"11 elements"
(CFBinaryHeapRef) binheap_ref = 0x000060c000003640 @"21 items"
(CFURLRef) cfurl_ref = 0x000060b000002350 @"http://www.foo.bar/"
(CFURLRef) cfchildurl_ref = 0x00006070000040e0 @"page.html -- http://www.foo.bar/"
(CFURLRef) cfgchildurl_ref = 0x0000607000004150 @"?whatever -- http://www.foo.bar/page.html"
(NSDictionary *) error_userInfo = 0x0000606000009e60 2 key/value pairs
(NSError *) nserror = 0x0000604000002290 domain: @"Foobar" - code: 12
(NSError **) nserrorptr = 0x00007ffeefbff078 domain: @"Foobar" - code: 12
(NSBundle *) bundle_string = 0x0000607000004310 @"/System/Library/Frameworks/Accelerate.framework"
(NSBundle *) bundle_url = 0x0000607000004af0 @"/System/Library/Frameworks/Foundation.framework"
(NSBundle *) main_bundle = 0x0000607000004cb0 @"/Users/buildslave/jenkins/workspace/lldb-cmake-sanitized/lldb-build/lldb-test-build.noindex/functionalities/data-formatter/data-formatter-objc/TestDataFormatterObjCCF.test_coreframeworks_and_run_command_dsym"
(NSArray *) bundles = 0x0000604000002450 @"1 element"
(NSURL *) nsurl0 = 0x0000608000001320 @"file:///Users/buildslave/jenkins/workspace/lldb-cmake-sanitized/lldb-build/lldb-test-build.noindex/functionalities/data-formatter/data-formatter-objc/TestDataFormatterObjCCF.test_coreframeworks_and_run_command_dsym/"
(NSException *) except0 = 0x00006040000024d0 @"First"
(NSException *) except1 = 0x0000604000002510 @"Second"
(NSException *) except2 = 0x0000604000002550 @"Third"
(NSException *) except3 = 0x0000604000002590 @"Fourth"
(NSURL *) nsurl = 0x000060b0000028d0 @"http://www.foo.bar"
(NSURL *) nsurl2 = 0x0000607000004ee0 @"page.html -- http://www.foo.bar"
(NSURL *) nsurl3 = 0x0000607000004f50 @"?whatever -- http://www.foo.bar/page.html"
(NSDate *) date1 = 0xe5f9276a886542ad 1985-04-10 18:00:00 UTC
(NSDate *) date2 = 0x0000604000008e90 2011-01-01 08:00:00 UTC
(NSDate *) date3 = 0x0000602000003bb0 2020-06-03 09:51:28 UTC
(NSDate *) date4 = 0xe58994ad686542ad 1970-01-02 00:00:00 UTC
(NSDate *) date5 = 0x6586f043f86542ad 2020-06-03 09:51:28 UTC
(CFAbsoluteTime) date1_abs = 1985-04-10 10:00:00 PST
(CFAbsoluteTime) date2_abs = 2011-01-01 00:00:00 PST
(CFAbsoluteTime) date3_abs = 2020-06-03 02:51:28 PDT
(CFAbsoluteTime) date4_abs = 1970-01-01 16:00:00 PST
(CFAbsoluteTime) date5_abs = 2020-06-03 02:51:28 PDT
(NSIndexSet *) iset1 = 0x00006030000097f0 4 indexes
(NSIndexSet *) iset2 = 0x0000603000009820 512 indexes
(NSMutableIndexSet *) imset = 0x0000604000008f10 10 indexes
(CFTimeZoneRef) cupertino = 0x0000608000001a20 @"America/Los_Angeles"
(CFTimeZoneRef) home = 0x0000608000001ba0 @"Europe/Rome"
(CFTimeZoneRef) europe = 0x0000608000001d20 @"Europe/Paris"
(NSTimeZone *) cupertino_ns = 0x0000608000001a20 @"America/Los_Angeles"
(NSTimeZone *) home_ns = 0x0000608000001ba0 @"Europe/Rome"
(NSTimeZone *) europe_ns = 0x0000608000001d20 @"Europe/Paris"
(CFGregorianUnits) cf_greg_units = 1 years, 3 months, 5 days, 12 hours, 5 minutes 7 seconds
(CFGregorianDate) cf_greg_date = @"4/10/1985 18:0:0"
(CFRange) cf_range = location=4 length=4
(NSPoint) ns_point = (x = 4, y = 4)
(NSRange) ns_range = location=4, length=4
(NSRect) ns_rect = (origin = (x = 1, y = 1), size = (width = 5, height = 5))
(NSRect *) ns_rect_ptr = (origin = (x = 1, y = 1), size = (width = 5, height = 5))
(NSRectArray) ns_rect_arr = ((x = 1, y = 1), (width = 5, height = 5)), ...
(NSSize) ns_size = (width = 5, height = 7)
(NSSize *) ns_size_ptr = (width = 5, height = 7)
(CGSize) cg_size = (width = 1, height = 6)
(CGPoint) cg_point = (x = 2, y = 7)
(CGRect) cg_rect = (origin = (x = 1, y = 2), size = (width = 7, height = 7))
(RGBColor) rgb_color = red=3 green=56 blue=35
(RGBColor *) rgb_color_ptr = red=3 green=56 blue=35
(Rect) rect = (t=4, l=8, b=4, r=7)
(Rect *) rect_ptr = (t=4, l=8, b=4, r=7)
(Point) point = (v=7, h=12)
(Point *) point_ptr = (v=7, h=12)
(HIPoint) hi_point = (x=7, y=12)
(HIRect) hi_rect = origin=(x = 3, y = 5) size=(width = 4, height = 6)
(SEL) foo_selector = "foo_selector_impl"
(CFMutableBitVectorRef) mut_bv = 0x0000604000009490 1110 0110 1011 0000 1101 1010 1000 1111 0011 0101 1101 0001 00
(Molecule *) molecule = 0x0000602000003c50
(Class) myclass = NSValue
(Class) myclass2 = NSTaggedPointerString
(Class) myclass3 = Molecule
(Class) myclass4 = NSMutableArray
(Class) myclass5 = nil
(NSArray *) components = 0x00006040000094d0 @"3 elements"
(NSString *) path = 0x0000604000009510 @"usr/blah/stuff"

Hide Details

Hide Details

Expecting sub string: (RGBColor) rgb_color = red=3 green=56 blue=35 Matched

Hide Details

Expecting sub string: (RGBColor *) rgb_color_ptr = red=3 green=56 blue=35 Matched

Hide Details

Expecting sub string: (HIPoint) hi_point = (x=7, y=12) Matched

Hide Details

Expecting sub string: (HIRect) hi_rect = origin=(x = 3, y = 5) size=(width = 4, height = 6) Matched

Hide Details

<bound method SBProcess.Kill of <lldb.SBProcess; proxy of <Swig Object of type 'lldb::SBProcess *' at 0x1221d5300> >>: success

Hide Details

PASS: LLDB (/Users/buildslave/jenkins/workspace/lldb-cmake-sanitized/lldb-build/bin/clang-11-x86_64) :: test_coreframeworks_and_run_command_dsym (TestDataFormatterObjCCF.ObjCDataFormatterCF) runCmd: settings clear -all output:

Hide Details

runCmd: settings set symbols.enable-external-lookup false output:

Hide Details

runCmd: settings set target.auto-apply-fixits false output:

Hide Details

runCmd: settings set plugin.process.gdb-remote.packet-timeout 60 output:

Hide Details

runCmd: settings set symbols.clang-modules-cache-path "/Users/buildslave/jenkins/workspace/lldb-cmake-sanitized/lldb-build/lldb-test-build.noindex/module-cache-lldb/lldb-api" output:

Hide Details

runCmd: settings set use-color false output:

Hide Details

runCmd: setting set target.prefer-dynamic-value no-dynamic-values output:

Hide Details

runCmd: settings set target.env-vars ASAN_OPTIONS=detect_stack_use_after_return=1 DYLD_INSERT_LIBRARIES=/Users/buildslave/jenkins/workspace/lldb-cmake-sanitized/host-compiler/lib/clang/11.0.0/lib/darwin/libclang_rt.asan_osx_dynamic.dylib output:

Hide Details

runCmd: settings set target.env-vars ASAN_OPTIONS=detect_stack_use_after_return=1 DYLD_INSERT_LIBRARIES=/Users/buildslave/jenkins/workspace/lldb-cmake-sanitized/host-compiler/lib/clang/11.0.0/lib/darwin/libclang_rt.asan_osx_dynamic.dylib output:

Hide Details

runCmd: thread list output: Process 99626 stopped * thread #1: tid = 0x17af50, 0x000000010000489b a.out`main(argc=1, argv=0x00007ffeefbff670) at main.m:770:4, queue = 'com.apple.main-thread', stop reason = breakpoint 1.1 thread #2: tid = 0x17afb6, 0x00007fff7d8915be libsystem_kernel.dylib`__workq_kernreturn + 10 thread #3: tid = 0x17afb7, 0x00007fff7d8915be libsystem_kernel.dylib`__workq_kernreturn + 10

Hide Details

Hide Details

Expecting sub string: stopped Matched

Hide Details

Expecting sub string: stop reason = breakpoint Matched

Hide Details

runCmd: frame variable output: (int) argc = 1 (const char **) argv = 0x00007ffeefbff670 (NSAutoreleasePool *) pool = 0x00006040000016d0 (MyClass *) object = 0x0000603000002ef0 (MyOtherClass *) object2 = 0x0000603000002f20 (NSNumber *) num1 = 0x1c6dcaef2136c625 (int)5 (NSNumber *) num2 = 0x0000603000002fb0 (float)3.140000 (NSNumber *) num3 = 0x0000603000002fe0 (double)3.14 (NSNumber *) num4 = 0x0000603000003010 (int128_t)18446744073709551614 (NSNumber *) num5 = 0x1c6dcaef21368205 (char)65 (NSNumber *) num6 = 0x1c6dcaef21363c35 (long)255 (NSNumber *) num7 = 0x1c6dcaef3fb24335 (long)2000000 (NSNumber *) num8_Y = 0x00007fffa7fe6c30 YES (NSNumber *) num8_N = 0x00007fffa7fe6c40 NO (NSNumber *) num9 = 0xe3923510deb24315 (short)-31616 (NSNumber *) num_at1 = 0x1c6dcaef2136cf25 (int)12 (NSNumber *) num_at2 = 0xe3923510dec93725 (int)-12 (NSNumber *) num_at3 = 0x0000603000003040 (double)12.5 (NSNumber *) num_at4 = 0x0000603000003070 (double)-12.5 (NSDecimalNumber *) decimal_number = 0x00006030000030a0 123456 x 10^-10 (NSDecimalNumber *) decimal_number_neg = 0x00006030000030d0 -123456 x 10^10 (NSDecimalNumber *) decimal_one = 0x0000603000003100 1 x 10^0 (NSDecimalNumber *) decimal_zero = 0x0000602000002370 0 (NSDecimalNumber *) decimal_nan = 0x0000602000002390 NaN (NSString *) str0 = 0x1c6dcaef1403f137 @"255" (NSString *) str1 = 0x0000606000008ba0 @"A rather short ASCII NSString object is here" (NSString *) str2 = 0x0000606000008c00 @"A rather short UTF8 NSString object is here" (NSString *) str3 = 0x0000000100006170 @"A string made with the at sign is here" (NSString *) str4 = 0x0000606000008c60 @"This is string number 4 right here" (NSRect) ns_rect_4str = (origin = (x = 1, y = 1), size = (width = 5, height = 5)) (NSString *) str5 = 0x0000604000001810 @"{{1, 1}, {5, 5}}" (NSString *) str6 = 0x00006030000031f0 @"1ST" (const unichar [3]) myCharacters = { [0] = U+03c3 u'σ' [1] = U+0078 u'x' [2] = U+0078 u'x' } (NSString *) str7 = 0x0000603000003220 @"σxx" (NSString *) str8 = 0x000061b000000780 @"hasVeryLongExtensionThisTimehasVeryLongExtensionThisTimehasVeryLongExtensionThisTimehasVeryLongExtensionThisTimehasVeryLongExtensionThisTimehasVeryLongExtensionThisTimehasVeryLongExtensionThisTimehasVeryLongExtensionThisTimehasVeryLongExtensionThisTimehasVeryLongExtensionThisTimehasVeryLongExtensionThisTimehasVeryLongExtensionThisTimehasVeryLongExtensionThisTimehasVeryLongExtensionThisTimehasVeryLongExtensionThisTimehasVeryLongExtensionThisTimehasVeryLongExtensionThisTimehasVeryLongExtensionThisTimehasVeryLongExtensionThisTimehasVeryLongExtensionThisTimehasVeryLongExtensionThisTimehasVeryLongExtensionThisTimehasVeryLongExtensionThisTimehasVeryLongExtensionThisTimehasVeryLongExtensionThisTimehasVeryLongExtensionThisTimehasVeryLongExtensionThisTimehasVeryLongExtensionThisTime" (const unichar [54]) myOtherCharacters = { [0] = U+0061 u'a' [1] = U+0020 u' ' [2] = U+0076 u'v' [3] = U+0065 u'e' [4] = U+0072 u'r' [5] = U+0079 u'y' [6] = U+0020 u' ' [7] = U+006d u'm' [8] = U+0075 u'u' [9] = U+0063 u'c' [10] = U+0068 u'h' [11] = U+0020 u' ' [12] = U+0062 u'b' [13] = U+006f u'o' [14] = U+0072 u'r' [15] = U+0069 u'i' [16] = U+006e u'n' [17] = U+0067 u'g' [18] = U+0020 u' ' [19] = U+0074 u't' [20] = U+0061 u'a' [21] = U+0073 u's' [22] = U+006b u'k' [23] = U+0020 u' ' [24] = U+0074 u't' [25] = U+006f u'o' [26] = U+0020 u' ' [27] = U+0077 u'w' [28] = U+0072 u'r' [29] = U+0069 u'i' [30] = U+0074 u't' [31] = U+0065 u'e' [32] = U+0020 u' ' [33] = U+0061 u'a' [34] = U+0020 u' ' [35] = U+0073 u's' [36] = U+0074 u't' [37] = U+0072 u'r' [38] = U+0069 u'i' [39] = U+006e u'n' [40] = U+0067 u'g' [41] = U+0020 u' ' [42] = U+0074 u't' [43] = U+0068 u'h' [44] = U+0069 u'i' [45] = U+0073 u's' [46] = U+0020 u' ' [47] = U+0077 u'w' [48] = U+0061 u'a' [49] = U+0079 u'y' [50] = U+0021 u'!' [51] = U+0021 u'!' [52] = U+03c3 u'σ' [53] = U+0000 u'\0' } (NSString *) str9 = 0x000060d000001be0 @"a very much boring task to write a string this way!!σ\0" (const unichar [2]) myNextCharacters = { [0] = U+03c3 u'σ' [1] = U+0000 u'\0' } (NSString *) str10 = 0x000060c000002200 @"This is a Unicode string σ number 4 right here" (NSString *) str11 = 0x0000603000003250 @"__NSCFString" (NSString *) label1 = 0x0000000100006210 @"Process Name: " (NSString *) label2 = 0x0000000100006230 @"Process Id: " (NSString *) processName = 0x1c6dbe9a4e18a257 @"a.out" (NSString *) processID = 0x1c6dfcdd170ffa57 @"99626" (NSString *) str12 = 0x0000606000008f00 @"Process Name: a.out Process Id: 99626" (NSString *) strA1 = 0x0000606000008f60 @"A rather short ASCII NSString object is here" (NSString *) strA2 = 0x0000606000008fc0 @"A rather short UTF8 NSString object is here" (NSString *) strA3 = 0x0000000100006170 @"A string made with the at sign is here" (NSString *) strA4 = 0x0000606000009020 @"This is string number 4 right here" (NSString *) strA5 = 0x00006040000019d0 @"{{1, 1}, {5, 5}}" (NSString *) strA6 = 0x00006030000032e0 @"1ST" (NSString *) strA7 = 0x0000603000003310 @"σxx" (NSString *) strA8 = 0x000061b000001580 @"hasVeryLongExtensionThisTimehasVeryLongExtensionThisTimehasVeryLongExtensionThisTimehasVeryLongExtensionThisTimehasVeryLongExtensionThisTimehasVeryLongExtensionThisTimehasVeryLongExtensionThisTimehasVeryLongExtensionThisTimehasVeryLongExtensionThisTimehasVeryLongExtensionThisTimehasVeryLongExtensionThisTimehasVeryLongExtensionThisTimehasVeryLongExtensionThisTimehasVeryLongExtensionThisTimehasVeryLongExtensionThisTimehasVeryLongExtensionThisTimehasVeryLongExtensionThisTimehasVeryLongExtensionThisTimehasVeryLongExtensionThisTimehasVeryLongExtensionThisTimehasVeryLongExtensionThisTimehasVeryLongExtensionThisTimehasVeryLongExtensionThisTimehasVeryLongExtensionThisTimehasVeryLongExtensionThisTimehasVeryLongExtensionThisTimehasVeryLongExtensionThisTimehasVeryLongExtensionThisTime" (NSString *) strA9 = 0x000060d000001e50 @"a very much boring task to write a string this way!!σ\0" (NSString *) strA10 = 0x000060c000002680 @"This is a Unicode string σ number 4 right here" (NSString *) strA11 = 0x0000603000003340 @"__NSCFString" (NSString *) strA12 = 0x0000606000009080 @"Process Name: a.out Process Id: 99626" (NSString *) strB1 = 0x00006060000090e0 @"A rather short ASCII NSString object is here" (NSString *) strB2 = 0x0000606000009140 @"A rather short UTF8 NSString object is here" (NSString *) strB3 = 0x0000000100006170 @"A string made with the at sign is here" (NSString *) strB4 = 0x00006060000091a0 @"This is string number 4 right here" (NSString *) strB5 = 0x0000604000001b10 @"{{1, 1}, {5, 5}}" (NSString *) strB6 = 0x0000603000003370 @"1ST" (NSString *) strB7 = 0x00006030000033a0 @"σxx" (NSString *) strB8 = 0x000061b000002380 @"hasVeryLongExtensionThisTimehasVeryLongExtensionThisTimehasVeryLongExtensionThisTimehasVeryLongExtensionThisTimehasVeryLongExtensionThisTimehasVeryLongExtensionThisTimehasVeryLongExtensionThisTimehasVeryLongExtensionThisTimehasVeryLongExtensionThisTimehasVeryLongExtensionThisTimehasVeryLongExtensionThisTimehasVeryLongExtensionThisTimehasVeryLongExtensionThisTimehasVeryLongExtensionThisTimehasVeryLongExtensionThisTimehasVeryLongExtensionThisTimehasVeryLongExtensionThisTimehasVeryLongExtensionThisTimehasVeryLongExtensionThisTimehasVeryLongExtensionThisTimehasVeryLongExtensionThisTimehasVeryLongExtensionThisTimehasVeryLongExtensionThisTimehasVeryLongExtensionThisTimehasVeryLongExtensionThisTimehasVeryLongExtensionThisTimehasVeryLongExtensionThisTimehasVeryLongExtensionThisTime" (NSString *) strB9 = 0x000060d000001f20 @"a very much boring task to write a string this way!!σ\0" (NSString *) strB10 = 0x000060c000002a40 @"This is a Unicode string σ number 4 right here" (NSString *) strB11 = 0x00006030000033d0 @"__NSCFString" (NSString *) strB12 = 0x0000606000009200 @"Process Name: a.out Process Id: 99626" (NSString *) strC11 = 0x0000603000003400 @"__NSCFString" (NSString *) strC12 = 0x0000606000009260 @"Process Name: a.out Process Id: 99626" (NSString *) strC1 = 0x00006060000092c0 @"A rather short ASCII NSString object is here" (NSString *) strC2 = 0x0000606000009320 @"A rather short UTF8 NSString object is here" (NSString *) strC3 = 0x0000000100006170 @"A string made with the at sign is here" (NSString *) strC4 = 0x0000606000009380 @"This is string number 4 right here" (NSString *) strC5 = 0x0000604000001c90 @"{{1, 1}, {5, 5}}" (NSString *) strC6 = 0x0000603000003430 @"1ST" (NSString *) strC7 = 0x0000603000003460 @"σxx" (NSString *) strC8 = 0x000061b000003180 @"hasVeryLongExtensionThisTimehasVeryLongExtensionThisTimehasVeryLongExtensionThisTimehasVeryLongExtensionThisTimehasVeryLongExtensionThisTimehasVeryLongExtensionThisTimehasVeryLongExtensionThisTimehasVeryLongExtensionThisTimehasVeryLongExtensionThisTimehasVeryLongExtensionThisTimehasVeryLongExtensionThisTimehasVeryLongExtensionThisTimehasVeryLongExtensionThisTimehasVeryLongExtensionThisTimehasVeryLongExtensionThisTimehasVeryLongExtensionThisTimehasVeryLongExtensionThisTimehasVeryLongExtensionThisTimehasVeryLongExtensionThisTimehasVeryLongExtensionThisTimehasVeryLongExtensionThisTimehasVeryLongExtensionThisTimehasVeryLongExtensionThisTimehasVeryLongExtensionThisTimehasVeryLongExtensionThisTimehasVeryLongExtensionThisTimehasVeryLongExtensionThisTimehasVeryLongExtensionThisTime" (NSString *) strC9 = 0x000060d000001ff0 @"a very much boring task to write a string this way!!σ\0" (NSString *) strC10 = 0x000060c000002ec0 @"This is a Unicode string σ number 4 right here" (NSString *) strD11 = 0x0000603000003490 @"__NSCFString" (NSString *) strD12 = 0x00006060000093e0 @"Process Name: a.out Process Id: 99626" (NSString *) eAcute = 0x00006030000034f0 @"é" (NSString *) randomHaziChar = 0x0000603000003550 @"鷅" (NSString *) japanese = 0x00000001000062b0 @"色は匂へど散りぬるを" (NSString *) italian = 0x00000001000062d0 @"L'Italia è una Repubblica democratica, fondata sul lavoro. La sovranità appartiene al popolo, che la esercita nelle forme e nei limiti della Costituzione." (NSString *) french = 0x00000001000062f0 @"Que veut cette horde d'esclaves, De traîtres, de rois conjurés?" (NSString *) german = 0x0000000100006310 @"Über-Ich und aus den Ansprüchen der sozialen Umwelt" (void *[3]) data_set = ([0] = 0x0000606000008ba0, [1] = 0x0000606000008c00, [2] = 0x0000000100006170) (NSString *) hebrew = 0x0000000100006330 @"לילה טוב" (NSArray *) newArray = 0x0000604000001dd0 @"50 elements" (NSDictionary *) newDictionary = 0x0000619000001980 12 key/value pairs (NSDictionary *) newMutableDictionary = 0x0000603000003610 21 key/value pairs (id [4]) cfKeys = { [0] = 0x0000000100006350 [1] = 0x0000000100006610 [2] = 0x0000000100006630 [3] = 0x0000000100006650 } (id [4]) cfValues = { [0] = 0x0000000100006350 [1] = 0x0000000100006610 [2] = 0x0000000100006630 [3] = 0x0000000100006650 } (NSDictionary *) nsDictionary = 0x00006060000095c0 2 key/value pairs (NSDictionary *) nscfDictionary = 0x0000606000009620 4 key/value pairs (CFDictionaryRef) cfDictionaryRef = 0x00006060000095c0 2 key/value pairs (NSAttributedString *) attrString = 0x00006030000036a0 @"hello world from foo" (NSAttributedString *) mutableAttrString = 0x0000603000003790 @"hello world from foo" (NSString *) mutableString = 0x0000604000001f90 @"foo said this string needs to be very long so much longer than whatever other string has been seen ever before by anyone of the mankind that of course this is still not long enough given what foo our friend foo our lovely dearly friend foo desired of us so i am adding more stuff here for the sake of it and for the joy of our friend who is named guess what just foo. hence, dear friend foo, stay safe, your string is now long enough to accommodate your testing need and I will make sure that if not we extend it with even more fuzzy random meaningless words pasted one after the other from a long tiresome friday evening spent working in my office. my office mate went home but I am still randomly typing just for the fun of seeing what happens of the length of a Mutable String in Cocoa if it goes beyond one byte.. so be it, dear foo" (NSString *) mutableGetConst = 0x0000618000000080 @"foo said this string needs to be very long so much longer than whatever other string has been seen ever before by anyone of the mankind that of course this is still not long enough given what foo our friend foo our lovely dearly friend foo desired of us so i am adding more stuff here for the sake of it and for the joy of our friend who is named guess what just foo. hence, dear friend foo, stay safe, your string is now long enough to accommodate your testing need and I will make sure that if not we extend it with even more fuzzy random meaningless words pasted one after the other from a long tiresome friday evening spent working in my office. my office mate went home but I am still randomly typing just for the fun of seeing what happens of the length of a Mutable String in Cocoa if it goes beyond one byte.. so be it, dear foo" (NSData *) immutableData = 0x00006030000037f0 5 bytes (NSData *) mutableData = 0x0000604000002010 14 bytes (unsigned int) concreteLength = 100000 (void *) zeroes1 = 0x0000633000000800 (NSData *) concreteData = 0x0000603000003820 100000 bytes (void *) zeroes2 = 0x000063300001c800 (NSMutableData *) concreteMutableData = 0x0000604000002050 100000 bytes (NSSet *) nsset = 0x0000604000002090 3 elements (NSSet *) nsmutableset = 0x0000603000003880 4 elements (NSSet *) nscfSet = 0x00006040000020d0 2 elements (CFSetRef) cfSetRef = 0x00006040000020d0 2 elements (CFDataRef) data_ref = 0x0000607000003f20 @"5 bytes" (CFMutableDataRef) mutable_data_ref = 0x0000607000003f90 @"5 bytes" (CFMutableStringRef) mutable_string_ref = 0x0000604000002110 @"Wish ya knew" (CFStringRef) cfstring_ref = 0x00000001000066d0 @"HELLO WORLD" (CFArrayRef) cfarray_ref = 0x0000607000004000 @"3 elements" (CFMutableArrayRef) mutable_array_ref = 0x0000604000002150 @"11 elements" (CFBinaryHeapRef) binheap_ref = 0x000060c000003640 @"21 items" (CFURLRef) cfurl_ref = 0x000060b000002350 @"http://www.foo.bar/" (CFURLRef) cfchildurl_ref = 0x00006070000040e0 @"page.html -- http://www.foo.bar/" (CFURLRef) cfgchildurl_ref = 0x0000607000004150 @"?whatever -- http://www.foo.bar/page.html" (NSDictionary *) error_userInfo = 0x0000606000009e60 2 key/value pairs (NSError *) nserror = 0x0000604000002290 domain: @"Foobar" - code: 12 (NSError **) nserrorptr = 0x00007ffeefbff078 domain: @"Foobar" - code: 12 (NSBundle *) bundle_string = 0x0000607000004310 @"/System/Library/Frameworks/Accelerate.framework" (NSBundle *) bundle_url = 0x0000607000004af0 @"/System/Library/Frameworks/Foundation.framework" (NSBundle *) main_bundle = 0x0000607000004cb0 @"/Users/buildslave/jenkins/workspace/lldb-cmake-sanitized/lldb-build/lldb-test-build.noindex/functionalities/data-formatter/data-formatter-objc/TestDataFormatterObjCCF.test_coreframeworks_and_run_command_dwarf" (NSArray *) bundles = 0x0000604000002450 @"1 element" (NSURL *) nsurl0 = 0x0000608000001320 @"file:///Users/buildslave/jenkins/workspace/lldb-cmake-sanitized/lldb-build/lldb-test-build.noindex/functionalities/data-formatter/data-formatter-objc/TestDataFormatterObjCCF.test_coreframeworks_and_run_command_dwarf/" (NSException *) except0 = 0x00006040000024d0 @"First" (NSException *) except1 = 0x0000604000002510 @"Second" (NSException *) except2 = 0x0000604000002550 @"Third" (NSException *) except3 = 0x0000604000002590 @"Fourth" (NSURL *) nsurl = 0x000060b0000028d0 @"http://www.foo.bar" (NSURL *) nsurl2 = 0x0000607000004ee0 @"page.html -- http://www.foo.bar" (NSURL *) nsurl3 = 0x0000607000004f50 @"?whatever -- http://www.foo.bar/page.html" (NSDate *) date1 = 0xddd05e134136c30f 1985-04-10 18:00:00 UTC (NSDate *) date2 = 0x0000604000008e90 2011-01-01 08:00:00 UTC (NSDate *) date3 = 0x0000602000003bb0 2020-06-03 09:51:44 UTC (NSDate *) date4 = 0xdda0edd4a136c30f 1970-01-02 00:00:00 UTC (NSDate *) date5 = 0x5daf893a3936c30f 2020-06-03 09:51:44 UTC (CFAbsoluteTime) date1_abs = 1985-04-10 10:00:00 PST (CFAbsoluteTime) date2_abs = 2011-01-01 00:00:00 PST (CFAbsoluteTime) date3_abs = 2020-06-03 02:51:44 PDT (CFAbsoluteTime) date4_abs = 1970-01-01 16:00:00 PST (CFAbsoluteTime) date5_abs = 2020-06-03 02:51:44 PDT (NSIndexSet *) iset1 = 0x0000603000009760 4 indexes (NSIndexSet *) iset2 = 0x0000603000009790 512 indexes (NSMutableIndexSet *) imset = 0x0000604000008f10 10 indexes (CFTimeZoneRef) cupertino = 0x0000608000001a20 @"America/Los_Angeles" (CFTimeZoneRef) home = 0x0000608000001ba0 @"Europe/Rome" (CFTimeZoneRef) europe = 0x0000608000001d20 @"Europe/Paris" (NSTimeZone *) cupertino_ns = 0x0000608000001a20 @"America/Los_Angeles" (NSTimeZone *) home_ns = 0x0000608000001ba0 @"Europe/Rome" (NSTimeZone *) europe_ns = 0x0000608000001d20 @"Europe/Paris" (CFGregorianUnits) cf_greg_units = 1 years, 3 months, 5 days, 12 hours, 5 minutes 7 seconds (CFGregorianDate) cf_greg_date = @"4/10/1985 18:0:0" (CFRange) cf_range = location=4 length=4 (NSPoint) ns_point = (x = 4, y = 4) (NSRange) ns_range = location=4, length=4 (NSRect) ns_rect = (origin = (x = 1, y = 1), size = (width = 5, height = 5)) (NSRect *) ns_rect_ptr = (origin = (x = 1, y = 1), size = (width = 5, height = 5)) (NSRectArray) ns_rect_arr = ((x = 1, y = 1), (width = 5, height = 5)), ... (NSSize) ns_size = (width = 5, height = 7) (NSSize *) ns_size_ptr = (width = 5, height = 7) (CGSize) cg_size = (width = 1, height = 6) (CGPoint) cg_point = (x = 2, y = 7) (CGRect) cg_rect = (origin = (x = 1, y = 2), size = (width = 7, height = 7)) (RGBColor) rgb_color = red=3 green=56 blue=35 (RGBColor *) rgb_color_ptr = red=3 green=56 blue=35 (Rect) rect = (t=4, l=8, b=4, r=7) (Rect *) rect_ptr = (t=4, l=8, b=4, r=7) (Point) point = (v=7, h=12) (Point *) point_ptr = (v=7, h=12) (HIPoint) hi_point = (x=7, y=12) (HIRect) hi_rect = origin=(x = 3, y = 5) size=(width = 4, height = 6) (SEL) foo_selector = "foo_selector_impl" (CFMutableBitVectorRef) mut_bv = 0x0000604000009490 1110 0110 1011 0000 1101 1010 1000 1111 0011 0101 1101 0001 00 (Molecule *) molecule = 0x0000602000003c50 (Class) myclass = NSValue (Class) myclass2 = NSTaggedPointerString (Class) myclass3 = Molecule (Class) myclass4 = NSMutableArray (Class) myclass5 = nil (NSArray *) components = 0x00006040000094d0 @"3 elements" (NSString *) path = 0x0000604000009510 @"usr/blah/stuff"

Hide Details

Hide Details

Expecting sub string: (CFGregorianUnits) cf_greg_units = 1 years, 3 months, 5 days, 12 hours, 5 minutes 7 seconds Matched

Hide Details

Expecting sub string: (CFGregorianDate) cf_greg_date = @"4/10/1985 18:0:0" Matched

Hide Details

Expecting sub string: (CFRange) cf_range = location=4 length=4 Matched

Hide Details

Expecting sub string: (NSPoint) ns_point = (x = 4, y = 4) Matched

Hide Details

Expecting sub string: (NSRange) ns_range = location=4, length=4 Matched

Hide Details

Expecting sub string: (NSRect) ns_rect = (origin = (x = 1, y = 1), size = (width = 5, height = 5)) Matched

Hide Details

Expecting sub string: (NSRectArray) ns_rect_arr = ((x = 1, y = 1), (width = 5, height = 5)), ... Matched

Hide Details

Expecting sub string: (NSSize) ns_size = (width = 5, height = 7) Matched

Hide Details

Expecting sub string: (CGSize) cg_size = (width = 1, height = 6) Matched

Hide Details

Expecting sub string: (CGPoint) cg_point = (x = 2, y = 7) Matched

Hide Details

Expecting sub string: (CGRect) cg_rect = (origin = (x = 1, y = 2), size = (width = 7, height = 7)) Matched

Hide Details

Expecting sub string: (Rect) rect = (t=4, l=8, b=4, r=7) Matched

Hide Details

Expecting sub string: (Rect *) rect_ptr = (t=4, l=8, b=4, r=7) Matched

Hide Details

Expecting sub string: (Point) point = (v=7, h=12) Matched

Hide Details

Expecting sub string: (Point *) point_ptr = (v=7, h=12) Matched

Hide Details

Expecting sub string: (SEL) foo_selector = "foo_selector_impl" Matched

Hide Details

runCmd: frame variable output: (int) argc = 1 (const char **) argv = 0x00007ffeefbff670 (NSAutoreleasePool *) pool = 0x00006040000016d0 (MyClass *) object = 0x0000603000002ef0 (MyOtherClass *) object2 = 0x0000603000002f20 (NSNumber *) num1 = 0x1c6dcaef2136c625 (int)5 (NSNumber *) num2 = 0x0000603000002fb0 (float)3.140000 (NSNumber *) num3 = 0x0000603000002fe0 (double)3.14 (NSNumber *) num4 = 0x0000603000003010 (int128_t)18446744073709551614 (NSNumber *) num5 = 0x1c6dcaef21368205 (char)65 (NSNumber *) num6 = 0x1c6dcaef21363c35 (long)255 (NSNumber *) num7 = 0x1c6dcaef3fb24335 (long)2000000 (NSNumber *) num8_Y = 0x00007fffa7fe6c30 YES (NSNumber *) num8_N = 0x00007fffa7fe6c40 NO (NSNumber *) num9 = 0xe3923510deb24315 (short)-31616 (NSNumber *) num_at1 = 0x1c6dcaef2136cf25 (int)12 (NSNumber *) num_at2 = 0xe3923510dec93725 (int)-12 (NSNumber *) num_at3 = 0x0000603000003040 (double)12.5 (NSNumber *) num_at4 = 0x0000603000003070 (double)-12.5 (NSDecimalNumber *) decimal_number = 0x00006030000030a0 123456 x 10^-10 (NSDecimalNumber *) decimal_number_neg = 0x00006030000030d0 -123456 x 10^10 (NSDecimalNumber *) decimal_one = 0x0000603000003100 1 x 10^0 (NSDecimalNumber *) decimal_zero = 0x0000602000002370 0 (NSDecimalNumber *) decimal_nan = 0x0000602000002390 NaN (NSString *) str0 = 0x1c6dcaef1403f137 @"255" (NSString *) str1 = 0x0000606000008ba0 @"A rather short ASCII NSString object is here" (NSString *) str2 = 0x0000606000008c00 @"A rather short UTF8 NSString object is here" (NSString *) str3 = 0x0000000100006170 @"A string made with the at sign is here" (NSString *) str4 = 0x0000606000008c60 @"This is string number 4 right here" (NSRect) ns_rect_4str = (origin = (x = 1, y = 1), size = (width = 5, height = 5)) (NSString *) str5 = 0x0000604000001810 @"{{1, 1}, {5, 5}}" (NSString *) str6 = 0x00006030000031f0 @"1ST" (const unichar [3]) myCharacters = { [0] = U+03c3 u'σ' [1] = U+0078 u'x' [2] = U+0078 u'x' } (NSString *) str7 = 0x0000603000003220 @"σxx" (NSString *) str8 = 0x000061b000000780 @"hasVeryLongExtensionThisTimehasVeryLongExtensionThisTimehasVeryLongExtensionThisTimehasVeryLongExtensionThisTimehasVeryLongExtensionThisTimehasVeryLongExtensionThisTimehasVeryLongExtensionThisTimehasVeryLongExtensionThisTimehasVeryLongExtensionThisTimehasVeryLongExtensionThisTimehasVeryLongExtensionThisTimehasVeryLongExtensionThisTimehasVeryLongExtensionThisTimehasVeryLongExtensionThisTimehasVeryLongExtensionThisTimehasVeryLongExtensionThisTimehasVeryLongExtensionThisTimehasVeryLongExtensionThisTimehasVeryLongExtensionThisTimehasVeryLongExtensionThisTimehasVeryLongExtensionThisTimehasVeryLongExtensionThisTimehasVeryLongExtensionThisTimehasVeryLongExtensionThisTimehasVeryLongExtensionThisTimehasVeryLongExtensionThisTimehasVeryLongExtensionThisTimehasVeryLongExtensionThisTime" (const unichar [54]) myOtherCharacters = { [0] = U+0061 u'a' [1] = U+0020 u' ' [2] = U+0076 u'v' [3] = U+0065 u'e' [4] = U+0072 u'r' [5] = U+0079 u'y' [6] = U+0020 u' ' [7] = U+006d u'm' [8] = U+0075 u'u' [9] = U+0063 u'c' [10] = U+0068 u'h' [11] = U+0020 u' ' [12] = U+0062 u'b' [13] = U+006f u'o' [14] = U+0072 u'r' [15] = U+0069 u'i' [16] = U+006e u'n' [17] = U+0067 u'g' [18] = U+0020 u' ' [19] = U+0074 u't' [20] = U+0061 u'a' [21] = U+0073 u's' [22] = U+006b u'k' [23] = U+0020 u' ' [24] = U+0074 u't' [25] = U+006f u'o' [26] = U+0020 u' ' [27] = U+0077 u'w' [28] = U+0072 u'r' [29] = U+0069 u'i' [30] = U+0074 u't' [31] = U+0065 u'e' [32] = U+0020 u' ' [33] = U+0061 u'a' [34] = U+0020 u' ' [35] = U+0073 u's' [36] = U+0074 u't' [37] = U+0072 u'r' [38] = U+0069 u'i' [39] = U+006e u'n' [40] = U+0067 u'g' [41] = U+0020 u' ' [42] = U+0074 u't' [43] = U+0068 u'h' [44] = U+0069 u'i' [45] = U+0073 u's' [46] = U+0020 u' ' [47] = U+0077 u'w' [48] = U+0061 u'a' [49] = U+0079 u'y' [50] = U+0021 u'!' [51] = U+0021 u'!' [52] = U+03c3 u'σ' [53] = U+0000 u'\0' } (NSString *) str9 = 0x000060d000001be0 @"a very much boring task to write a string this way!!σ\0" (const unichar [2]) myNextCharacters = { [0] = U+03c3 u'σ' [1] = U+0000 u'\0' } (NSString *) str10 = 0x000060c000002200 @"This is a Unicode string σ number 4 right here" (NSString *) str11 = 0x0000603000003250 @"__NSCFString" (NSString *) label1 = 0x0000000100006210 @"Process Name: " (NSString *) label2 = 0x0000000100006230 @"Process Id: " (NSString *) processName = 0x1c6dbe9a4e18a257 @"a.out" (NSString *) processID = 0x1c6dfcdd170ffa57 @"99626" (NSString *) str12 = 0x0000606000008f00 @"Process Name: a.out Process Id: 99626" (NSString *) strA1 = 0x0000606000008f60 @"A rather short ASCII NSString object is here" (NSString *) strA2 = 0x0000606000008fc0 @"A rather short UTF8 NSString object is here" (NSString *) strA3 = 0x0000000100006170 @"A string made with the at sign is here" (NSString *) strA4 = 0x0000606000009020 @"This is string number 4 right here" (NSString *) strA5 = 0x00006040000019d0 @"{{1, 1}, {5, 5}}" (NSString *) strA6 = 0x00006030000032e0 @"1ST" (NSString *) strA7 = 0x0000603000003310 @"σxx" (NSString *) strA8 = 0x000061b000001580 @"hasVeryLongExtensionThisTimehasVeryLongExtensionThisTimehasVeryLongExtensionThisTimehasVeryLongExtensionThisTimehasVeryLongExtensionThisTimehasVeryLongExtensionThisTimehasVeryLongExtensionThisTimehasVeryLongExtensionThisTimehasVeryLongExtensionThisTimehasVeryLongExtensionThisTimehasVeryLongExtensionThisTimehasVeryLongExtensionThisTimehasVeryLongExtensionThisTimehasVeryLongExtensionThisTimehasVeryLongExtensionThisTimehasVeryLongExtensionThisTimehasVeryLongExtensionThisTimehasVeryLongExtensionThisTimehasVeryLongExtensionThisTimehasVeryLongExtensionThisTimehasVeryLongExtensionThisTimehasVeryLongExtensionThisTimehasVeryLongExtensionThisTimehasVeryLongExtensionThisTimehasVeryLongExtensionThisTimehasVeryLongExtensionThisTimehasVeryLongExtensionThisTimehasVeryLongExtensionThisTime" (NSString *) strA9 = 0x000060d000001e50 @"a very much boring task to write a string this way!!σ\0" (NSString *) strA10 = 0x000060c000002680 @"This is a Unicode string σ number 4 right here" (NSString *) strA11 = 0x0000603000003340 @"__NSCFString" (NSString *) strA12 = 0x0000606000009080 @"Process Name: a.out Process Id: 99626" (NSString *) strB1 = 0x00006060000090e0 @"A rather short ASCII NSString object is here" (NSString *) strB2 = 0x0000606000009140 @"A rather short UTF8 NSString object is here" (NSString *) strB3 = 0x0000000100006170 @"A string made with the at sign is here" (NSString *) strB4 = 0x00006060000091a0 @"This is string number 4 right here" (NSString *) strB5 = 0x0000604000001b10 @"{{1, 1}, {5, 5}}" (NSString *) strB6 = 0x0000603000003370 @"1ST" (NSString *) strB7 = 0x00006030000033a0 @"σxx" (NSString *) strB8 = 0x000061b000002380 @"hasVeryLongExtensionThisTimehasVeryLongExtensionThisTimehasVeryLongExtensionThisTimehasVeryLongExtensionThisTimehasVeryLongExtensionThisTimehasVeryLongExtensionThisTimehasVeryLongExtensionThisTimehasVeryLongExtensionThisTimehasVeryLongExtensionThisTimehasVeryLongExtensionThisTimehasVeryLongExtensionThisTimehasVeryLongExtensionThisTimehasVeryLongExtensionThisTimehasVeryLongExtensionThisTimehasVeryLongExtensionThisTimehasVeryLongExtensionThisTimehasVeryLongExtensionThisTimehasVeryLongExtensionThisTimehasVeryLongExtensionThisTimehasVeryLongExtensionThisTimehasVeryLongExtensionThisTimehasVeryLongExtensionThisTimehasVeryLongExtensionThisTimehasVeryLongExtensionThisTimehasVeryLongExtensionThisTimehasVeryLongExtensionThisTimehasVeryLongExtensionThisTimehasVeryLongExtensionThisTime" (NSString *) strB9 = 0x000060d000001f20 @"a very much boring task to write a string this way!!σ\0" (NSString *) strB10 = 0x000060c000002a40 @"This is a Unicode string σ number 4 right here" (NSString *) strB11 = 0x00006030000033d0 @"__NSCFString" (NSString *) strB12 = 0x0000606000009200 @"Process Name: a.out Process Id: 99626" (NSString *) strC11 = 0x0000603000003400 @"__NSCFString" (NSString *) strC12 = 0x0000606000009260 @"Process Name: a.out Process Id: 99626" (NSString *) strC1 = 0x00006060000092c0 @"A rather short ASCII NSString object is here" (NSString *) strC2 = 0x0000606000009320 @"A rather short UTF8 NSString object is here" (NSString *) strC3 = 0x0000000100006170 @"A string made with the at sign is here" (NSString *) strC4 = 0x0000606000009380 @"This is string number 4 right here" (NSString *) strC5 = 0x0000604000001c90 @"{{1, 1}, {5, 5}}" (NSString *) strC6 = 0x0000603000003430 @"1ST" (NSString *) strC7 = 0x0000603000003460 @"σxx" (NSString *) strC8 = 0x000061b000003180 @"hasVeryLongExtensionThisTimehasVeryLongExtensionThisTimehasVeryLongExtensionThisTimehasVeryLongExtensionThisTimehasVeryLongExtensionThisTimehasVeryLongExtensionThisTimehasVeryLongExtensionThisTimehasVeryLongExtensionThisTimehasVeryLongExtensionThisTimehasVeryLongExtensionThisTimehasVeryLongExtensionThisTimehasVeryLongExtensionThisTimehasVeryLongExtensionThisTimehasVeryLongExtensionThisTimehasVeryLongExtensionThisTimehasVeryLongExtensionThisTimehasVeryLongExtensionThisTimehasVeryLongExtensionThisTimehasVeryLongExtensionThisTimehasVeryLongExtensionThisTimehasVeryLongExtensionThisTimehasVeryLongExtensionThisTimehasVeryLongExtensionThisTimehasVeryLongExtensionThisTimehasVeryLongExtensionThisTimehasVeryLongExtensionThisTimehasVeryLongExtensionThisTimehasVeryLongExtensionThisTime" (NSString *) strC9 = 0x000060d000001ff0 @"a very much boring task to write a string this way!!σ\0" (NSString *) strC10 = 0x000060c000002ec0 @"This is a Unicode string σ number 4 right here" (NSString *) strD11 = 0x0000603000003490 @"__NSCFString" (NSString *) strD12 = 0x00006060000093e0 @"Process Name: a.out Process Id: 99626" (NSString *) eAcute = 0x00006030000034f0 @"é" (NSString *) randomHaziChar = 0x0000603000003550 @"鷅" (NSString *) japanese = 0x00000001000062b0 @"色は匂へど散りぬるを" (NSString *) italian = 0x00000001000062d0 @"L'Italia è una Repubblica democratica, fondata sul lavoro. La sovranità appartiene al popolo, che la esercita nelle forme e nei limiti della Costituzione." (NSString *) french = 0x00000001000062f0 @"Que veut cette horde d'esclaves, De traîtres, de rois conjurés?" (NSString *) german = 0x0000000100006310 @"Über-Ich und aus den Ansprüchen der sozialen Umwelt" (void *[3]) data_set = ([0] = 0x0000606000008ba0, [1] = 0x0000606000008c00, [2] = 0x0000000100006170) (NSString *) hebrew = 0x0000000100006330 @"לילה טוב" (NSArray *) newArray = 0x0000604000001dd0 @"50 elements" (NSDictionary *) newDictionary = 0x0000619000001980 12 key/value pairs (NSDictionary *) newMutableDictionary = 0x0000603000003610 21 key/value pairs (id [4]) cfKeys = { [0] = 0x0000000100006350 [1] = 0x0000000100006610 [2] = 0x0000000100006630 [3] = 0x0000000100006650 } (id [4]) cfValues = { [0] = 0x0000000100006350 [1] = 0x0000000100006610 [2] = 0x0000000100006630 [3] = 0x0000000100006650 } (NSDictionary *) nsDictionary = 0x00006060000095c0 2 key/value pairs (NSDictionary *) nscfDictionary = 0x0000606000009620 4 key/value pairs (CFDictionaryRef) cfDictionaryRef = 0x00006060000095c0 2 key/value pairs (NSAttributedString *) attrString = 0x00006030000036a0 @"hello world from foo" (NSAttributedString *) mutableAttrString = 0x0000603000003790 @"hello world from foo" (NSString *) mutableString = 0x0000604000001f90 @"foo said this string needs to be very long so much longer than whatever other string has been seen ever before by anyone of the mankind that of course this is still not long enough given what foo our friend foo our lovely dearly friend foo desired of us so i am adding more stuff here for the sake of it and for the joy of our friend who is named guess what just foo. hence, dear friend foo, stay safe, your string is now long enough to accommodate your testing need and I will make sure that if not we extend it with even more fuzzy random meaningless words pasted one after the other from a long tiresome friday evening spent working in my office. my office mate went home but I am still randomly typing just for the fun of seeing what happens of the length of a Mutable String in Cocoa if it goes beyond one byte.. so be it, dear foo" (NSString *) mutableGetConst = 0x0000618000000080 @"foo said this string needs to be very long so much longer than whatever other string has been seen ever before by anyone of the mankind that of course this is still not long enough given what foo our friend foo our lovely dearly friend foo desired of us so i am adding more stuff here for the sake of it and for the joy of our friend who is named guess what just foo. hence, dear friend foo, stay safe, your string is now long enough to accommodate your testing need and I will make sure that if not we extend it with even more fuzzy random meaningless words pasted one after the other from a long tiresome friday evening spent working in my office. my office mate went home but I am still randomly typing just for the fun of seeing what happens of the length of a Mutable String in Cocoa if it goes beyond one byte.. so be it, dear foo" (NSData *) immutableData = 0x00006030000037f0 5 bytes (NSData *) mutableData = 0x0000604000002010 14 bytes (unsigned int) concreteLength = 100000 (void *) zeroes1 = 0x0000633000000800 (NSData *) concreteData = 0x0000603000003820 100000 bytes (void *) zeroes2 = 0x000063300001c800 (NSMutableData *) concreteMutableData = 0x0000604000002050 100000 bytes (NSSet *) nsset = 0x0000604000002090 3 elements (NSSet *) nsmutableset = 0x0000603000003880 4 elements (NSSet *) nscfSet = 0x00006040000020d0 2 elements (CFSetRef) cfSetRef = 0x00006040000020d0 2 elements (CFDataRef) data_ref = 0x0000607000003f20 @"5 bytes" (CFMutableDataRef) mutable_data_ref = 0x0000607000003f90 @"5 bytes" (CFMutableStringRef) mutable_string_ref = 0x0000604000002110 @"Wish ya knew" (CFStringRef) cfstring_ref = 0x00000001000066d0 @"HELLO WORLD" (CFArrayRef) cfarray_ref = 0x0000607000004000 @"3 elements" (CFMutableArrayRef) mutable_array_ref = 0x0000604000002150 @"11 elements" (CFBinaryHeapRef) binheap_ref = 0x000060c000003640 @"21 items" (CFURLRef) cfurl_ref = 0x000060b000002350 @"http://www.foo.bar/" (CFURLRef) cfchildurl_ref = 0x00006070000040e0 @"page.html -- http://www.foo.bar/" (CFURLRef) cfgchildurl_ref = 0x0000607000004150 @"?whatever -- http://www.foo.bar/page.html" (NSDictionary *) error_userInfo = 0x0000606000009e60 2 key/value pairs (NSError *) nserror = 0x0000604000002290 domain: @"Foobar" - code: 12 (NSError **) nserrorptr = 0x00007ffeefbff078 domain: @"Foobar" - code: 12 (NSBundle *) bundle_string = 0x0000607000004310 @"/System/Library/Frameworks/Accelerate.framework" (NSBundle *) bundle_url = 0x0000607000004af0 @"/System/Library/Frameworks/Foundation.framework" (NSBundle *) main_bundle = 0x0000607000004cb0 @"/Users/buildslave/jenkins/workspace/lldb-cmake-sanitized/lldb-build/lldb-test-build.noindex/functionalities/data-formatter/data-formatter-objc/TestDataFormatterObjCCF.test_coreframeworks_and_run_command_dwarf" (NSArray *) bundles = 0x0000604000002450 @"1 element" (NSURL *) nsurl0 = 0x0000608000001320 @"file:///Users/buildslave/jenkins/workspace/lldb-cmake-sanitized/lldb-build/lldb-test-build.noindex/functionalities/data-formatter/data-formatter-objc/TestDataFormatterObjCCF.test_coreframeworks_and_run_command_dwarf/" (NSException *) except0 = 0x00006040000024d0 @"First" (NSException *) except1 = 0x0000604000002510 @"Second" (NSException *) except2 = 0x0000604000002550 @"Third" (NSException *) except3 = 0x0000604000002590 @"Fourth" (NSURL *) nsurl = 0x000060b0000028d0 @"http://www.foo.bar" (NSURL *) nsurl2 = 0x0000607000004ee0 @"page.html -- http://www.foo.bar" (NSURL *) nsurl3 = 0x0000607000004f50 @"?whatever -- http://www.foo.bar/page.html" (NSDate *) date1 = 0xddd05e134136c30f 1985-04-10 18:00:00 UTC (NSDate *) date2 = 0x0000604000008e90 2011-01-01 08:00:00 UTC (NSDate *) date3 = 0x0000602000003bb0 2020-06-03 09:51:44 UTC (NSDate *) date4 = 0xdda0edd4a136c30f 1970-01-02 00:00:00 UTC (NSDate *) date5 = 0x5daf893a3936c30f 2020-06-03 09:51:44 UTC (CFAbsoluteTime) date1_abs = 1985-04-10 10:00:00 PST (CFAbsoluteTime) date2_abs = 2011-01-01 00:00:00 PST (CFAbsoluteTime) date3_abs = 2020-06-03 02:51:44 PDT (CFAbsoluteTime) date4_abs = 1970-01-01 16:00:00 PST (CFAbsoluteTime) date5_abs = 2020-06-03 02:51:44 PDT (NSIndexSet *) iset1 = 0x0000603000009760 4 indexes (NSIndexSet *) iset2 = 0x0000603000009790 512 indexes (NSMutableIndexSet *) imset = 0x0000604000008f10 10 indexes (CFTimeZoneRef) cupertino = 0x0000608000001a20 @"America/Los_Angeles" (CFTimeZoneRef) home = 0x0000608000001ba0 @"Europe/Rome" (CFTimeZoneRef) europe = 0x0000608000001d20 @"Europe/Paris" (NSTimeZone *) cupertino_ns = 0x0000608000001a20 @"America/Los_Angeles" (NSTimeZone *) home_ns = 0x0000608000001ba0 @"Europe/Rome" (NSTimeZone *) europe_ns = 0x0000608000001d20 @"Europe/Paris" (CFGregorianUnits) cf_greg_units = 1 years, 3 months, 5 days, 12 hours, 5 minutes 7 seconds (CFGregorianDate) cf_greg_date = @"4/10/1985 18:0:0" (CFRange) cf_range = location=4 length=4 (NSPoint) ns_point = (x = 4, y = 4) (NSRange) ns_range = location=4, length=4 (NSRect) ns_rect = (origin = (x = 1, y = 1), size = (width = 5, height = 5)) (NSRect *) ns_rect_ptr = (origin = (x = 1, y = 1), size = (width = 5, height = 5)) (NSRectArray) ns_rect_arr = ((x = 1, y = 1), (width = 5, height = 5)), ... (NSSize) ns_size = (width = 5, height = 7) (NSSize *) ns_size_ptr = (width = 5, height = 7) (CGSize) cg_size = (width = 1, height = 6) (CGPoint) cg_point = (x = 2, y = 7) (CGRect) cg_rect = (origin = (x = 1, y = 2), size = (width = 7, height = 7)) (RGBColor) rgb_color = red=3 green=56 blue=35 (RGBColor *) rgb_color_ptr = red=3 green=56 blue=35 (Rect) rect = (t=4, l=8, b=4, r=7) (Rect *) rect_ptr = (t=4, l=8, b=4, r=7) (Point) point = (v=7, h=12) (Point *) point_ptr = (v=7, h=12) (HIPoint) hi_point = (x=7, y=12) (HIRect) hi_rect = origin=(x = 3, y = 5) size=(width = 4, height = 6) (SEL) foo_selector = "foo_selector_impl" (CFMutableBitVectorRef) mut_bv = 0x0000604000009490 1110 0110 1011 0000 1101 1010 1000 1111 0011 0101 1101 0001 00 (Molecule *) molecule = 0x0000602000003c50 (Class) myclass = NSValue (Class) myclass2 = NSTaggedPointerString (Class) myclass3 = Molecule (Class) myclass4 = NSMutableArray (Class) myclass5 = nil (NSArray *) components = 0x00006040000094d0 @"3 elements" (NSString *) path = 0x0000604000009510 @"usr/blah/stuff"

Hide Details

Assertion failed: (tokenKind == tok::kw___bridge_retain), function ParseParenExpression, file /Users/buildslave/jenkins/workspace/lldb-cmake-sanitized/llvm-project/clang/lib/Parse/ParseExpr.cpp, line 2819.

Hide Details

--

Hide Details

******************** PASS: lldb-unit :: Utility/./UtilityTests/RegularExpression.Invalid (1437 of 2029) PASS: lldb-unit :: Utility/./UtilityTests/UUIDTest.RelationalOperators (1438 of 2029) PASS: lldb-api :: lang/cpp/unsigned_types/TestUnsignedTypes.py (1439 of 2029) PASS: lldb-api :: lang/cpp/operator-overload/TestOperatorOverload.py (1440 of 2029) PASS: lldb-unit :: Utility/./UtilityTests/TimeoutTest.Format (1441 of 2029) PASS: lldb-api :: functionalities/breakpoint/breakpoint_names/TestBreakpointNames.py (1442 of 2029) PASS: lldb-unit :: Utility/./UtilityTests/ScalarTest.SetValueFromCString (1443 of 2029) PASS: lldb-shell :: ObjectFile/ELF/aarch64-relocations.yaml (1444 of 2029) PASS: lldb-api :: functionalities/conditional_break/TestConditionalBreak.py (1445 of 2029) PASS: lldb-unit :: Utility/./UtilityTests/StreamTeeTest.Flush (1446 of 2029) PASS: lldb-unit :: Symbol/./SymbolTests/DWARFCallFrameInfoTest.Basic_dwarf3 (1447 of 2029) PASS: lldb-unit :: Utility/./UtilityTests/StringListTest.CopyList (1448 of 2029) PASS: lldb-api :: functionalities/breakpoint/move_nearest/TestMoveNearest.py (1449 of 2029) PASS: lldb-api :: commands/expression/expr-in-syscall/TestExpressionInSyscall.py (1450 of 2029) PASS: lldb-unit :: Utility/./UtilityTests/BinaryStreamTest.PutSLEB128NineBytes (1451 of 2029) PASS: lldb-api :: commands/log/invalid-args/TestInvalidArgsLog.py (1452 of 2029) PASS: lldb-shell :: SymbolFile/DWARF/debug_loc_and_loclists.s (1453 of 2029) PASS: lldb-api :: commands/expression/persistent_ptr_update/TestPersistentPtrUpdate.py (1454 of 2029) PASS: lldb-unit :: Host/./HostTests/FileSystemTest.Resolve (1455 of 2029) PASS: lldb-api :: functionalities/unwind/zeroth_frame/TestZerothFrame.py (1456 of 2029) PASS: lldb-unit :: Utility/./UtilityTests/StreamTeeTest.Write (1457 of 2029) PASS: lldb-unit :: Utility/./UtilityTests/StatusTest.ErrorConversion (1458 of 2029) PASS: lldb-unit :: Utility/./UtilityTests/StringListTest.ShiftCString (1459 of 2029) PASS: lldb-unit :: Utility/./UtilityTests/StringExtractorTest.GetHexBytes_Partial (1460 of 2029) PASS: lldb-unit :: Language/CPlusPlus/./LanguageCPlusPlusTests/CPlusPlusLanguage.MethodNameParsing (1461 of 2029) PASS: lldb-shell :: SymbolFile/DWARF/DW_OP_piece-smaller-than-struct.s (1462 of 2029) PASS: lldb-api :: commands/expression/call-function/TestCallBuiltinFunction.py (1463 of 2029) PASS: lldb-api :: functionalities/thread_plan/TestThreadPlanCommands.py (1464 of 2029) PASS: lldb-unit :: Process/gdb-remote/./ProcessGdbRemoteTests/GDBRemoteClientBaseTest.SendContinueAndInterrupt2PacketBug (1465 of 2029) PASS: lldb-shell :: SymbolFile/DWARF/find-basic-namespace.cpp (1466 of 2029) PASS: lldb-unit :: Utility/./UtilityTests/UserIDResolver.GetUserName (1467 of 2029) PASS: lldb-unit :: Utility/./UtilityTests/RangeTest.NotEqual (1468 of 2029) PASS: lldb-api :: functionalities/data-formatter/language_category_updates/TestDataFormatterLanguageCategoryUpdates.py (1469 of 2029) UNSUPPORTED: lldb-api :: python_api/event/TestEvents.py (1470 of 2029) PASS: lldb-unit :: ScriptInterpreter/Python/./ScriptInterpreterPythonTests/PythonDataObjectsTest.TestDictionaryResolutionWithDot (1471 of 2029) PASS: lldb-shell :: SymbolFile/Breakpad/line-table.test (1472 of 2029) PASS: lldb-unit :: Process/minidump/./LLDBMinidumpTests/RegisterContextMinidump.ConvertMinidumpContext_x86_64 (1473 of 2029) PASS: lldb-unit :: UnwindAssembly/x86/./UnwindAssemblyx86Tests/Testx86AssemblyInspectionEngine.TestPushESI (1474 of 2029) PASS: lldb-unit :: Utility/./UtilityTests/SerializationRountripTest.SerializeDeserializeCString (1475 of 2029) PASS: lldb-api :: python_api/sbtype_typeclass/TestSBTypeTypeClass.py (1476 of 2029) PASS: lldb-api :: functionalities/data-formatter/ptr_ref_typedef/TestPtrRef2Typedef.py (1477 of 2029) PASS: lldb-api :: tools/lldb-server/TestGdbRemoteRegisterState.py (1478 of 2029) PASS: lldb-unit :: Host/./HostTests/SocketTest.UDPConnect (1479 of 2029) PASS: lldb-unit :: Editline/./EditlineTests/EditlineTestFixture.EditlineReceivesMultiLineText (1480 of 2029) PASS: lldb-unit :: Utility/./UtilityTests/UriParserTest.SchemeHostSeparator (1481 of 2029) PASS: lldb-api :: functionalities/data-formatter/data-formatter-smart-array/TestDataFormatterSmartArray.py (1482 of 2029) UNSUPPORTED: lldb-api :: tools/lldb-server/signal-filtering/TestGdbRemote_QPassSignals.py (1483 of 2029) PASS: lldb-unit :: Utility/./UtilityTests/StreamTest.PutCString (1484 of 2029) UNSUPPORTED: lldb-api :: functionalities/darwin_log/filter/regex/message/TestDarwinLogFilterRegexMessage.py (1485 of 2029) PASS: lldb-unit :: Utility/./UtilityTests/TimeoutTest.Construction (1486 of 2029) PASS: lldb-api :: lang/c/set_values/TestSetValues.py (1487 of 2029) FAIL: lldb-api :: lang/objc/foundation/TestObjCMethodsNSArray.py (1488 of 2029) ******************** TEST 'lldb-api :: lang/objc/foundation/TestObjCMethodsNSArray.py' FAILED ******************** Script: -- /Users/buildslave/jenkins/workspace/lldb-cmake-sanitized/lldb-build/lldb-test-build.noindex/copied-system-python /Users/buildslave/jenkins/workspace/lldb-cmake-sanitized/llvm-project/lldb/test/API/dotest.py --arch x86_64 -s /Users/buildslave/jenkins/workspace/lldb-cmake-sanitized/lldb-build/lldb-test-traces -S nm -u CXXFLAGS -u CFLAGS --codesign-identity lldb_codesign --server /Users/buildslave/jenkins/workspace/lldb-cmake-sanitized/lldb-build/./bin/debugserver --arch x86_64 --build-dir /Users/buildslave/jenkins/workspace/lldb-cmake-sanitized/lldb-build/lldb-test-build.noindex -s=/Users/buildslave/jenkins/workspace/lldb-cmake-sanitized/test/logs -t --env TERM=vt100 --env LLVM_LIBS_DIR=/Users/buildslave/jenkins/workspace/lldb-cmake-sanitized/lldb-build/./lib --inferior-env ASAN_OPTIONS=detect_stack_use_after_return=1 --inferior-env DYLD_INSERT_LIBRARIES=/Users/buildslave/jenkins/workspace/lldb-cmake-sanitized/host-compiler/lib/clang/11.0.0/lib/darwin/libclang_rt.asan_osx_dynamic.dylib --build-dir /Users/buildslave/jenkins/workspace/lldb-cmake-sanitized/lldb-build/lldb-test-build.noindex --lldb-module-cache-dir /Users/buildslave/jenkins/workspace/lldb-cmake-sanitized/lldb-build/lldb-test-build.noindex/module-cache-lldb/lldb-api --clang-module-cache-dir /Users/buildslave/jenkins/workspace/lldb-cmake-sanitized/lldb-build/lldb-test-build.noindex/module-cache-clang/lldb-api --executable /Users/buildslave/jenkins/workspace/lldb-cmake-sanitized/lldb-build/./bin/lldb --compiler /Users/buildslave/jenkins/workspace/lldb-cmake-sanitized/lldb-build/./bin/clang --dsymutil /Users/buildslave/jenkins/workspace/lldb-cmake-sanitized/lldb-build/./bin/dsymutil --filecheck /Users/buildslave/jenkins/workspace/lldb-cmake-sanitized/lldb-build/./bin/FileCheck --lldb-libs-dir /Users/buildslave/jenkins/workspace/lldb-cmake-sanitized/lldb-build/./lib /Users/buildslave/jenkins/workspace/lldb-cmake-sanitized/llvm-project/lldb/test/API/lang/objc/foundation -p TestObjCMethodsNSArray.py -- Exit Code: -6

Hide Details

Command Output (stdout): -- lldb version 11.0.99 clang revision e128f01be996f5f9a0e0cf5565d8a0696783b85d llvm revision e128f01be996f5f9a0e0cf5565d8a0696783b85d

Hide Details

-- Command Output (stderr): -- Assertion failed: (tokenKind == tok::kw___bridge_retain), function ParseParenExpression, file /Users/buildslave/jenkins/workspace/lldb-cmake-sanitized/llvm-project/clang/lib/Parse/ParseExpr.cpp, line 2819.

Hide Details

--

Hide Details

******************** PASS: lldb-api :: lang/cpp/trivial_abi/TestTrivialABI.py (1489 of 2029) PASS: lldb-unit :: UnwindAssembly/x86/./UnwindAssemblyx86Tests/Testx86AssemblyInspectionEngine.TestSubRSP (1490 of 2029) PASS: lldb-unit :: Signals/./SignalsTests/UnixSignalsTest.GetFilteredSignals (1491 of 2029) PASS: lldb-unit :: UnwindAssembly/x86/./UnwindAssemblyx86Tests/Testx86AssemblyInspectionEngine.TestPushR14 (1492 of 2029) PASS: lldb-shell :: Driver/TestProcessAttach.test (1493 of 2029) PASS: lldb-unit :: Utility/./UtilityTests/BinaryStreamTest.PutULEB128TwoBytes (1494 of 2029) PASS: lldb-unit :: SymbolFile/NativePDB/./SymbolFileNativePDBTests/PDBFPOProgramToDWARFExpressionTests.UnknownOp (1495 of 2029) PASS: lldb-api :: functionalities/backticks/TestBackticksWithoutATarget.py (1496 of 2029) PASS: lldb-unit :: Utility/./UtilityTests/UUIDTest.Validity (1497 of 2029) PASS: lldb-shell :: ObjectFile/ELF/section-types.yaml (1498 of 2029) PASS: lldb-unit :: Utility/./UtilityTests/AnsiTerminal.Twice (1499 of 2029) PASS: lldb-api :: commands/command/invalid-args/TestInvalidArgsCommand.py (1500 of 2029) UNSUPPORTED: lldb-api :: functionalities/breakpoint/breakpoint_callback_command_source/TestBreakpointCallbackCommandSource.py (1501 of 2029) PASS: lldb-unit :: ObjectFile/Breakpad/./ObjectFileBreakpadTests/FileRecord.parse (1502 of 2029) PASS: lldb-api :: functionalities/data-formatter/data-formatter-proper-plurals/TestFormattersOneIsSingular.py (1503 of 2029) PASS: lldb-shell :: Settings/TestFrameFormatNoColor.test (1504 of 2029) PASS: lldb-unit :: Host/./HostTests/HostInfoTest.GetAugmentedArchSpec (1505 of 2029) PASS: lldb-api :: api/multiple-targets/TestMultipleTargets.py (1506 of 2029) PASS: lldb-unit :: DataFormatter/./LLDBFormatterTests/StringPrinterTests.CxxUTF8 (1507 of 2029) PASS: lldb-unit :: Utility/./UtilityTests/BinaryStreamTest.PutSLEB128TwoBytes (1508 of 2029) UNSUPPORTED: lldb-api :: functionalities/thread/concurrent_events/TestConcurrentManySignals.py (1509 of 2029) PASS: lldb-unit :: Process/minidump/./LLDBMinidumpTests/MinidumpParserTest.GetThreadContext_x86_64 (1510 of 2029) PASS: lldb-api :: functionalities/unwind/noreturn/module-end/TestNoReturnModuleEnd.py (1511 of 2029) PASS: lldb-api :: types/TestFloatTypes.py (1512 of 2029) PASS: lldb-api :: tools/lldb-server/TestGdbRemoteExitCode.py (1513 of 2029) PASS: lldb-unit :: Utility/./UtilityTests/XcodeSDKTest.SDKSupportsModules (1514 of 2029) PASS: lldb-api :: lang/cpp/class_static/TestStaticVariables.py (1515 of 2029) PASS: lldb-api :: commands/frame/select/TestFrameSelect.py (1516 of 2029) PASS: lldb-api :: functionalities/data-formatter/data-formatter-stl/libcxx/function/TestLibCxxFunction.py (1517 of 2029) PASS: lldb-unit :: Utility/./UtilityTests/ArgsTest.TestInsertArg (1518 of 2029) PASS: lldb-unit :: Utility/./UtilityTests/StreamTest.ShiftOperatorStrings (1519 of 2029) PASS: lldb-unit :: Utility/./UtilityTests/StreamTeeTest.DefaultConstructor (1520 of 2029) PASS: lldb-shell :: SymbolFile/NativePDB/ast-functions.cpp (1521 of 2029) PASS: lldb-api :: python_api/sbstructureddata/TestStructuredDataAPI.py (1522 of 2029) PASS: lldb-unit :: Language/Highlighting/./HighlighterTests/HighlighterTest.ClangCursorPosAfterOtherToken (1523 of 2029) PASS: lldb-api :: functionalities/data-formatter/data-formatter-stl/libcxx/optional/TestDataFormatterLibcxxOptional.py (1524 of 2029) PASS: lldb-api :: functionalities/data-formatter/nsdictionarysynth/TestNSDictionarySynthetic.py (1525 of 2029) PASS: lldb-api :: lang/objc/objc-builtin-types/TestObjCBuiltinTypes.py (1526 of 2029) PASS: lldb-api :: functionalities/source-map/TestTargetSourceMap.py (1527 of 2029) PASS: lldb-api :: commands/expression/import-std-module/basic/TestImportStdModule.py (1528 of 2029) PASS: lldb-unit :: Expression/./ExpressionTests/DiagnosticManagerTest.GetStringSeverityLabels (1529 of 2029) PASS: lldb-api :: tools/lldb-server/TestGdbRemoteProcessInfo.py (1530 of 2029) PASS: lldb-api :: lang/c/stepping/TestThreadStepping.py (1531 of 2029) PASS: lldb-unit :: ScriptInterpreter/Python/./ScriptInterpreterPythonTests/PythonDataObjectsTest.TestPythonTupleInitializerList (1532 of 2029) PASS: lldb-unit :: Expression/./ExpressionTests/ClangExpressionDeclMapTest.TestUnknownIdentifierLookup (1533 of 2029) PASS: lldb-api :: commands/expression/persistent_variables/TestPersistentVariables.py (1534 of 2029) PASS: lldb-api :: functionalities/thread/concurrent_events/TestConcurrentSignalWatchBreak.py (1535 of 2029) UNSUPPORTED: lldb-shell :: SymbolFile/PDB/typedefs.test (1536 of 2029) PASS: lldb-api :: types/TestCharTypeExpr.py (1537 of 2029) PASS: lldb-unit :: Utility/./UtilityTests/StringListTest.InsertStringAtIndexStdString (1538 of 2029) PASS: lldb-unit :: Utility/./UtilityTests/Flags.AnyClear (1539 of 2029) PASS: lldb-shell :: SymbolFile/DWARF/find-inline-method.s (1540 of 2029) PASS: lldb-api :: functionalities/data-formatter/data-formatter-objc/TestDataFormatterObjCNSBundle.py (1541 of 2029) PASS: lldb-api :: lang/objc/modules-hash-mismatch/TestClangModulesHashMismatch.py (1542 of 2029) PASS: lldb-api :: tools/lldb-vscode/breakpoint/TestVSCode_setExceptionBreakpoints.py (1543 of 2029) PASS: lldb-unit :: SymbolFile/NativePDB/./SymbolFileNativePDBTests/PDBFPOProgramToDWARFExpressionTests.InvalidOpBinary (1544 of 2029) PASS: lldb-api :: functionalities/dead-strip/TestDeadStrip.py (1545 of 2029) PASS: lldb-shell :: Settings/TestSettingsWrite.test (1546 of 2029) PASS: lldb-api :: python_api/signals/TestSignalsAPI.py (1547 of 2029) PASS: lldb-unit :: UnwindAssembly/x86/./UnwindAssemblyx86Tests/Testx86AssemblyInspectionEngine.Test64bitFramelessBigStackFrame (1548 of 2029) PASS: lldb-unit :: Process/gdb-remote/./ProcessGdbRemoteTests/GDBRemoteClientBaseTest.SendContinueAndAsyncPacket (1549 of 2029) PASS: lldb-unit :: SymbolFile/DWARF/./SymbolFileDWARFTests/SymbolFileDWARFTests.ParseArangesNonzeroSegmentSize (1550 of 2029) PASS: lldb-unit :: Utility/./UtilityTests/SerializationRountripTest.SerializeDeserializePodPointers (1551 of 2029) FAIL: lldb-api :: lang/objc/objc-super/TestObjCSuper.py (1552 of 2029) ******************** TEST 'lldb-api :: lang/objc/objc-super/TestObjCSuper.py' FAILED ******************** Script: -- /Users/buildslave/jenkins/workspace/lldb-cmake-sanitized/lldb-build/lldb-test-build.noindex/copied-system-python /Users/buildslave/jenkins/workspace/lldb-cmake-sanitized/llvm-project/lldb/test/API/dotest.py --arch x86_64 -s /Users/buildslave/jenkins/workspace/lldb-cmake-sanitized/lldb-build/lldb-test-traces -S nm -u CXXFLAGS -u CFLAGS --codesign-identity lldb_codesign --server /Users/buildslave/jenkins/workspace/lldb-cmake-sanitized/lldb-build/./bin/debugserver --arch x86_64 --build-dir /Users/buildslave/jenkins/workspace/lldb-cmake-sanitized/lldb-build/lldb-test-build.noindex -s=/Users/buildslave/jenkins/workspace/lldb-cmake-sanitized/test/logs -t --env TERM=vt100 --env LLVM_LIBS_DIR=/Users/buildslave/jenkins/workspace/lldb-cmake-sanitized/lldb-build/./lib --inferior-env ASAN_OPTIONS=detect_stack_use_after_return=1 --inferior-env DYLD_INSERT_LIBRARIES=/Users/buildslave/jenkins/workspace/lldb-cmake-sanitized/host-compiler/lib/clang/11.0.0/lib/darwin/libclang_rt.asan_osx_dynamic.dylib --build-dir /Users/buildslave/jenkins/workspace/lldb-cmake-sanitized/lldb-build/lldb-test-build.noindex --lldb-module-cache-dir /Users/buildslave/jenkins/workspace/lldb-cmake-sanitized/lldb-build/lldb-test-build.noindex/module-cache-lldb/lldb-api --clang-module-cache-dir /Users/buildslave/jenkins/workspace/lldb-cmake-sanitized/lldb-build/lldb-test-build.noindex/module-cache-clang/lldb-api --executable /Users/buildslave/jenkins/workspace/lldb-cmake-sanitized/lldb-build/./bin/lldb --compiler /Users/buildslave/jenkins/workspace/lldb-cmake-sanitized/lldb-build/./bin/clang --dsymutil /Users/buildslave/jenkins/workspace/lldb-cmake-sanitized/lldb-build/./bin/dsymutil --filecheck /Users/buildslave/jenkins/workspace/lldb-cmake-sanitized/lldb-build/./bin/FileCheck --lldb-libs-dir /Users/buildslave/jenkins/workspace/lldb-cmake-sanitized/lldb-build/./lib /Users/buildslave/jenkins/workspace/lldb-cmake-sanitized/llvm-project/lldb/test/API/lang/objc/objc-super -p TestObjCSuper.py -- Exit Code: -6

Hide Details

Command Output (stdout): -- lldb version 11.0.99 clang revision e128f01be996f5f9a0e0cf5565d8a0696783b85d llvm revision e128f01be996f5f9a0e0cf5565d8a0696783b85d

Hide Details

-- Command Output (stderr): -- Assertion failed: (tokenKind == tok::kw___bridge_retain), function ParseParenExpression, file /Users/buildslave/jenkins/workspace/lldb-cmake-sanitized/llvm-project/clang/lib/Parse/ParseExpr.cpp, line 2819.

Hide Details

--

Hide Details

******************** PASS: lldb-api :: functionalities/tail_call_frames/disambiguate_call_site/TestDisambiguateCallSite.py (1553 of 2029) PASS: lldb-api :: commands/expression/import_base_class_when_class_has_derived_member/TestImportBaseClassWhenClassHasDerivedMember.py (1554 of 2029) PASS: lldb-api :: lang/c/enum_types/TestEnumTypes.py (1555 of 2029) PASS: lldb-unit :: Utility/./UtilityTests/StreamTest.ChangingByteOrder (1556 of 2029) PASS: lldb-unit :: ScriptInterpreter/Python/./ScriptInterpreterPythonTests/PythonDataObjectsTest.TestPythonFile (1557 of 2029) PASS: lldb-api :: functionalities/inferior-changed/TestInferiorChanged.py (1558 of 2029) PASS: lldb-api :: functionalities/data-formatter/pyobjsynthprovider/TestPyObjSynthProvider.py (1559 of 2029) PASS: lldb-unit :: Utility/./UtilityTests/StringListTest.LongestCommonPrefixDuplicateElement (1560 of 2029) PASS: lldb-api :: tools/lldb-server/TestGdbRemote_vCont.py (1561 of 2029) PASS: lldb-unit :: Utility/./UtilityTests/StringListTest.JoinThree (1562 of 2029) PASS: lldb-api :: commands/expression/regression-access-function-template-in-record/TestRegressionAccessFunctionTemplateInRecord.py (1563 of 2029) PASS: lldb-unit :: Process/minidump/./LLDBMinidumpTests/MinidumpParserTest.GetLinuxProcStatus (1564 of 2029) PASS: lldb-unit :: Target/./TargetTests/ExecutionContextTest.GetByteOrder (1565 of 2029) PASS: lldb-shell :: ObjectFile/Breakpad/breakpad-identification.test (1566 of 2029) PASS: lldb-unit :: debugserver/./debugserverTests/RNBSocket.LoopBackConnectIPv4 (1567 of 2029) PASS: lldb-unit :: ObjectFile/Breakpad/./ObjectFileBreakpadTests/Record.classify (1568 of 2029) PASS: lldb-api :: commands/expression/char/TestExprsChar.py (1569 of 2029) PASS: lldb-unit :: Utility/./UtilityTests/BinaryStreamTest.PutSLEB128ThreeBytes (1570 of 2029) PASS: lldb-unit :: ScriptInterpreter/Python/./ScriptInterpreterPythonTests/PythonDataObjectsTest.TestPythonIntegerToStructuredInteger (1571 of 2029) PASS: lldb-unit :: ScriptInterpreter/Python/./ScriptInterpreterPythonTests/PythonDataObjectsTest.TestPythonTupleInitializerList2 (1572 of 2029) PASS: lldb-api :: types/TestIntegerTypeExpr.py (1573 of 2029) PASS: lldb-unit :: Expression/./ExpressionTests/ClangHostTest.ComputeClangResourceDirectory (1574 of 2029) UNSUPPORTED: lldb-api :: functionalities/data-formatter/data-formatter-stl/libstdcpp/unique_ptr/TestDataFormatterStdUniquePtr.py (1575 of 2029) PASS: lldb-unit :: Utility/./UtilityTests/AnsiTerminal.Incomplete (1576 of 2029) PASS: lldb-unit :: Process/gdb-remote/./ProcessGdbRemoteTests/GDBRemoteCommunicationClientTest.SendStartTracePacket (1577 of 2029) PASS: lldb-unit :: Host/./HostTests/SocketTest.DomainListenConnectAccept (1578 of 2029) PASS: lldb-api :: commands/expression/unicode-in-variable/TestUnicodeInVariable.py (1579 of 2029) PASS: lldb-unit :: Utility/./UtilityTests/SerializationRountripTest.SerializeDeserializeCStringArray (1580 of 2029) PASS: lldb-api :: functionalities/plugins/python_os_plugin/stepping_plugin_threads/TestOSPluginStepping.py (1581 of 2029) PASS: lldb-api :: functionalities/breakpoint/serialize/TestBreakpointSerialization.py (1582 of 2029) PASS: lldb-unit :: Utility/./UtilityTests/StringLexerTest.HasAtLeast (1583 of 2029) PASS: lldb-api :: functionalities/data-formatter/parray/TestPrintArray.py (1584 of 2029) PASS: lldb-unit :: Symbol/./SymbolTests/LineEntryTest.GetSameLineContiguousAddressRangeNestedInline (1585 of 2029) PASS: lldb-unit :: Utility/./UtilityTests/FileSpecTest.EqualDotsPosixRoot (1586 of 2029) PASS: lldb-unit :: Utility/./UtilityTests/ArgsTest.TestSingleArg (1587 of 2029) PASS: lldb-shell :: Reproducer/TestFileRepro.test (1588 of 2029) FAIL: lldb-api :: lang/objc/objc-struct-return/TestObjCStructReturn.py (1589 of 2029) ******************** TEST 'lldb-api :: lang/objc/objc-struct-return/TestObjCStructReturn.py' FAILED ******************** Script: -- /Users/buildslave/jenkins/workspace/lldb-cmake-sanitized/lldb-build/lldb-test-build.noindex/copied-system-python /Users/buildslave/jenkins/workspace/lldb-cmake-sanitized/llvm-project/lldb/test/API/dotest.py --arch x86_64 -s /Users/buildslave/jenkins/workspace/lldb-cmake-sanitized/lldb-build/lldb-test-traces -S nm -u CXXFLAGS -u CFLAGS --codesign-identity lldb_codesign --server /Users/buildslave/jenkins/workspace/lldb-cmake-sanitized/lldb-build/./bin/debugserver --arch x86_64 --build-dir /Users/buildslave/jenkins/workspace/lldb-cmake-sanitized/lldb-build/lldb-test-build.noindex -s=/Users/buildslave/jenkins/workspace/lldb-cmake-sanitized/test/logs -t --env TERM=vt100 --env LLVM_LIBS_DIR=/Users/buildslave/jenkins/workspace/lldb-cmake-sanitized/lldb-build/./lib --inferior-env ASAN_OPTIONS=detect_stack_use_after_return=1 --inferior-env DYLD_INSERT_LIBRARIES=/Users/buildslave/jenkins/workspace/lldb-cmake-sanitized/host-compiler/lib/clang/11.0.0/lib/darwin/libclang_rt.asan_osx_dynamic.dylib --build-dir /Users/buildslave/jenkins/workspace/lldb-cmake-sanitized/lldb-build/lldb-test-build.noindex --lldb-module-cache-dir /Users/buildslave/jenkins/workspace/lldb-cmake-sanitized/lldb-build/lldb-test-build.noindex/module-cache-lldb/lldb-api --clang-module-cache-dir /Users/buildslave/jenkins/workspace/lldb-cmake-sanitized/lldb-build/lldb-test-build.noindex/module-cache-clang/lldb-api --executable /Users/buildslave/jenkins/workspace/lldb-cmake-sanitized/lldb-build/./bin/lldb --compiler /Users/buildslave/jenkins/workspace/lldb-cmake-sanitized/lldb-build/./bin/clang --dsymutil /Users/buildslave/jenkins/workspace/lldb-cmake-sanitized/lldb-build/./bin/dsymutil --filecheck /Users/buildslave/jenkins/workspace/lldb-cmake-sanitized/lldb-build/./bin/FileCheck --lldb-libs-dir /Users/buildslave/jenkins/workspace/lldb-cmake-sanitized/lldb-build/./lib /Users/buildslave/jenkins/workspace/lldb-cmake-sanitized/llvm-project/lldb/test/API/lang/objc/objc-struct-return -p TestObjCStructReturn.py -- Exit Code: -6

Hide Details

Command Output (stdout): -- lldb version 11.0.99 clang revision e128f01be996f5f9a0e0cf5565d8a0696783b85d llvm revision e128f01be996f5f9a0e0cf5565d8a0696783b85d

Hide Details

-- Command Output (stderr): -- Assertion failed: (tokenKind == tok::kw___bridge_retain), function ParseParenExpression, file /Users/buildslave/jenkins/workspace/lldb-cmake-sanitized/llvm-project/clang/lib/Parse/ParseExpr.cpp, line 2819.

Hide Details

--

Hide Details

******************** PASS: lldb-unit :: Utility/./UtilityTests/UriParserTest.BracketedHostnameWithPortIPv6 (1590 of 2029) PASS: lldb-api :: commands/command/script/import/TestImport.py (1591 of 2029) PASS: lldb-api :: commands/help/TestHelp.py (1592 of 2029) PASS: lldb-api :: functionalities/load_unload/TestLoadUnload.py (1593 of 2029) PASS: lldb-unit :: Utility/./UtilityTests/StringLexerTest.NextIfList (1594 of 2029) PASS: lldb-api :: lang/cpp/thread_local/TestThreadLocal.py (1595 of 2029) PASS: lldb-api :: commands/expression/call-function/TestCallUserDefinedFunction.py (1596 of 2029) PASS: lldb-api :: functionalities/gdb_remote_client/TestPlatformClient.py (1597 of 2029) PASS: lldb-shell :: SymbolFile/DWARF/debug-types-address-ranges.s (1598 of 2029) PASS: lldb-shell :: ObjectFile/ELF/many-sections.s (1599 of 2029) FAIL: lldb-api :: lang/objc/conflicting-definition/TestConflictingDefinition.py (1600 of 2029) ******************** TEST 'lldb-api :: lang/objc/conflicting-definition/TestConflictingDefinition.py' FAILED ******************** Script: -- /Users/buildslave/jenkins/workspace/lldb-cmake-sanitized/lldb-build/lldb-test-build.noindex/copied-system-python /Users/buildslave/jenkins/workspace/lldb-cmake-sanitized/llvm-project/lldb/test/API/dotest.py --arch x86_64 -s /Users/buildslave/jenkins/workspace/lldb-cmake-sanitized/lldb-build/lldb-test-traces -S nm -u CXXFLAGS -u CFLAGS --codesign-identity lldb_codesign --server /Users/buildslave/jenkins/workspace/lldb-cmake-sanitized/lldb-build/./bin/debugserver --arch x86_64 --build-dir /Users/buildslave/jenkins/workspace/lldb-cmake-sanitized/lldb-build/lldb-test-build.noindex -s=/Users/buildslave/jenkins/workspace/lldb-cmake-sanitized/test/logs -t --env TERM=vt100 --env LLVM_LIBS_DIR=/Users/buildslave/jenkins/workspace/lldb-cmake-sanitized/lldb-build/./lib --inferior-env ASAN_OPTIONS=detect_stack_use_after_return=1 --inferior-env DYLD_INSERT_LIBRARIES=/Users/buildslave/jenkins/workspace/lldb-cmake-sanitized/host-compiler/lib/clang/11.0.0/lib/darwin/libclang_rt.asan_osx_dynamic.dylib --build-dir /Users/buildslave/jenkins/workspace/lldb-cmake-sanitized/lldb-build/lldb-test-build.noindex --lldb-module-cache-dir /Users/buildslave/jenkins/workspace/lldb-cmake-sanitized/lldb-build/lldb-test-build.noindex/module-cache-lldb/lldb-api --clang-module-cache-dir /Users/buildslave/jenkins/workspace/lldb-cmake-sanitized/lldb-build/lldb-test-build.noindex/module-cache-clang/lldb-api --executable /Users/buildslave/jenkins/workspace/lldb-cmake-sanitized/lldb-build/./bin/lldb --compiler /Users/buildslave/jenkins/workspace/lldb-cmake-sanitized/lldb-build/./bin/clang --dsymutil /Users/buildslave/jenkins/workspace/lldb-cmake-sanitized/lldb-build/./bin/dsymutil --filecheck /Users/buildslave/jenkins/workspace/lldb-cmake-sanitized/lldb-build/./bin/FileCheck --lldb-libs-dir /Users/buildslave/jenkins/workspace/lldb-cmake-sanitized/lldb-build/./lib /Users/buildslave/jenkins/workspace/lldb-cmake-sanitized/llvm-project/lldb/test/API/lang/objc/conflicting-definition -p TestConflictingDefinition.py -- Exit Code: -6

Hide Details

Command Output (stdout): -- lldb version 11.0.99 clang revision e128f01be996f5f9a0e0cf5565d8a0696783b85d llvm revision e128f01be996f5f9a0e0cf5565d8a0696783b85d

Hide Details

-- Command Output (stderr): -- Assertion failed: (tokenKind == tok::kw___bridge_retain), function ParseParenExpression, file /Users/buildslave/jenkins/workspace/lldb-cmake-sanitized/llvm-project/clang/lib/Parse/ParseExpr.cpp, line 2819.

Hide Details

--

Hide Details

******************** PASS: lldb-shell :: Settings/TestDisableColor.test (1601 of 2029) PASS: lldb-unit :: Utility/./UtilityTests/StringExtractorTest.GetHexU8_Extra (1602 of 2029) PASS: lldb-unit :: Utility/./UtilityTests/CompletionRequest.Constructor (1603 of 2029) FAIL: lldb-api :: lang/objc/objc-class-method/TestObjCClassMethod.py (1604 of 2029) ******************** TEST 'lldb-api :: lang/objc/objc-class-method/TestObjCClassMethod.py' FAILED ******************** Script: -- /Users/buildslave/jenkins/workspace/lldb-cmake-sanitized/lldb-build/lldb-test-build.noindex/copied-system-python /Users/buildslave/jenkins/workspace/lldb-cmake-sanitized/llvm-project/lldb/test/API/dotest.py --arch x86_64 -s /Users/buildslave/jenkins/workspace/lldb-cmake-sanitized/lldb-build/lldb-test-traces -S nm -u CXXFLAGS -u CFLAGS --codesign-identity lldb_codesign --server /Users/buildslave/jenkins/workspace/lldb-cmake-sanitized/lldb-build/./bin/debugserver --arch x86_64 --build-dir /Users/buildslave/jenkins/workspace/lldb-cmake-sanitized/lldb-build/lldb-test-build.noindex -s=/Users/buildslave/jenkins/workspace/lldb-cmake-sanitized/test/logs -t --env TERM=vt100 --env LLVM_LIBS_DIR=/Users/buildslave/jenkins/workspace/lldb-cmake-sanitized/lldb-build/./lib --inferior-env ASAN_OPTIONS=detect_stack_use_after_return=1 --inferior-env DYLD_INSERT_LIBRARIES=/Users/buildslave/jenkins/workspace/lldb-cmake-sanitized/host-compiler/lib/clang/11.0.0/lib/darwin/libclang_rt.asan_osx_dynamic.dylib --build-dir /Users/buildslave/jenkins/workspace/lldb-cmake-sanitized/lldb-build/lldb-test-build.noindex --lldb-module-cache-dir /Users/buildslave/jenkins/workspace/lldb-cmake-sanitized/lldb-build/lldb-test-build.noindex/module-cache-lldb/lldb-api --clang-module-cache-dir /Users/buildslave/jenkins/workspace/lldb-cmake-sanitized/lldb-build/lldb-test-build.noindex/module-cache-clang/lldb-api --executable /Users/buildslave/jenkins/workspace/lldb-cmake-sanitized/lldb-build/./bin/lldb --compiler /Users/buildslave/jenkins/workspace/lldb-cmake-sanitized/lldb-build/./bin/clang --dsymutil /Users/buildslave/jenkins/workspace/lldb-cmake-sanitized/lldb-build/./bin/dsymutil --filecheck /Users/buildslave/jenkins/workspace/lldb-cmake-sanitized/lldb-build/./bin/FileCheck --lldb-libs-dir /Users/buildslave/jenkins/workspace/lldb-cmake-sanitized/lldb-build/./lib /Users/buildslave/jenkins/workspace/lldb-cmake-sanitized/llvm-project/lldb/test/API/lang/objc/objc-class-method -p TestObjCClassMethod.py -- Exit Code: -6

Hide Details

Command Output (stdout): -- lldb version 11.0.99 clang revision e128f01be996f5f9a0e0cf5565d8a0696783b85d llvm revision e128f01be996f5f9a0e0cf5565d8a0696783b85d

Hide Details

-- Command Output (stderr): -- Assertion failed: (tokenKind == tok::kw___bridge_retain), function ParseParenExpression, file /Users/buildslave/jenkins/workspace/lldb-cmake-sanitized/llvm-project/clang/lib/Parse/ParseExpr.cpp, line 2819.

Hide Details

--

Hide Details

******************** PASS: lldb-api :: lang/objc/single-entry-dictionary/TestObjCSingleEntryDictionary.py (1605 of 2029) PASS: lldb-api :: lang/cpp/namespace/TestNamespaceLookup.py (1606 of 2029) PASS: lldb-unit :: Utility/./UtilityTests/StringListTest.InsertStringAtIndexEnd (1607 of 2029) PASS: lldb-api :: lang/cpp/chained-calls/TestCppChainedCalls.py (1608 of 2029) UNSUPPORTED: lldb-api :: benchmarks/startup/TestStartupDelays.py (1609 of 2029) PASS: lldb-unit :: Utility/./UtilityTests/ArgsTest.ReplaceArgumentAtIndexFarOutOfRange (1610 of 2029) PASS: lldb-shell :: Reproducer/TestPythonImport.test (1611 of 2029) PASS: lldb-api :: functionalities/data-formatter/var-in-aggregate-misuse/TestVarInAggregateMisuse.py (1612 of 2029) PASS: lldb-api :: functionalities/data-formatter/data-formatter-objc/TestDataFormatterObjCNSDate.py (1613 of 2029) PASS: lldb-unit :: SymbolFile/DWARF/./SymbolFileDWARFTests/SymbolFileDWARFTests.TestAbbrevOrder1Start5 (1614 of 2029) PASS: lldb-api :: commands/expression/radar_9673664/TestExprHelpExamples.py (1615 of 2029) PASS: lldb-shell :: SymbolFile/Breakpad/unwind-via-stack-win-no-memory-info.yaml (1616 of 2029) PASS: lldb-shell :: Reproducer/TestCaptureEnvOverride.test (1617 of 2029) PASS: lldb-shell :: Reproducer/TestReuseDirectory.test (1618 of 2029) PASS: lldb-shell :: SymbolFile/DWARF/static_scope.s (1619 of 2029) PASS: lldb-unit :: Utility/./UtilityTests/ConstStringTest.format_provider (1620 of 2029) PASS: lldb-unit :: Utility/./UtilityTests/FileSpecTest.EqualSeparator (1621 of 2029) PASS: lldb-api :: python_api/disassemble-raw-data/TestDisassembleRawData.py (1622 of 2029) PASS: lldb-api :: commands/platform/basic/TestPlatformCommand.py (1623 of 2029) PASS: lldb-api :: functionalities/data-formatter/data-formatter-stl/libcxx/map/TestDataFormatterLibccMap.py (1624 of 2029) PASS: lldb-unit :: Utility/./UtilityTests/StreamTest.PutHex32ByteOrderBig (1625 of 2029) UNSUPPORTED: lldb-api :: commands/expression/multiline-completion/TestMultilineCompletion.py (1626 of 2029) PASS: lldb-unit :: Utility/./UtilityTests/LogTest.Register (1627 of 2029) PASS: lldb-shell :: Commands/command-target-modules-dump-sections.yaml (1628 of 2029) UNSUPPORTED: lldb-api :: commands/expression/multiline-navigation/TestMultilineNavigation.py (1629 of 2029) PASS: lldb-api :: lang/cpp/stl/TestSTL.py (1630 of 2029) PASS: lldb-shell :: SymbolFile/Breakpad/line-table-discontinuous-file-ids.test (1631 of 2029) UNSUPPORTED: lldb-shell :: ScriptInterpreter/Lua/command_script_import.test (1632 of 2029) PASS: lldb-unit :: Utility/./UtilityTests/CompletionRequest.TestCompletionOwnership (1633 of 2029) PASS: lldb-unit :: Utility/./UtilityTests/PassiveReplayTest.InstrumentedFoo (1634 of 2029) PASS: lldb-unit :: Utility/./UtilityTests/LogTest.Unregister (1635 of 2029) PASS: lldb-unit :: Process/minidump/./LLDBMinidumpTests/MinidumpParserTest.GetThreadsAndGetThreadContext (1636 of 2029) PASS: lldb-unit :: Process/minidump/./LLDBMinidumpTests/MinidumpParserTest.MinidumpDuplicateModuleMinAddress (1637 of 2029) PASS: lldb-unit :: Utility/./UtilityTests/StringListTest.CopyListEmpty (1638 of 2029) UNSUPPORTED: lldb-api :: functionalities/thread/create_during_step/TestCreateDuringStep.py (1639 of 2029) PASS: lldb-api :: functionalities/jitloader_gdb/TestJITLoaderGDB.py (1640 of 2029) PASS: lldb-api :: functionalities/memory/cache/TestMemoryCache.py (1641 of 2029) PASS: lldb-unit :: UnwindAssembly/x86/./UnwindAssemblyx86Tests/Testx86AssemblyInspectionEngine.TestSubESP (1642 of 2029) PASS: lldb-api :: functionalities/breakpoint/address_breakpoints/TestAddressBreakpoints.py (1643 of 2029) PASS: lldb-shell :: Minidump/memory-region.yaml (1644 of 2029) UNSUPPORTED: lldb-api :: functionalities/thread/thread_specific_break_plus_condition/TestThreadSpecificBpPlusCondition.py (1645 of 2029) PASS: lldb-unit :: Utility/./UtilityTests/EnvironmentTest.EnvpConstruction (1646 of 2029) PASS: lldb-unit :: UnwindAssembly/x86/./UnwindAssemblyx86Tests/Testx86AssemblyInspectionEngine.TestReturnDetect (1647 of 2029) PASS: lldb-shell :: ObjectFile/PECOFF/basic-info-arm64.yaml (1648 of 2029) PASS: lldb-api :: functionalities/object-file/TestImageListMultiArchitecture.py (1649 of 2029) PASS: lldb-api :: python_api/frame/TestFrames.py (1650 of 2029) PASS: lldb-unit :: Signals/./SignalsTests/UnixSignalsTest.Iteration (1651 of 2029) PASS: lldb-unit :: Process/minidump/./LLDBMinidumpTests/MinidumpParserTest.GetThreadContext_x86_32 (1652 of 2029) PASS: lldb-unit :: ObjectFile/Breakpad/./ObjectFileBreakpadTests/LineRecord.parse (1653 of 2029) PASS: lldb-unit :: Utility/./UtilityTests/XcodeSDKTest.SDKSupportsSwift (1654 of 2029) UNSUPPORTED: lldb-shell :: SymbolFile/PDB/vbases.test (1655 of 2029) PASS: lldb-unit :: Utility/./UtilityTests/LogChannelTest.List (1656 of 2029) PASS: lldb-unit :: ScriptInterpreter/Python/./ScriptInterpreterPythonTests/PythonDataObjectsTest.TestPythonListValueEquality (1657 of 2029) PASS: lldb-api :: lang/cpp/auto/TestCPPAuto.py (1658 of 2029) PASS: lldb-api :: functionalities/data-formatter/varscript_formatting/TestDataFormatterVarScriptFormatting.py (1659 of 2029) PASS: lldb-shell :: Expr/TestTypeOfDeclTypeExpr.test (1660 of 2029) PASS: lldb-api :: functionalities/tail_call_frames/disambiguate_tail_call_seq/TestDisambiguateTailCallSeq.py (1661 of 2029) PASS: lldb-api :: functionalities/thread/concurrent_events/TestConcurrentDelaySignalBreak.py (1662 of 2029) PASS: lldb-api :: functionalities/value_md5_crash/TestValueMD5Crash.py (1663 of 2029) PASS: lldb-unit :: Symbol/./SymbolTests/TestTypeSystemClang.TestOwningModule (1664 of 2029) PASS: lldb-api :: types/TestLongTypesExpr.py (1665 of 2029) PASS: lldb-api :: functionalities/avoids-fd-leak/TestFdLeak.py (1666 of 2029) PASS: lldb-shell :: Reproducer/Functionalities/TestExpressionEvaluation.test (1667 of 2029) PASS: lldb-unit :: Target/./TargetTests/PathMappingListTest.RemapRoot (1668 of 2029) PASS: lldb-shell :: SymbolFile/Breakpad/unwind-via-stack-cfi.test (1669 of 2029) PASS: lldb-api :: commands/frame/diagnose/dereference-this/TestDiagnoseDereferenceThis.py (1670 of 2029) PASS: lldb-unit :: ScriptInterpreter/Python/./ScriptInterpreterPythonTests/PythonDataObjectsTest.TestPythonCallableCheck (1671 of 2029) PASS: lldb-unit :: Utility/./UtilityTests/StreamTest.AddressPrefixAndSuffix (1672 of 2029) PASS: lldb-api :: functionalities/thread/concurrent_events/TestConcurrentNWatchNBreak.py (1673 of 2029) PASS: lldb-api :: lang/cpp/extern_c/TestExternCSymbols.py (1674 of 2029) PASS: lldb-api :: lang/cpp/this/TestCPPThis.py (1675 of 2029) PASS: lldb-unit :: Host/./HostTests/HostInfoTest.GetHostname (1676 of 2029) PASS: lldb-shell :: Driver/TestRepl.test (1677 of 2029) PASS: lldb-api :: commands/expression/import-std-module/forward_list-dbg-info-content/TestDbgInfoContentForwardListFromStdModule.py (1678 of 2029) PASS: lldb-unit :: Utility/./UtilityTests/StreamTeeTest.Constructor1Stream (1679 of 2029) PASS: lldb-unit :: Utility/./UtilityTests/BroadcasterTest.EventTypeHasListeners (1680 of 2029) UNSUPPORTED: lldb-api :: lang/objc/foundation/TestFoundationDisassembly.py (1681 of 2029) PASS: lldb-unit :: Utility/./UtilityTests/BinaryStreamTest.PutSLEB128FiveBytes (1682 of 2029) PASS: lldb-api :: functionalities/process_group/TestChangeProcessGroup.py (1683 of 2029) PASS: lldb-unit :: Language/Highlighting/./HighlighterTests/HighlighterTest.Colons (1684 of 2029) PASS: lldb-unit :: Utility/./UtilityTests/ScalarTest.Equality (1685 of 2029) PASS: lldb-unit :: SymbolFile/NativePDB/./SymbolFileNativePDBTests/PDBFPOProgramToDWARFExpressionTests.UnresolvedRegisterReference (1686 of 2029) PASS: lldb-unit :: Utility/./UtilityTests/RangeDataVector.FindEntryThatContains_Overlap (1687 of 2029) PASS: lldb-api :: functionalities/breakpoint/breakpoint_command/TestBreakpointCommandsFromPython.py (1688 of 2029) PASS: lldb-api :: commands/source/info/TestSourceInfo.py (1689 of 2029) PASS: lldb-unit :: Core/./LLDBCoreTests/MangledTest.ResultForValidName (1690 of 2029) PASS: lldb-shell :: SymbolFile/Breakpad/line-table-mixed-path-styles.test (1691 of 2029) PASS: lldb-api :: lang/cpp/template/TestTemplateArgs.py (1692 of 2029) PASS: lldb-shell :: Reproducer/TestDiscard.test (1693 of 2029) PASS: lldb-api :: lang/cpp/function_refs/TestFunctionRefs.py (1694 of 2029) PASS: lldb-shell :: SymbolFile/DWARF/debug-types-dwo-cross-reference.cpp (1695 of 2029) UNSUPPORTED: lldb-api :: tools/lldb-vscode/completions/TestVSCode_completions.py (1696 of 2029) PASS: lldb-api :: lang/c/function_types/TestFunctionTypes.py (1697 of 2029) PASS: lldb-unit :: Process/minidump/./LLDBMinidumpTests/MinidumpParserTest.FindMemoryRange (1698 of 2029) PASS: lldb-unit :: Host/./HostTests/HostInfoTest.GetXcodeSDK (1699 of 2029) PASS: lldb-unit :: Utility/./UtilityTests/ArgsTest.TestOverwriteArgs (1700 of 2029) PASS: lldb-unit :: Utility/./UtilityTests/StringExtractorTest.DecodeHexU8_InvalidHex (1701 of 2029) PASS: lldb-shell :: SymbolFile/DWARF/dwarf5-debug_line.s (1702 of 2029) PASS: lldb-api :: commands/expression/import-std-module/queue/TestQueueFromStdModule.py (1703 of 2029) UNSUPPORTED: lldb-api :: functionalities/darwin_log/filter/regex/subsystem/TestDarwinLogFilterRegexSubsystem.py (1704 of 2029) PASS: lldb-api :: functionalities/thread/jump/TestThreadJump.py (1705 of 2029) PASS: lldb-shell :: SymbolFile/DWARF/debug-types-basic.test (1706 of 2029) PASS: lldb-unit :: Host/./HostTests/SocketTest.TCPGetAddress (1707 of 2029) PASS: lldb-unit :: Utility/./UtilityTests/StringListTest.SplitIntoLines (1708 of 2029) PASS: lldb-unit :: SymbolFile/NativePDB/./SymbolFileNativePDBTests/PDBFPOProgramToDWARFExpressionTests.MissingTargetRegister (1709 of 2029) PASS: lldb-unit :: Utility/./UtilityTests/StringListTest.GetSize (1710 of 2029) FAIL: lldb-api :: commands/expression/two-files/TestObjCTypeQueryFromOtherCompileUnit.py (1711 of 2029) ******************** TEST 'lldb-api :: commands/expression/two-files/TestObjCTypeQueryFromOtherCompileUnit.py' FAILED ******************** Script: -- /Users/buildslave/jenkins/workspace/lldb-cmake-sanitized/lldb-build/lldb-test-build.noindex/copied-system-python /Users/buildslave/jenkins/workspace/lldb-cmake-sanitized/llvm-project/lldb/test/API/dotest.py --arch x86_64 -s /Users/buildslave/jenkins/workspace/lldb-cmake-sanitized/lldb-build/lldb-test-traces -S nm -u CXXFLAGS -u CFLAGS --codesign-identity lldb_codesign --server /Users/buildslave/jenkins/workspace/lldb-cmake-sanitized/lldb-build/./bin/debugserver --arch x86_64 --build-dir /Users/buildslave/jenkins/workspace/lldb-cmake-sanitized/lldb-build/lldb-test-build.noindex -s=/Users/buildslave/jenkins/workspace/lldb-cmake-sanitized/test/logs -t --env TERM=vt100 --env LLVM_LIBS_DIR=/Users/buildslave/jenkins/workspace/lldb-cmake-sanitized/lldb-build/./lib --inferior-env ASAN_OPTIONS=detect_stack_use_after_return=1 --inferior-env DYLD_INSERT_LIBRARIES=/Users/buildslave/jenkins/workspace/lldb-cmake-sanitized/host-compiler/lib/clang/11.0.0/lib/darwin/libclang_rt.asan_osx_dynamic.dylib --build-dir /Users/buildslave/jenkins/workspace/lldb-cmake-sanitized/lldb-build/lldb-test-build.noindex --lldb-module-cache-dir /Users/buildslave/jenkins/workspace/lldb-cmake-sanitized/lldb-build/lldb-test-build.noindex/module-cache-lldb/lldb-api --clang-module-cache-dir /Users/buildslave/jenkins/workspace/lldb-cmake-sanitized/lldb-build/lldb-test-build.noindex/module-cache-clang/lldb-api --executable /Users/buildslave/jenkins/workspace/lldb-cmake-sanitized/lldb-build/./bin/lldb --compiler /Users/buildslave/jenkins/workspace/lldb-cmake-sanitized/lldb-build/./bin/clang --dsymutil /Users/buildslave/jenkins/workspace/lldb-cmake-sanitized/lldb-build/./bin/dsymutil --filecheck /Users/buildslave/jenkins/workspace/lldb-cmake-sanitized/lldb-build/./bin/FileCheck --lldb-libs-dir /Users/buildslave/jenkins/workspace/lldb-cmake-sanitized/lldb-build/./lib /Users/buildslave/jenkins/workspace/lldb-cmake-sanitized/llvm-project/lldb/test/API/commands/expression/two-files -p TestObjCTypeQueryFromOtherCompileUnit.py -- Exit Code: -6

Hide Details

Command Output (stdout): -- lldb version 11.0.99 clang revision e128f01be996f5f9a0e0cf5565d8a0696783b85d llvm revision e128f01be996f5f9a0e0cf5565d8a0696783b85d

Hide Details

-- Command Output (stderr): -- Assertion failed: (tokenKind == tok::kw___bridge_retain), function ParseParenExpression, file /Users/buildslave/jenkins/workspace/lldb-cmake-sanitized/llvm-project/clang/lib/Parse/ParseExpr.cpp, line 2819.

Hide Details

--

Hide Details

******************** XFAIL: lldb-shell :: Register/x86-mm-xmm-write.test (1712 of 2029) PASS: lldb-unit :: debugserver/./debugserverTests/RNBSocket.LoopBackConnectIPv6 (1713 of 2029) PASS: lldb-unit :: Utility/./UtilityTests/StreamTest.ShiftOperatorChars (1714 of 2029) PASS: lldb-unit :: Utility/./UtilityTests/ReproducerTest.SetCapture (1715 of 2029) PASS: lldb-unit :: Utility/./UtilityTests/RangeTest.ContainsAddrInvalid (1716 of 2029) PASS: lldb-api :: functionalities/postmortem/minidump-new/TestMiniDumpNew.py (1717 of 2029) PASS: lldb-unit :: Expression/./ExpressionTests/ClangExpressionDeclMapTest.TestPersistentDeclLookup (1718 of 2029) PASS: lldb-api :: types/TestLongTypes.py (1719 of 2029) PASS: lldb-api :: commands/expression/issue_11588/Test11588.py (1720 of 2029) PASS: lldb-api :: functionalities/breakpoint/scripted_bkpt/TestScriptedResolver.py (1721 of 2029) PASS: lldb-unit :: Utility/./UtilityTests/DataExtractorTest.GetMaxS64 (1722 of 2029) PASS: lldb-api :: macosx/thread_suspend/TestInternalThreadSuspension.py (1723 of 2029) PASS: lldb-unit :: Utility/./UtilityTests/StringListTest.LongestCommonPrefixNoPrefix (1724 of 2029) PASS: lldb-api :: lang/cpp/inlines/TestInlines.py (1725 of 2029) PASS: lldb-api :: lang/objc/objc-dyn-sbtype/TestObjCDynamicSBType.py (1726 of 2029) PASS: lldb-unit :: Utility/./UtilityTests/OptionsWithRawTest.EmptyArgsOnlySuffix (1727 of 2029) UNSUPPORTED: lldb-shell :: Register/x86-gp-read.test (1728 of 2029) PASS: lldb-unit :: Language/Highlighting/./HighlighterTests/HighlighterTest.ClangTrailingBackslashBeforeNewline (1729 of 2029) PASS: lldb-api :: functionalities/thread/concurrent_events/TestConcurrentBreakpointDelayBreakpointOneSignal.py (1730 of 2029) UNSUPPORTED: lldb-shell :: SymbolFile/NativePDB/ast-functions-msvc.cpp (1731 of 2029) PASS: lldb-unit :: Process/gdb-remote/./ProcessGdbRemoteTests/GDBRemoteCommunicationClientTest.SendStopTracePacket (1732 of 2029) PASS: lldb-unit :: Language/Highlighting/./HighlighterTests/HighlighterTest.ClangScalarLiterals (1733 of 2029) PASS: lldb-unit :: UnwindAssembly/x86/./UnwindAssemblyx86Tests/Testx86AssemblyInspectionEngine.TestPushEDX (1734 of 2029) PASS: lldb-api :: functionalities/data-formatter/cstring-utf8-summary/TestCstringUnicode.py (1735 of 2029) UNSUPPORTED: lldb-shell :: SymbolFile/PDB/func-symbols.test (1736 of 2029) PASS: lldb-api :: commands/watchpoints/watchpoint_count/TestWatchpointCount.py (1737 of 2029) PASS: lldb-api :: commands/expression/invalid-args/TestInvalidArgsExpression.py (1738 of 2029) UNSUPPORTED: lldb-api :: functionalities/longjmp/TestLongjmp.py (1739 of 2029) UNSUPPORTED: lldb-shell :: Register/x86-64-gp-write.test (1740 of 2029) PASS: lldb-shell :: ObjectFile/ELF/PT_LOAD-overlap-section.yaml (1741 of 2029) PASS: lldb-api :: python_api/frame/inlines/TestInlinedFrame.py (1742 of 2029) PASS: lldb-api :: python_api/value_var_update/TestValueVarUpdate.py (1743 of 2029) PASS: lldb-unit :: Utility/./UtilityTests/RangeTest.ContainsEndInclusiveInvalid (1744 of 2029) PASS: lldb-unit :: tools/lldb-server/tests/./LLDBServerTests/StandardStartupTest.TestStopReplyContainsThreadPcs (1745 of 2029) PASS: lldb-unit :: Utility/./UtilityTests/SharedCluster.ClusterManager (1746 of 2029) PASS: lldb-unit :: Utility/./UtilityTests/DeserializerTest.HasData (1747 of 2029) FAIL: lldb-api :: functionalities/data-formatter/data-formatter-objc/TestDataFormatterObjCNSError.py (1748 of 2029) ******************** TEST 'lldb-api :: functionalities/data-formatter/data-formatter-objc/TestDataFormatterObjCNSError.py' FAILED ******************** Script: -- /Users/buildslave/jenkins/workspace/lldb-cmake-sanitized/lldb-build/lldb-test-build.noindex/copied-system-python /Users/buildslave/jenkins/workspace/lldb-cmake-sanitized/llvm-project/lldb/test/API/dotest.py --arch x86_64 -s /Users/buildslave/jenkins/workspace/lldb-cmake-sanitized/lldb-build/lldb-test-traces -S nm -u CXXFLAGS -u CFLAGS --codesign-identity lldb_codesign --server /Users/buildslave/jenkins/workspace/lldb-cmake-sanitized/lldb-build/./bin/debugserver --arch x86_64 --build-dir /Users/buildslave/jenkins/workspace/lldb-cmake-sanitized/lldb-build/lldb-test-build.noindex -s=/Users/buildslave/jenkins/workspace/lldb-cmake-sanitized/test/logs -t --env TERM=vt100 --env LLVM_LIBS_DIR=/Users/buildslave/jenkins/workspace/lldb-cmake-sanitized/lldb-build/./lib --inferior-env ASAN_OPTIONS=detect_stack_use_after_return=1 --inferior-env DYLD_INSERT_LIBRARIES=/Users/buildslave/jenkins/workspace/lldb-cmake-sanitized/host-compiler/lib/clang/11.0.0/lib/darwin/libclang_rt.asan_osx_dynamic.dylib --build-dir /Users/buildslave/jenkins/workspace/lldb-cmake-sanitized/lldb-build/lldb-test-build.noindex --lldb-module-cache-dir /Users/buildslave/jenkins/workspace/lldb-cmake-sanitized/lldb-build/lldb-test-build.noindex/module-cache-lldb/lldb-api --clang-module-cache-dir /Users/buildslave/jenkins/workspace/lldb-cmake-sanitized/lldb-build/lldb-test-build.noindex/module-cache-clang/lldb-api --executable /Users/buildslave/jenkins/workspace/lldb-cmake-sanitized/lldb-build/./bin/lldb --compiler /Users/buildslave/jenkins/workspace/lldb-cmake-sanitized/lldb-build/./bin/clang --dsymutil /Users/buildslave/jenkins/workspace/lldb-cmake-sanitized/lldb-build/./bin/dsymutil --filecheck /Users/buildslave/jenkins/workspace/lldb-cmake-sanitized/lldb-build/./bin/FileCheck --lldb-libs-dir /Users/buildslave/jenkins/workspace/lldb-cmake-sanitized/lldb-build/./lib /Users/buildslave/jenkins/workspace/lldb-cmake-sanitized/llvm-project/lldb/test/API/functionalities/data-formatter/data-formatter-objc -p TestDataFormatterObjCNSError.py -- Exit Code: -6

Hide Details

Command Output (stdout): -- lldb version 11.0.99 clang revision e128f01be996f5f9a0e0cf5565d8a0696783b85d llvm revision e128f01be996f5f9a0e0cf5565d8a0696783b85d

Hide Details

-- Command Output (stderr): -- Assertion failed: (tokenKind == tok::kw___bridge_retain), function ParseParenExpression, file /Users/buildslave/jenkins/workspace/lldb-cmake-sanitized/llvm-project/clang/lib/Parse/ParseExpr.cpp, line 2819.

Hide Details

--

Hide Details

******************** PASS: lldb-unit :: ScriptInterpreter/Python/./ScriptInterpreterPythonTests/PythonDataObjectsTest.TestPythonStringToStructuredString (1749 of 2029) PASS: lldb-unit :: Symbol/./SymbolTests/TestTypeSystemClang.TemplateArguments (1750 of 2029) PASS: lldb-api :: functionalities/plugins/command_plugin/TestPluginCommands.py (1751 of 2029) PASS: lldb-unit :: ScriptInterpreter/Python/./ScriptInterpreterPythonTests/PythonDataObjectsTest.TestPythonInteger (1752 of 2029) PASS: lldb-api :: commands/expression/pr35310/TestExprsBug35310.py (1753 of 2029) PASS: lldb-shell :: Settings/TestModuleCacheSanity.test (1754 of 2029) PASS: lldb-api :: macosx/queues/TestQueues.py (1755 of 2029) UNSUPPORTED: lldb-api :: functionalities/data-formatter/data-formatter-stl/libstdcpp/vbool/TestDataFormatterStdVBool.py (1756 of 2029) UNSUPPORTED: lldb-api :: functionalities/tty/TestTerminal.py (1757 of 2029) PASS: lldb-unit :: UnwindAssembly/x86/./UnwindAssemblyx86Tests/Testx86AssemblyInspectionEngine.TestSimple32bitFrameFunction (1758 of 2029) PASS: lldb-api :: lang/cpp/enum_types/TestCPP11EnumTypes.py (1759 of 2029) PASS: lldb-unit :: SymbolFile/NativePDB/./SymbolFileNativePDBTests/PDBFPOProgramToDWARFExpressionTests.MultipleIndependentAssignments (1760 of 2029) PASS: lldb-unit :: Utility/./UtilityTests/BinaryStreamTest.PutULEB128FiveBytes (1761 of 2029) PASS: lldb-api :: functionalities/data-formatter/format-propagation/TestFormatPropagation.py (1762 of 2029) PASS: lldb-api :: commands/disassemble/basic/TestDisassembleBreakpoint.py (1763 of 2029) PASS: lldb-unit :: Language/Highlighting/./HighlighterTests/HighlighterTest.ClangCursorPosInOtherToken (1764 of 2029) PASS: lldb-api :: python_api/process/io/TestProcessIO.py (1765 of 2029) PASS: lldb-api :: python_api/module_section/TestModuleAndSection.py (1766 of 2029) PASS: lldb-shell :: Settings/TestFrameFormatColor.test (1767 of 2029) UNSUPPORTED: lldb-api :: functionalities/darwin_log/basic/TestDarwinLogBasic.py (1768 of 2029) PASS: lldb-unit :: Core/./LLDBCoreTests/RichManglingContextTest.SwitchProvider (1769 of 2029) PASS: lldb-unit :: ObjectFile/PECOFF/./ObjectFilePECOFFTests/PECallFrameInfoTest.Chained_eh (1770 of 2029) PASS: lldb-api :: commands/target/create-deps/TestTargetCreateDeps.py (1771 of 2029) PASS: lldb-unit :: ScriptInterpreter/Python/./ScriptInterpreterPythonTests/PythonDataObjectsTest.TestPythonByteArray (1772 of 2029) PASS: lldb-api :: functionalities/memory/read/TestMemoryRead.py (1773 of 2029) PASS: lldb-unit :: ScriptInterpreter/Python/./ScriptInterpreterPythonTests/PythonDataObjectsTest.TestPythonStringToStr (1774 of 2029) PASS: lldb-shell :: Quit/TestQuitExitCodeTooManyArgs.test (1775 of 2029) PASS: lldb-unit :: Symbol/./SymbolTests/TestTypeSystemClang.TestGetTypeClassDeclType (1776 of 2029) UNSUPPORTED: lldb-shell :: ScriptInterpreter/Lua/convenience_variables.test (1777 of 2029) PASS: lldb-shell :: ObjectFile/ELF/netbsd-core-amd64.test (1778 of 2029) PASS: lldb-unit :: Symbol/./SymbolTests/DWARFCallFrameInfoTest.Basic_dwarf4 (1779 of 2029) PASS: lldb-unit :: Core/./LLDBCoreTests/MangledTest.ResultForBlockInvocation (1780 of 2029) PASS: lldb-api :: commands/expression/call-function/TestCallStdStringFunction.py (1781 of 2029) UNSUPPORTED: lldb-api :: macosx/macabi/TestMacABImacOSFramework.py (1782 of 2029) PASS: lldb-api :: lang/cpp/char8_t/TestCxxChar8_t.py (1783 of 2029) PASS: lldb-unit :: ScriptInterpreter/Python/./ScriptInterpreterPythonTests/PythonDataObjectsTest.TestGlobalNameResolutionNoDot (1784 of 2029) PASS: lldb-shell :: ObjectFile/wasm/unified-debug-sections.yaml (1785 of 2029) PASS: lldb-api :: functionalities/thread/concurrent_events/TestConcurrentCrashWithBreak.py (1786 of 2029) PASS: lldb-unit :: Host/./HostTests/FileSystemTest.MakeAbsolute (1787 of 2029) UNSUPPORTED: lldb-api :: functionalities/darwin_log/filter/regex/activity-chain/TestDarwinLogFilterRegexActivityChain.py (1788 of 2029) PASS: lldb-unit :: Language/CPlusPlus/./LanguageCPlusPlusTests/CPlusPlusLanguage.FindAlternateFunctionManglings (1789 of 2029) PASS: lldb-api :: lang/cpp/unique-types/TestUniqueTypes.py (1790 of 2029) UNSUPPORTED: lldb-api :: functionalities/tsan/thread_numbers/TestTsanThreadNumbers.py (1791 of 2029) PASS: lldb-api :: commands/expression/vector_of_enums/TestVectorOfEnums.py (1792 of 2029) PASS: lldb-api :: tools/lldb-server/TestGdbRemote_qThreadStopInfo.py (1793 of 2029) PASS: lldb-api :: commands/watchpoints/watchpoint_commands/command/TestWatchpointCommandPython.py (1794 of 2029) PASS: lldb-shell :: Quit/TestQuitExitCodeNonInt.test (1795 of 2029) PASS: lldb-unit :: Utility/./UtilityTests/StreamTeeTest.SetStreamAtIndexOutOfBounds (1796 of 2029) FAIL: lldb-api :: lang/objc/bitfield_ivars/TestBitfieldIvars.py (1797 of 2029) ******************** TEST 'lldb-api :: lang/objc/bitfield_ivars/TestBitfieldIvars.py' FAILED ******************** Script: -- /Users/buildslave/jenkins/workspace/lldb-cmake-sanitized/lldb-build/lldb-test-build.noindex/copied-system-python /Users/buildslave/jenkins/workspace/lldb-cmake-sanitized/llvm-project/lldb/test/API/dotest.py --arch x86_64 -s /Users/buildslave/jenkins/workspace/lldb-cmake-sanitized/lldb-build/lldb-test-traces -S nm -u CXXFLAGS -u CFLAGS --codesign-identity lldb_codesign --server /Users/buildslave/jenkins/workspace/lldb-cmake-sanitized/lldb-build/./bin/debugserver --arch x86_64 --build-dir /Users/buildslave/jenkins/workspace/lldb-cmake-sanitized/lldb-build/lldb-test-build.noindex -s=/Users/buildslave/jenkins/workspace/lldb-cmake-sanitized/test/logs -t --env TERM=vt100 --env LLVM_LIBS_DIR=/Users/buildslave/jenkins/workspace/lldb-cmake-sanitized/lldb-build/./lib --inferior-env ASAN_OPTIONS=detect_stack_use_after_return=1 --inferior-env DYLD_INSERT_LIBRARIES=/Users/buildslave/jenkins/workspace/lldb-cmake-sanitized/host-compiler/lib/clang/11.0.0/lib/darwin/libclang_rt.asan_osx_dynamic.dylib --build-dir /Users/buildslave/jenkins/workspace/lldb-cmake-sanitized/lldb-build/lldb-test-build.noindex --lldb-module-cache-dir /Users/buildslave/jenkins/workspace/lldb-cmake-sanitized/lldb-build/lldb-test-build.noindex/module-cache-lldb/lldb-api --clang-module-cache-dir /Users/buildslave/jenkins/workspace/lldb-cmake-sanitized/lldb-build/lldb-test-build.noindex/module-cache-clang/lldb-api --executable /Users/buildslave/jenkins/workspace/lldb-cmake-sanitized/lldb-build/./bin/lldb --compiler /Users/buildslave/jenkins/workspace/lldb-cmake-sanitized/lldb-build/./bin/clang --dsymutil /Users/buildslave/jenkins/workspace/lldb-cmake-sanitized/lldb-build/./bin/dsymutil --filecheck /Users/buildslave/jenkins/workspace/lldb-cmake-sanitized/lldb-build/./bin/FileCheck --lldb-libs-dir /Users/buildslave/jenkins/workspace/lldb-cmake-sanitized/lldb-build/./lib /Users/buildslave/jenkins/workspace/lldb-cmake-sanitized/llvm-project/lldb/test/API/lang/objc/bitfield_ivars -p TestBitfieldIvars.py -- Exit Code: -6

Hide Details

Command Output (stdout): -- lldb version 11.0.99 clang revision e128f01be996f5f9a0e0cf5565d8a0696783b85d llvm revision e128f01be996f5f9a0e0cf5565d8a0696783b85d

Hide Details

-- Command Output (stderr): -- Assertion failed: (tokenKind == tok::kw___bridge_retain), function ParseParenExpression, file /Users/buildslave/jenkins/workspace/lldb-cmake-sanitized/llvm-project/clang/lib/Parse/ParseExpr.cpp, line 2819.

Hide Details

--

Hide Details

******************** PASS: lldb-shell :: Register/x86-64-ymm-read.test (1798 of 2029) PASS: lldb-api :: python_api/findvalue_duplist/TestSBFrameFindValue.py (1799 of 2029) UNSUPPORTED: lldb-api :: tools/lldb-server/libraries-svr4/TestGdbRemoteLibrariesSvr4Support.py (1800 of 2029) PASS: lldb-unit :: Utility/./UtilityTests/VASprintfTest.NoBufferResize (1801 of 2029) PASS: lldb-unit :: SymbolFile/DWARF/./SymbolFileDWARFTests/SymbolFileDWARFTests.TestAbbrevInvalidNULLTag (1802 of 2029) PASS: lldb-unit :: Utility/./UtilityTests/Predicate.WaitForValueEqualTo (1803 of 2029) PASS: lldb-api :: functionalities/postmortem/elf-core/TestLinuxCore.py (1804 of 2029) PASS: lldb-shell :: SymbolFile/DWARF/debug_line-relative_path.s (1805 of 2029) PASS: lldb-unit :: Expression/./ExpressionTests/CppModuleConfigurationTest.Linux (1806 of 2029) PASS: lldb-unit :: Utility/./UtilityTests/StringExtractorTest.GetHexU8_InvalidHex_NoEof (1807 of 2029) PASS: lldb-unit :: Utility/./UtilityTests/ConstStringTest.UpdateMangledCounterpart (1808 of 2029) PASS: lldb-api :: functionalities/gdb_remote_client/TestTargetXMLArch.py (1809 of 2029) PASS: lldb-api :: python_api/watchpoint/condition/TestWatchpointConditionAPI.py (1810 of 2029) PASS: lldb-api :: functionalities/deleted-executable/TestDeletedExecutable.py (1811 of 2029) PASS: lldb-api :: macosx/function-starts/TestFunctionStarts.py (1812 of 2029) PASS: lldb-api :: sample_test/TestSampleTest.py (1813 of 2029) PASS: lldb-api :: functionalities/data-formatter/data-formatter-objc/TestDataFormatterObjCNSData.py (1814 of 2029) FAIL: lldb-api :: lang/objc/objc-static-method/TestObjCStaticMethod.py (1815 of 2029) ******************** TEST 'lldb-api :: lang/objc/objc-static-method/TestObjCStaticMethod.py' FAILED ******************** Script: -- /Users/buildslave/jenkins/workspace/lldb-cmake-sanitized/lldb-build/lldb-test-build.noindex/copied-system-python /Users/buildslave/jenkins/workspace/lldb-cmake-sanitized/llvm-project/lldb/test/API/dotest.py --arch x86_64 -s /Users/buildslave/jenkins/workspace/lldb-cmake-sanitized/lldb-build/lldb-test-traces -S nm -u CXXFLAGS -u CFLAGS --codesign-identity lldb_codesign --server /Users/buildslave/jenkins/workspace/lldb-cmake-sanitized/lldb-build/./bin/debugserver --arch x86_64 --build-dir /Users/buildslave/jenkins/workspace/lldb-cmake-sanitized/lldb-build/lldb-test-build.noindex -s=/Users/buildslave/jenkins/workspace/lldb-cmake-sanitized/test/logs -t --env TERM=vt100 --env LLVM_LIBS_DIR=/Users/buildslave/jenkins/workspace/lldb-cmake-sanitized/lldb-build/./lib --inferior-env ASAN_OPTIONS=detect_stack_use_after_return=1 --inferior-env DYLD_INSERT_LIBRARIES=/Users/buildslave/jenkins/workspace/lldb-cmake-sanitized/host-compiler/lib/clang/11.0.0/lib/darwin/libclang_rt.asan_osx_dynamic.dylib --build-dir /Users/buildslave/jenkins/workspace/lldb-cmake-sanitized/lldb-build/lldb-test-build.noindex --lldb-module-cache-dir /Users/buildslave/jenkins/workspace/lldb-cmake-sanitized/lldb-build/lldb-test-build.noindex/module-cache-lldb/lldb-api --clang-module-cache-dir /Users/buildslave/jenkins/workspace/lldb-cmake-sanitized/lldb-build/lldb-test-build.noindex/module-cache-clang/lldb-api --executable /Users/buildslave/jenkins/workspace/lldb-cmake-sanitized/lldb-build/./bin/lldb --compiler /Users/buildslave/jenkins/workspace/lldb-cmake-sanitized/lldb-build/./bin/clang --dsymutil /Users/buildslave/jenkins/workspace/lldb-cmake-sanitized/lldb-build/./bin/dsymutil --filecheck /Users/buildslave/jenkins/workspace/lldb-cmake-sanitized/lldb-build/./bin/FileCheck --lldb-libs-dir /Users/buildslave/jenkins/workspace/lldb-cmake-sanitized/lldb-build/./lib /Users/buildslave/jenkins/workspace/lldb-cmake-sanitized/llvm-project/lldb/test/API/lang/objc/objc-static-method -p TestObjCStaticMethod.py -- Exit Code: -6

Hide Details

Command Output (stdout): -- lldb version 11.0.99 clang revision e128f01be996f5f9a0e0cf5565d8a0696783b85d llvm revision e128f01be996f5f9a0e0cf5565d8a0696783b85d

Hide Details

-- Command Output (stderr): -- Assertion failed: (tokenKind == tok::kw___bridge_retain), function ParseParenExpression, file /Users/buildslave/jenkins/workspace/lldb-cmake-sanitized/llvm-project/clang/lib/Parse/ParseExpr.cpp, line 2819.

Hide Details

--

Hide Details

******************** PASS: lldb-api :: lang/c/blocks/TestBlocks.py (1816 of 2029) PASS: lldb-unit :: Utility/./UtilityTests/DataExtractorTest.GetCStrAtEnd (1817 of 2029) PASS: lldb-unit :: Utility/./UtilityTests/VMRange.Clear (1818 of 2029) PASS: lldb-api :: lang/objc/modules-auto-import/TestModulesAutoImport.py (1819 of 2029) PASS: lldb-shell :: Commands/command-disassemble.s (1820 of 2029) PASS: lldb-unit :: Utility/./UtilityTests/CompletionRequest.FakeLastArg (1821 of 2029) PASS: lldb-api :: commands/expression/rdar42038760/TestScalarURem.py (1822 of 2029) PASS: lldb-unit :: Utility/./UtilityTests/Flags.AllSet (1823 of 2029) PASS: lldb-shell :: SymbolFile/DWARF/dwp-separate-debug-file.cpp (1824 of 2029) PASS: lldb-shell :: SymbolFile/NativePDB/ast-methods.cpp (1825 of 2029) PASS: lldb-unit :: Utility/./UtilityTests/RangeTest.Clear (1826 of 2029) PASS: lldb-api :: functionalities/thread/concurrent_events/TestConcurrentManyCrash.py (1827 of 2029) PASS: lldb-api :: functionalities/data-formatter/data-formatter-stl/libstdcpp/unique_ptr/invalid/TestDataFormatterInvalidStdUniquePtr.py (1828 of 2029) PASS: lldb-unit :: Utility/./UtilityTests/AnsiTerminal.Empty (1829 of 2029) PASS: lldb-unit :: Utility/./UtilityTests/StreamTeeTest.CopyConstructor (1830 of 2029) PASS: lldb-api :: lang/c/find_struct_type/TestFindStructTypes.py (1831 of 2029) PASS: lldb-unit :: Utility/./UtilityTests/PassiveReplayTest.InstrumentedBarRef (1832 of 2029) PASS: lldb-shell :: ObjectFile/MachO/lc_build_version_notools.yaml (1833 of 2029) PASS: lldb-shell :: ExecControl/StopHook/stop-hook.test (1834 of 2029) PASS: lldb-unit :: Process/gdb-remote/./ProcessGdbRemoteTests/GDBRemoteCommunicationServerTest.SendErrorResponse_ErrorList (1835 of 2029) PASS: lldb-unit :: Core/./LLDBCoreTests/SourceFileCache.FindSourceFileFound (1836 of 2029) PASS: lldb-unit :: UnwindAssembly/x86/./UnwindAssemblyx86Tests/Testx86AssemblyInspectionEngine.TestLEAVE (1837 of 2029) PASS: lldb-unit :: Utility/./UtilityTests/StringListTest.AppendList (1838 of 2029) PASS: lldb-shell :: ObjectFile/ELF/section-permissions.yaml (1839 of 2029) PASS: lldb-unit :: Host/./HostTests/MainLoopTest.ReadObject (1840 of 2029) PASS: lldb-api :: commands/expression/anonymous-struct/TestCallUserAnonTypedef.py (1841 of 2029) PASS: lldb-unit :: UnwindAssembly/x86/./UnwindAssemblyx86Tests/Testx86AssemblyInspectionEngine.TestDisassemblyMidFunctionEpilogues (1842 of 2029) UNSUPPORTED: lldb-api :: functionalities/data-formatter/data-formatter-stl/libstdcpp/map/TestDataFormatterStdMap.py (1843 of 2029) PASS: lldb-api :: macosx/universal/TestUniversal.py (1844 of 2029) PASS: lldb-unit :: Language/Highlighting/./HighlighterTests/HighlighterTest.HighlighterSelectionType (1845 of 2029) PASS: lldb-api :: lang/objc/exceptions/TestObjCExceptions.py (1846 of 2029) PASS: lldb-unit :: Process/minidump/./LLDBMinidumpTests/MinidumpParserTest.GetMemory (1847 of 2029) PASS: lldb-shell :: SymbolFile/NativePDB/tag-types.cpp (1848 of 2029) PASS: lldb-unit :: UnwindAssembly/x86/./UnwindAssemblyx86Tests/Testx86AssemblyInspectionEngine.TestPopR14 (1849 of 2029) PASS: lldb-api :: functionalities/breakpoint/breakpoint_locations/TestBreakpointLocations.py (1850 of 2029) PASS: lldb-api :: functionalities/var_path/TestVarPath.py (1851 of 2029) PASS: lldb-unit :: Utility/./UtilityTests/StreamTest.PutCharNull (1852 of 2029) PASS: lldb-unit :: Interpreter/./InterpreterTests/OptionArgParserTest.toChar (1853 of 2029) PASS: lldb-shell :: Driver/LocalLLDBInit.test (1854 of 2029) PASS: lldb-shell :: ObjectFile/ELF/PT_LOAD-overlap-PT_INTERP.yaml (1855 of 2029) PASS: lldb-api :: commands/frame/var-scope/TestFrameVariableScope.py (1856 of 2029) PASS: lldb-unit :: Utility/./UtilityTests/AnsiTerminal.Basic (1857 of 2029) FAIL: lldb-api :: commands/expression/import_builtin_fileid/TestImportBuiltinFileID.py (1858 of 2029) ******************** TEST 'lldb-api :: commands/expression/import_builtin_fileid/TestImportBuiltinFileID.py' FAILED ******************** Script: -- /Users/buildslave/jenkins/workspace/lldb-cmake-sanitized/lldb-build/lldb-test-build.noindex/copied-system-python /Users/buildslave/jenkins/workspace/lldb-cmake-sanitized/llvm-project/lldb/test/API/dotest.py --arch x86_64 -s /Users/buildslave/jenkins/workspace/lldb-cmake-sanitized/lldb-build/lldb-test-traces -S nm -u CXXFLAGS -u CFLAGS --codesign-identity lldb_codesign --server /Users/buildslave/jenkins/workspace/lldb-cmake-sanitized/lldb-build/./bin/debugserver --arch x86_64 --build-dir /Users/buildslave/jenkins/workspace/lldb-cmake-sanitized/lldb-build/lldb-test-build.noindex -s=/Users/buildslave/jenkins/workspace/lldb-cmake-sanitized/test/logs -t --env TERM=vt100 --env LLVM_LIBS_DIR=/Users/buildslave/jenkins/workspace/lldb-cmake-sanitized/lldb-build/./lib --inferior-env ASAN_OPTIONS=detect_stack_use_after_return=1 --inferior-env DYLD_INSERT_LIBRARIES=/Users/buildslave/jenkins/workspace/lldb-cmake-sanitized/host-compiler/lib/clang/11.0.0/lib/darwin/libclang_rt.asan_osx_dynamic.dylib --build-dir /Users/buildslave/jenkins/workspace/lldb-cmake-sanitized/lldb-build/lldb-test-build.noindex --lldb-module-cache-dir /Users/buildslave/jenkins/workspace/lldb-cmake-sanitized/lldb-build/lldb-test-build.noindex/module-cache-lldb/lldb-api --clang-module-cache-dir /Users/buildslave/jenkins/workspace/lldb-cmake-sanitized/lldb-build/lldb-test-build.noindex/module-cache-clang/lldb-api --executable /Users/buildslave/jenkins/workspace/lldb-cmake-sanitized/lldb-build/./bin/lldb --compiler /Users/buildslave/jenkins/workspace/lldb-cmake-sanitized/lldb-build/./bin/clang --dsymutil /Users/buildslave/jenkins/workspace/lldb-cmake-sanitized/lldb-build/./bin/dsymutil --filecheck /Users/buildslave/jenkins/workspace/lldb-cmake-sanitized/lldb-build/./bin/FileCheck --lldb-libs-dir /Users/buildslave/jenkins/workspace/lldb-cmake-sanitized/lldb-build/./lib /Users/buildslave/jenkins/workspace/lldb-cmake-sanitized/llvm-project/lldb/test/API/commands/expression/import_builtin_fileid -p TestImportBuiltinFileID.py -- Exit Code: -6

Hide Details

Command Output (stdout): -- lldb version 11.0.99 clang revision e128f01be996f5f9a0e0cf5565d8a0696783b85d llvm revision e128f01be996f5f9a0e0cf5565d8a0696783b85d

Hide Details

-- Command Output (stderr): -- Assertion failed: (tokenKind == tok::kw___bridge_retain), function ParseParenExpression, file /Users/buildslave/jenkins/workspace/lldb-cmake-sanitized/llvm-project/clang/lib/Parse/ParseExpr.cpp, line 2819.

Hide Details

--

Hide Details

******************** PASS: lldb-unit :: Process/gdb-remote/./ProcessGdbRemoteTests/GDBRemoteCommunicationClientTest.SaveRestoreRegistersNoSuffix (1859 of 2029) PASS: lldb-unit :: UnwindAssembly/x86/./UnwindAssemblyx86Tests/Testx86AssemblyInspectionEngine.TestPopRBPWithREX (1860 of 2029) PASS: lldb-unit :: Utility/./UtilityTests/VMRange.CollectionContains (1861 of 2029) PASS: lldb-unit :: UnwindAssembly/x86/./UnwindAssemblyx86Tests/Testx86AssemblyInspectionEngine.TestPush0 (1862 of 2029) PASS: lldb-api :: macosx/order/TestOrderFile.py (1863 of 2029) PASS: lldb-unit :: SymbolFile/NativePDB/./SymbolFileNativePDBTests/PDBFPOProgramToDWARFExpressionTests.SingleAssignmentRegisterRef (1864 of 2029) PASS: lldb-shell :: Commands/command-source.test (1865 of 2029) PASS: lldb-unit :: Utility/./UtilityTests/StreamTest.AddressSuffix (1866 of 2029) PASS: lldb-api :: lang/c/global_variables/TestGlobalVariables.py (1867 of 2029) PASS: lldb-api :: functionalities/data-formatter/data-formatter-stl/libcxx/string/TestDataFormatterLibcxxString.py (1868 of 2029) PASS: lldb-shell :: Breakpoint/debug_rnglist_offset_pair.test (1869 of 2029) PASS: lldb-api :: functionalities/data-formatter/data-formatter-stl/libcxx/variant/TestDataFormatterLibcxxVariant.py (1870 of 2029) PASS: lldb-shell :: SymbolFile/DWARF/debug_ranges-missing-section.s (1871 of 2029) PASS: lldb-shell :: ObjectFile/PECOFF/export-dllfunc.yaml (1872 of 2029) PASS: lldb-api :: functionalities/signal/TestSendSignal.py (1873 of 2029) PASS: lldb-unit :: debugserver/./debugserverTests/JSON.Parse (1874 of 2029) PASS: lldb-unit :: Symbol/./SymbolTests/TestTypeSystemClang.TestGetTypeClassTypeOfExpr (1875 of 2029) PASS: lldb-api :: functionalities/step-avoids-no-debug/TestStepNoDebug.py (1876 of 2029) PASS: lldb-shell :: ObjectFile/ELF/compressed-sections.yaml (1877 of 2029) PASS: lldb-api :: functionalities/tail_call_frames/cross_dso/TestCrossDSOTailCalls.py (1878 of 2029) PASS: lldb-unit :: Utility/./UtilityTests/UriParserTest.BracketedHostnameWithColon (1879 of 2029) PASS: lldb-unit :: Editline/./EditlineTests/EditlineTestFixture.EditlineReceivesSingleLineText (1880 of 2029) PASS: lldb-api :: commands/frame/diagnose/array/TestArray.py (1881 of 2029) PASS: lldb-unit :: Process/minidump/./LLDBMinidumpTests/MinidumpParserTest.GetThreadContext_x86_32_wow64 (1882 of 2029) PASS: lldb-unit :: Symbol/./SymbolTests/TestTypeSystemClang.TestNotDeletingUserCopyCstrDueToMoveCStr (1883 of 2029) PASS: lldb-shell :: ObjectFile/ELF/PT_LOAD-empty.yaml (1884 of 2029) PASS: lldb-api :: lang/cpp/virtual-functions/TestCppVirtualFunctions.py (1885 of 2029) UNSUPPORTED: lldb-api :: functionalities/tsan/global_location/TestTsanGlobalLocation.py (1886 of 2029) PASS: lldb-api :: lang/cpp/breakpoint-commands/TestCPPBreakpointCommands.py (1887 of 2029) PASS: lldb-unit :: Process/minidump/./LLDBMinidumpTests/MinidumpParserTest.GetLinuxProcStatus_no_stream (1888 of 2029) PASS: lldb-unit :: Utility/./UtilityTests/StringExtractorTest.GetHexBytes_FullString (1889 of 2029) PASS: lldb-shell :: Driver/TestPositionalArgs.test (1890 of 2029) PASS: lldb-api :: lang/cpp/constructors/TestCppConstructors.py (1891 of 2029) PASS: lldb-unit :: Utility/./UtilityTests/FileSpecTest.EqualDotsPosix (1892 of 2029) PASS: lldb-api :: commands/expression/dont_allow_jit/TestAllowJIT.py (1893 of 2029) PASS: lldb-unit :: Symbol/./SymbolTests/TestTypeSystemClang.TestGetEnumIntegerTypeUnexpectedType (1894 of 2029) PASS: lldb-unit :: Utility/./UtilityTests/StringListTest.CopyListSingle (1895 of 2029) UNSUPPORTED: lldb-shell :: SymbolFile/Breakpad/stack-cfi-arm.yaml (1896 of 2029) PASS: lldb-api :: lang/cpp/scope/TestCppScope.py (1897 of 2029) PASS: lldb-api :: functionalities/thread/concurrent_events/TestConcurrentManyWatchpoints.py (1898 of 2029) PASS: lldb-api :: python_api/value/linked_list/TestValueAPILinkedList.py (1899 of 2029) PASS: lldb-unit :: Target/./TargetTests/MCBasedABI.MapRegisterName (1900 of 2029) PASS: lldb-api :: functionalities/data-formatter/data-formatter-script/TestDataFormatterScript.py (1901 of 2029) PASS: lldb-unit :: Utility/./UtilityTests/ArchSpecTest.TestParseMachCPUDashSubtypeTripleSimple (1902 of 2029) PASS: lldb-api :: linux/builtin_trap/TestBuiltinTrap.py (1903 of 2029) PASS: lldb-unit :: DataFormatter/./LLDBFormatterTests/StringPrinterTests.CxxASCII (1904 of 2029) PASS: lldb-api :: python_api/file_handle/TestFileHandle.py (1905 of 2029) PASS: lldb-unit :: Symbol/./SymbolTests/Type.CompilerContextPattern (1906 of 2029) PASS: lldb-unit :: Expression/./ExpressionTests/DiagnosticManagerTest.PutString (1907 of 2029) PASS: lldb-unit :: UnwindAssembly/x86/./UnwindAssemblyx86Tests/Testx86AssemblyInspectionEngine.Test32bitFramelessSmallStackFrame (1908 of 2029) PASS: lldb-api :: commands/frame/language/TestGuessLanguage.py (1909 of 2029) PASS: lldb-unit :: Utility/./UtilityTests/ScalarTest.Division (1910 of 2029) PASS: lldb-unit :: Utility/./UtilityTests/RecordReplayTest.InstrumentedBar (1911 of 2029) PASS: lldb-api :: python_api/lldbutil/iter/TestLLDBIterator.py (1912 of 2029) FAIL: lldb-api :: commands/expression/call-throws/TestCallThatThrows.py (1913 of 2029) ******************** TEST 'lldb-api :: commands/expression/call-throws/TestCallThatThrows.py' FAILED ******************** Script: -- /Users/buildslave/jenkins/workspace/lldb-cmake-sanitized/lldb-build/lldb-test-build.noindex/copied-system-python /Users/buildslave/jenkins/workspace/lldb-cmake-sanitized/llvm-project/lldb/test/API/dotest.py --arch x86_64 -s /Users/buildslave/jenkins/workspace/lldb-cmake-sanitized/lldb-build/lldb-test-traces -S nm -u CXXFLAGS -u CFLAGS --codesign-identity lldb_codesign --server /Users/buildslave/jenkins/workspace/lldb-cmake-sanitized/lldb-build/./bin/debugserver --arch x86_64 --build-dir /Users/buildslave/jenkins/workspace/lldb-cmake-sanitized/lldb-build/lldb-test-build.noindex -s=/Users/buildslave/jenkins/workspace/lldb-cmake-sanitized/test/logs -t --env TERM=vt100 --env LLVM_LIBS_DIR=/Users/buildslave/jenkins/workspace/lldb-cmake-sanitized/lldb-build/./lib --inferior-env ASAN_OPTIONS=detect_stack_use_after_return=1 --inferior-env DYLD_INSERT_LIBRARIES=/Users/buildslave/jenkins/workspace/lldb-cmake-sanitized/host-compiler/lib/clang/11.0.0/lib/darwin/libclang_rt.asan_osx_dynamic.dylib --build-dir /Users/buildslave/jenkins/workspace/lldb-cmake-sanitized/lldb-build/lldb-test-build.noindex --lldb-module-cache-dir /Users/buildslave/jenkins/workspace/lldb-cmake-sanitized/lldb-build/lldb-test-build.noindex/module-cache-lldb/lldb-api --clang-module-cache-dir /Users/buildslave/jenkins/workspace/lldb-cmake-sanitized/lldb-build/lldb-test-build.noindex/module-cache-clang/lldb-api --executable /Users/buildslave/jenkins/workspace/lldb-cmake-sanitized/lldb-build/./bin/lldb --compiler /Users/buildslave/jenkins/workspace/lldb-cmake-sanitized/lldb-build/./bin/clang --dsymutil /Users/buildslave/jenkins/workspace/lldb-cmake-sanitized/lldb-build/./bin/dsymutil --filecheck /Users/buildslave/jenkins/workspace/lldb-cmake-sanitized/lldb-build/./bin/FileCheck --lldb-libs-dir /Users/buildslave/jenkins/workspace/lldb-cmake-sanitized/lldb-build/./lib /Users/buildslave/jenkins/workspace/lldb-cmake-sanitized/llvm-project/lldb/test/API/commands/expression/call-throws -p TestCallThatThrows.py -- Exit Code: -6

Hide Details

Command Output (stdout): -- lldb version 11.0.99 clang revision e128f01be996f5f9a0e0cf5565d8a0696783b85d llvm revision e128f01be996f5f9a0e0cf5565d8a0696783b85d

Hide Details

-- Command Output (stderr): -- Assertion failed: (tokenKind == tok::kw___bridge_retain), function ParseParenExpression, file /Users/buildslave/jenkins/workspace/lldb-cmake-sanitized/llvm-project/clang/lib/Parse/ParseExpr.cpp, line 2819.

Hide Details

--

Hide Details

******************** PASS: lldb-unit :: Utility/./UtilityTests/UriParserTest.Empty (1914 of 2029) PASS: lldb-shell :: Driver/TestConvenienceVariables.test (1915 of 2029) PASS: lldb-api :: tools/lldb-server/TestGdbRemoteAttach.py (1916 of 2029) PASS: lldb-api :: functionalities/breakpoint/breakpoint_set_restart/TestBreakpointSetRestart.py (1917 of 2029) PASS: lldb-unit :: Utility/./UtilityTests/StringListTest.ForRangeEmpty (1918 of 2029) PASS: lldb-api :: functionalities/target_var/TestTargetVar.py (1919 of 2029) PASS: lldb-api :: tools/lldb-server/inferior-crash/TestGdbRemoteAbort.py (1920 of 2029) PASS: lldb-shell :: ObjectFile/ELF/basic-info.yaml (1921 of 2029) PASS: lldb-api :: functionalities/return-value/TestReturnValue.py (1922 of 2029) PASS: lldb-api :: commands/expression/completion-crash-incomplete-record/TestCompletionCrashIncompleteRecord.py (1923 of 2029) PASS: lldb-api :: python_api/sbplatform/TestSBPlatform.py (1924 of 2029) PASS: lldb-shell :: Watchpoint/SetErrorCases.test (1925 of 2029) UNSUPPORTED: lldb-shell :: Register/arm-fp-read.test (1926 of 2029) PASS: lldb-api :: commands/expression/test/TestExprs2.py (1927 of 2029) PASS: lldb-api :: python_api/hello_world/TestHelloWorld.py (1928 of 2029) PASS: lldb-unit :: Utility/./UtilityTests/DataExtractorTest.GetCStrUnterminated (1929 of 2029) PASS: lldb-api :: commands/expression/import-std-module/shared_ptr-dbg-info-content/TestSharedPtrDbgInfoContentFromStdModule.py (1930 of 2029) PASS: lldb-unit :: Process/gdb-remote/./ProcessGdbRemoteTests/GDBRemoteCommunicationClientTest.GetModulesInfo (1931 of 2029) PASS: lldb-unit :: Utility/./UtilityTests/StringExtractorTest.GetHexBytesAvail_FullString (1932 of 2029) PASS: lldb-api :: commands/register/register/register_command/TestRegisters.py (1933 of 2029) PASS: lldb-unit :: Expression/./ExpressionTests/DiagnosticManagerTest.GetStringNoDiags (1934 of 2029) PASS: lldb-api :: functionalities/data-formatter/data-formatter-stl/libcxx/unique_ptr/TestDataFormatterLibcxxUniquePtr.py (1935 of 2029) PASS: lldb-unit :: Target/./TargetTests/ExecutionContextTest.GetByteOrderProcess (1936 of 2029) PASS: lldb-unit :: Utility/./UtilityTests/VMRange.ContainsAddr (1937 of 2029) UNSUPPORTED: lldb-shell :: SymbolFile/PDB/udt-layout.test (1938 of 2029) PASS: lldb-api :: functionalities/data-formatter/data-formatter-ptr-to-array/TestPtrToArrayFormatting.py (1939 of 2029) PASS: lldb-api :: functionalities/mtc/simple/TestMTCSimple.py (1940 of 2029) PASS: lldb-shell :: ObjectFile/PECOFF/dep-modules.yaml (1941 of 2029) PASS: lldb-api :: functionalities/thread/concurrent_events/TestConcurrentWatchpointWithDelayWatchpointThreads.py (1942 of 2029) PASS: lldb-shell :: SymbolFile/DWARF/dwp-debug-types.s (1943 of 2029) UNSUPPORTED: lldb-api :: arm/breakpoint-it/TestBreakpointIt.py (1944 of 2029) PASS: lldb-api :: commands/apropos/with-process/TestAproposWithProcess.py (1945 of 2029) PASS: lldb-unit :: Utility/./UtilityTests/FileSpecTest.Match (1946 of 2029) PASS: lldb-shell :: ObjectFile/Breakpad/sections-trailing-func.test (1947 of 2029) PASS: lldb-unit :: Utility/./UtilityTests/FileSpecTest.EqualDotsWindows (1948 of 2029) PASS: lldb-api :: types/TestCharType.py (1949 of 2029) PASS: lldb-api :: lang/cpp/stl/TestStdCXXDisassembly.py (1950 of 2029) PASS: lldb-api :: python_api/interpreter/TestCommandInterpreterAPI.py (1951 of 2029) PASS: lldb-unit :: Interpreter/./InterpreterTests/OptionArgParserTest.toScriptLanguage (1952 of 2029) PASS: lldb-api :: lang/c/unicode/TestUnicodeSymbols.py (1953 of 2029) PASS: lldb-shell :: Breakpoint/jitbp_elf.test (1954 of 2029) PASS: lldb-unit :: Language/Highlighting/./HighlighterTests/HighlighterTest.ClangCursorPosEndOfLine (1955 of 2029) PASS: lldb-unit :: Host/./HostTests/Host.GetEnvironment (1956 of 2029) PASS: lldb-api :: commands/gui/invalid-args/TestInvalidArgsGui.py (1957 of 2029) PASS: lldb-api :: commands/expression/codegen-crash-typedefdecl-not-in_declcontext/TestCodegenCrashTypedefDeclNotInDeclContext.py (1958 of 2029) PASS: lldb-api :: functionalities/thread/concurrent_events/TestConcurrentTwoBreakpointThreads.py (1959 of 2029) PASS: lldb-api :: functionalities/thread/concurrent_events/TestConcurrentSignalNWatchNBreak.py (1960 of 2029) PASS: lldb-unit :: Utility/./UtilityTests/StringExtractorTest.DecodeHexU8_Underflow (1961 of 2029) PASS: lldb-unit :: Interpreter/./InterpreterTests/CompletionTest.FileCompletionAbsolute (1962 of 2029) PASS: lldb-api :: functionalities/data-formatter/data-formatter-stl/libcxx/initializerlist/TestInitializerList.py (1963 of 2029) UNSUPPORTED: lldb-api :: linux/add-symbols/TestTargetSymbolsAddCommand.py (1964 of 2029) PASS: lldb-unit :: Utility/./UtilityTests/StringExtractorTest.GetHexU8_InvalidHex (1965 of 2029) PASS: lldb-unit :: ObjectFile/Breakpad/./ObjectFileBreakpadTests/FuncRecord.parse (1966 of 2029) PASS: lldb-api :: commands/expression/import-std-module/unique_ptr/TestUniquePtrFromStdModule.py (1967 of 2029) PASS: lldb-unit :: Utility/./UtilityTests/StringExtractorTest.GetHexBytesAvail_Partial (1968 of 2029) PASS: lldb-unit :: Utility/./UtilityTests/UriParserTest.BadPort2 (1969 of 2029) UNSUPPORTED: lldb-api :: benchmarks/stepping/TestSteppingSpeed.py (1970 of 2029) UNSUPPORTED: lldb-api :: functionalities/data-formatter/data-formatter-stl/libstdcpp/smart_ptr/TestDataFormatterStdSmartPtr.py (1971 of 2029) PASS: lldb-unit :: Utility/./UtilityTests/StringListTest.SplitIntoLinesSingleTrailingCR (1972 of 2029) PASS: lldb-unit :: Utility/./UtilityTests/FileSpecTest.OperatorBool (1973 of 2029) PASS: lldb-unit :: Symbol/./SymbolTests/SymbolsTest.TerminateLocateExecutableSymbolFileForUnknownExecutableAndUnknownSymbolFile (1974 of 2029) PASS: lldb-api :: functionalities/inferior-crashing/recursive-inferior/TestRecursiveInferior.py (1975 of 2029) PASS: lldb-api :: macosx/profile_vrs_detach/TestDetachVrsProfile.py (1976 of 2029) PASS: lldb-api :: commands/expression/no-deadlock/TestExprDoesntBlock.py (1977 of 2029) PASS: lldb-unit :: Utility/./UtilityTests/StringExtractorTest.GetU64BigEndian (1978 of 2029) PASS: lldb-api :: lang/c/offsetof/TestOffsetof.py (1979 of 2029) PASS: lldb-shell :: SymbolFile/DWARF/dir-separator-no-comp-dir.s (1980 of 2029) PASS: lldb-unit :: Symbol/./SymbolTests/TestTypeSystemClang.TestRemoveFastQualifiers (1981 of 2029) PASS: lldb-shell :: SymbolFile/DWARF/childless-compile-unit.s (1982 of 2029) PASS: lldb-unit :: Utility/./UtilityTests/OptionsWithRawTest.SingleWhitespaceInput (1983 of 2029) PASS: lldb-unit :: Utility/./UtilityTests/GeneratorTest.GetOrCreate (1984 of 2029) PASS: lldb-unit :: Language/Highlighting/./HighlighterTests/HighlighterTest.ClangCursorOutOfBounds (1985 of 2029) PASS: lldb-unit :: Process/gdb-remote/./ProcessGdbRemoteTests/GDBRemoteCommunicationServerTest.SendErrorResponse_Status (1986 of 2029) PASS: lldb-unit :: Expression/./ExpressionTests/CppModuleConfigurationTest.Xcode (1987 of 2029) PASS: lldb-api :: macosx/find-app-in-bundle/TestFindAppInBundle.py (1988 of 2029) PASS: lldb-unit :: UnwindAssembly/x86/./UnwindAssemblyx86Tests/Testx86AssemblyInspectionEngine.TestSpillRegToStackViaMOVi386 (1989 of 2029) PASS: lldb-unit :: Utility/./UtilityTests/DataExtractorTest.GetCStr (1990 of 2029) PASS: lldb-unit :: Language/Highlighting/./HighlighterTests/HighlighterTest.ClangCommas (1991 of 2029) PASS: lldb-api :: tools/lldb-server/TestAppleSimulatorOSType.py (1992 of 2029) PASS: lldb-unit :: Process/gdb-remote/./ProcessGdbRemoteTests/GDBRemoteCommunicationClientTest.ReadRegister (1993 of 2029) PASS: lldb-api :: sanity/TestSettingSkipping.py (1994 of 2029) PASS: lldb-unit :: Utility/./UtilityTests/ArgsTest.TestAppendArg (1995 of 2029) UNSUPPORTED: lldb-api :: terminal/TestEditline.py (1996 of 2029) PASS: lldb-api :: lang/cpp/gmodules/TestWithModuleDebugging.py (1997 of 2029) PASS: lldb-unit :: UnwindAssembly/x86/./UnwindAssemblyx86Tests/Testx86AssemblyInspectionEngine.TestPopR12 (1998 of 2029) PASS: lldb-unit :: Utility/./UtilityTests/RangeDataVector.FindEntryThatContains (1999 of 2029) PASS: lldb-unit :: Utility/./UtilityTests/ListenerTest.GetEventWait (2000 of 2029) PASS: lldb-api :: commands/disassemble/basic/TestFrameDisassemble.py (2001 of 2029) PASS: lldb-api :: lang/c/step-target/TestStepTarget.py (2002 of 2029) PASS: lldb-unit :: Utility/./UtilityTests/StreamTest.PutHex64ByteOrderBig (2003 of 2029) PASS: lldb-api :: commands/expression/timeout/TestCallWithTimeout.py (2004 of 2029) PASS: lldb-unit :: Expression/./ExpressionTests/DiagnosticManagerTest.GetStringMultipleDiags (2005 of 2029) PASS: lldb-api :: commands/expression/options/TestExprOptions.py (2006 of 2029) PASS: lldb-unit :: Utility/./UtilityTests/StreamTest.AddressEmptyPrefix (2007 of 2029) PASS: lldb-unit :: Utility/./UtilityTests/BinaryStreamTest.PutSLEB128One (2008 of 2029) PASS: lldb-unit :: Utility/./UtilityTests/LogChannelEnabledTest.LLDB_LOG_ERROR (2009 of 2029) PASS: lldb-api :: lang/cpp/static_methods/TestCPPStaticMethods.py (2010 of 2029) PASS: lldb-unit :: Utility/./UtilityTests/ArgsTest.TestUnknownEscape (2011 of 2029) PASS: lldb-unit :: Utility/./UtilityTests/StreamTest.QuotedCString (2012 of 2029) PASS: lldb-unit :: Host/./HostTests/ProcessLaunchInfoTest.Constructor (2013 of 2029) PASS: lldb-api :: types/TestIntegerType.py (2014 of 2029) PASS: lldb-unit :: Utility/./UtilityTests/RangeTest.Copy (2015 of 2029) PASS: lldb-unit :: Symbol/./SymbolTests/TestTypeSystemClang.TestIsClangType (2016 of 2029) PASS: lldb-shell :: SymbolFile/DWARF/split-dwarf-inlining.cpp (2017 of 2029) PASS: lldb-unit :: Utility/./UtilityTests/RangeTest.LessThanInvalid (2018 of 2029) PASS: lldb-unit :: Process/minidump/./LLDBMinidumpTests/MinidumpParserTest.GetMiscInfo_no_stream (2019 of 2029) PASS: lldb-unit :: Utility/./UtilityTests/StreamTest.PutChar (2020 of 2029) PASS: lldb-unit :: Language/Highlighting/./HighlighterTests/HighlighterTest.ClangTrailingBackslashWithWhitespace (2021 of 2029) PASS: lldb-api :: lang/cpp/class_types/TestClassTypes.py (2022 of 2029) PASS: lldb-unit :: Language/Highlighting/./HighlighterTests/HighlighterTest.ClangSquareBrackets (2023 of 2029) PASS: lldb-unit :: Symbol/./SymbolTests/TestClangASTImporter.MetadataPropagation (2024 of 2029) PASS: lldb-unit :: Utility/./UtilityTests/BinaryStreamTest.PutULEB128NineBytes (2025 of 2029) PASS: lldb-unit :: ScriptInterpreter/Python/./ScriptInterpreterPythonTests/PythonDataObjectsTest.TestExtractingUInt64ThroughStructuredData (2026 of 2029) PASS: lldb-api :: commands/expression/completion/TestExprCompletion.py (2027 of 2029) PASS: lldb-shell :: Reproducer/Functionalities/TestDataFormatter.test (2028 of 2029) PASS: lldb-api :: functionalities/thread/backtrace_all/TestBacktraceAll.py (2029 of 2029) Slowest Tests: -------------------------------------------------------------------------- 346.83s: lldb-api :: tools/lldb-server/TestLldbGdbServer.py 265.00s: lldb-api :: lang/cpp/enum_types/TestCPP11EnumTypes.py 254.41s: lldb-api :: api/multithreaded/TestMultithreaded.py 246.37s: lldb-api :: tools/lldb-server/TestGdbRemoteThreadsInStopReply.py 154.55s: lldb-api :: lang/objc/exceptions/TestObjCExceptions.py 153.87s: lldb-api :: lang/cpp/namespace/TestNamespaceLookup.py 141.60s: lldb-api :: lang/objc/real-definition/TestRealDefinition.py 122.57s: lldb-api :: types/TestLongTypesExpr.py 119.45s: lldb-api :: tools/lldb-server/TestGdbRemote_qThreadStopInfo.py 109.47s: lldb-api :: lang/objc/foundation/TestObjCMethods.py 99.97s: lldb-api :: commands/expression/import-std-module/stack/TestStackFromStdModule.py 91.77s: lldb-api :: functionalities/gdb_remote_client/TestWasm.py 89.56s: lldb-api :: commands/settings/TestSettings.py 88.14s: lldb-api :: functionalities/data-formatter/ostypeformatting/TestFormattersOsType.py 86.21s: lldb-api :: functionalities/data-formatter/compactvectors/TestCompactVectors.py 84.62s: lldb-api :: types/TestLongTypes.py 84.36s: lldb-api :: commands/expression/import-std-module/vector-dbg-info-content/TestDbgInfoContentVectorFromStdModule.py 82.93s: lldb-api :: python_api/lldbutil/iter/TestLLDBIterator.py 81.34s: lldb-api :: api/check_public_api_headers/TestPublicAPIHeaders.py 81.02s: lldb-api :: lang/objc/hidden-ivars/TestHiddenIvars.py

Hide Details

Tests Times: -------------------------------------------------------------------------- [ Range ] :: [ Percentage ] :: [ Count ] -------------------------------------------------------------------------- [340s,360s) :: [ ] :: [ 1/2029] [320s,340s) :: [ ] :: [ 0/2029] [300s,320s) :: [ ] :: [ 0/2029] [280s,300s) :: [ ] :: [ 0/2029] [260s,280s) :: [ ] :: [ 2/2029] [240s,260s) :: [ ] :: [ 1/2029] [220s,240s) :: [ ] :: [ 0/2029] [200s,220s) :: [ ] :: [ 0/2029] [180s,200s) :: [ ] :: [ 0/2029] [160s,180s) :: [ ] :: [ 1/2029] [140s,160s) :: [ ] :: [ 2/2029] [120s,140s) :: [ ] :: [ 2/2029] [100s,120s) :: [ ] :: [ 2/2029] [ 80s,100s) :: [ ] :: [ 11/2029] [ 60s, 80s) :: [ ] :: [ 18/2029] [ 40s, 60s) :: [* ] :: [ 92/2029] [ 20s, 40s) :: [** ] :: [ 117/2029] [ 0s, 20s) :: [*********************************** ] :: [1780/2029] -------------------------------------------------------------------------- ******************** Failing Tests (53): lldb-api :: lang/objc/orderedset/TestOrderedSet.py lldb-api :: functionalities/data-formatter/data-formatter-objc/TestDataFormatterObjCExpr.py lldb-api :: lang/objc/hidden-ivars/TestHiddenIvars.py lldb-api :: lang/objc/self/TestObjCSelf.py lldb-api :: lang/objc/objc-ivar-protocols/TestIvarProtocols.py lldb-api :: commands/expression/persist_objc_pointeetype/TestPersistObjCPointeeType.py lldb-api :: lang/objc/objc-new-syntax/TestObjCNewSyntaxArray.py lldb-api :: lang/objc/objc-property/TestObjCProperty.py lldb-api :: commands/expression/namespace_local_var_same_name_obj_c/TestNamespaceLocalVarSameNameObjC.py lldb-api :: lang/objc/rdar-11355592/TestRdar11355592.py lldb-api :: lang/objc/objc++/TestObjCXX.py lldb-api :: lang/objc/radar-9691614/TestObjCMethodReturningBOOL.py lldb-api :: lang/objc/modules/TestObjCModules.py lldb-api :: lang/objcxx/cxx-bridged-po/TestObjCXXBridgedPO.py lldb-api :: lang/objc/unicode-string/TestUnicodeString.py lldb-api :: functionalities/data-formatter/poarray/TestPrintObjectArray.py lldb-api :: lang/objc/objc-new-syntax/TestObjCNewSyntaxLiteral.py lldb-api :: lang/objc/foundation/TestObjCMethods.py lldb-api :: lang/objc/foundation/TestObjCMethodsNSError.py lldb-api :: python_api/exprpath_synthetic/TestExprPathSynthetic.py lldb-api :: lang/objcxx/objcxx-ivar-vector/TestIvarVector.py lldb-api :: lang/objc/foundation/TestRuntimeTypes.py lldb-api :: lang/objc/objc-struct-argument/TestObjCStructArgument.py lldb-api :: functionalities/data-formatter/data-formatter-objc/TestDataFormatterObjCNSContainer.py lldb-api :: commands/expression/context-object-objc/TestContextObjectObjc.py lldb-api :: commands/expression/diagnostics/TestExprDiagnostics.py lldb-api :: functionalities/data-formatter/data-formatter-objc/nsindexpath/TestDataFormatterNSIndexPath.py lldb-api :: lang/objc/objc-runtime-ivars/TestRuntimeIvars.py lldb-api :: lang/objc/print-obj/TestPrintObj.py lldb-api :: lang/objc/objc-new-syntax/TestObjCNewSyntaxDictionary.py lldb-api :: lang/objc/objc-optimized/TestObjcOptimized.py lldb-api :: lang/objc/objc_direct-methods/TestObjCDirectMethods.py lldb-api :: functionalities/data-formatter/synthupdate/TestSyntheticFilterRecompute.py lldb-api :: lang/objc/modules-non-objc-target/TestObjCModulesNonObjCTarget.py lldb-api :: commands/expression/po_verbosity/TestPoVerbosity.py lldb-api :: lang/objc/foundation/TestObjCMethodsString.py lldb-api :: lang/objc/blocks/TestObjCIvarsInBlocks.py lldb-api :: functionalities/set-data/TestSetData.py lldb-api :: lang/objc/variadic_methods/TestVariadicMethods.py lldb-api :: lang/objc/forward-decl/TestForwardDecl.py lldb-api :: lang/objc/foundation/TestConstStrings.py lldb-api :: functionalities/data-formatter/data-formatter-objc/TestDataFormatterObjCCF.py lldb-api :: lang/objc/foundation/TestObjCMethodsNSArray.py lldb-api :: lang/objc/objc-super/TestObjCSuper.py lldb-api :: lang/objc/objc-struct-return/TestObjCStructReturn.py lldb-api :: lang/objc/conflicting-definition/TestConflictingDefinition.py lldb-api :: lang/objc/objc-class-method/TestObjCClassMethod.py lldb-api :: commands/expression/two-files/TestObjCTypeQueryFromOtherCompileUnit.py lldb-api :: functionalities/data-formatter/data-formatter-objc/TestDataFormatterObjCNSError.py lldb-api :: lang/objc/bitfield_ivars/TestBitfieldIvars.py lldb-api :: lang/objc/objc-static-method/TestObjCStaticMethod.py lldb-api :: commands/expression/import_builtin_fileid/TestImportBuiltinFileID.py lldb-api :: commands/expression/call-throws/TestCallThatThrows.py

Hide Details

Hide Details

Testing Time: 4157.26s Unsupported Tests : 170 Expected Passes : 1800 Expected Failures : 6 Unexpected Failures: 53 FAILED: tools/lldb/test/CMakeFiles/check-lldb-lit cd /Users/buildslave/jenkins/workspace/lldb-cmake-sanitized/lldb-build/tools/lldb/test && /usr/local/Frameworks/Python.framework/Versions/3.7/bin/python3.7 /Users/buildslave/jenkins/workspace/lldb-cmake-sanitized/lldb-build/./bin/llvm-lit -v --time-tests --shuffle --xunit-xml-output=/Users/buildslave/jenkins/workspace/lldb-cmake-sanitized/test/results.xml -v -j 4 --timeout 1200 /Users/buildslave/jenkins/workspace/lldb-cmake-sanitized/lldb-build/tools/lldb/test ninja: build stopped: subcommand failed. Command failed: Command '['/usr/bin/env', 'TERM=vt100', '/usr/local/bin/ninja', '-v', 'check-lldb']' returned non-zero exit status 1. Command: ['/usr/bin/env', 'TERM=vt100', '/usr/local/bin/ninja', '-v', 'check-lldb'] [Pipeline] } [Pipeline] // timeout [Pipeline] } [Pipeline] // stage [Pipeline] stage [Pipeline] { (Declarative: Post Actions) [Pipeline] scanForIssues [Clang (LLVM based)] Sleeping for 5 seconds due to JENKINS-32191... [Clang (LLVM based)] Parsing console log (workspace: '/Users/buildslave/jenkins/workspace/lldb-cmake-sanitized') [Clang (LLVM based)] Successfully parsed console log [Clang (LLVM based)] -> found 2 issues (skipped 0 duplicates) [Clang (LLVM based)] Post processing issues on 'green-dragon-23' with source code encoding 'UTF-8' [Clang (LLVM based)] Creating SCM blamer to obtain author and commit information for affected files [Clang (LLVM based)] Creating SCM miner to obtain statistics for affected repository files [Clang (LLVM based)] Resolving file names for all issues in source directory '/Users/buildslave/jenkins/workspace/lldb-cmake-sanitized' [Clang (LLVM based)] -> resolved paths in source directory (1 found, 0 not found) [Clang (LLVM based)] Resolving module names from module definitions (build.xml, pom.xml, or Manifest.mf files) [Clang (LLVM based)] -> resolved module names for 2 issues [Clang (LLVM based)] Resolving package names (or namespaces) by parsing the affected files [Clang (LLVM based)] -> resolved package names of 1 affected files [Clang (LLVM based)] No filter has been set, publishing all 2 issues [Clang (LLVM based)] Creating fingerprints for all affected code blocks to track issues over different builds [Clang (LLVM based)] -> created fingerprints for 2 issues (skipped 0 issues) [Clang (LLVM based)] Copying affected files to Jenkins' build folder '/Users/Shared/Jenkins/Home/jobs/lldb-cmake-sanitized/builds/1503/files-with-issues' [Clang (LLVM based)] -> 1 copied, 0 not in workspace, 0 not-found, 0 with I/O error [Pipeline] junit Recording test results [Pipeline] } [Pipeline] // stage [Pipeline] } [Pipeline] // withEnv [Pipeline] } [Pipeline] // node [Pipeline] End of Pipeline ERROR: script returned exit code 1 Finished: FAILURE