FailedConsole Output

Skipping 8,352 KB.. Full Log
m revision 82aac878beb48cd326b4684918b7ff2375fae439

Hide Details

-- Command Output (stderr): -- Assertion failed: (tokenKind == tok::kw___bridge_retain), function ParseParenExpression, file /Users/buildslave/jenkins/workspace/lldb-cmake-sanitized/llvm-project/clang/lib/Parse/ParseExpr.cpp, line 2819.

Hide Details

--

Hide Details

******************** PASS: lldb-shell :: SymbolFile/DWARF/dwarf5-partial-index.cpp (1694 of 2030) PASS: lldb-unit :: UnwindAssembly/x86/./UnwindAssemblyx86Tests/Testx86AssemblyInspectionEngine.TestPopR13 (1695 of 2030) PASS: lldb-api :: macosx/safe-to-func-call/TestSafeFuncCalls.py (1696 of 2030) PASS: lldb-api :: tools/lldb-server/TestGdbRemoteProcessInfo.py (1697 of 2030) PASS: lldb-unit :: Utility/./UtilityTests/StringExtractorTest.GetHexBytes_Partial (1698 of 2030) PASS: lldb-unit :: Target/./TargetTests/StackFrameRecognizerTest.NullModuleRegex (1699 of 2030) PASS: lldb-api :: commands/target/basic/TestTargetCommand.py (1700 of 2030) PASS: lldb-api :: macosx/load-kext/TestLoadKext.py (1701 of 2030) PASS: lldb-unit :: Utility/./UtilityTests/GeneratorTest.GetOrCreate (1702 of 2030) PASS: lldb-api :: commands/gui/invalid-args/TestInvalidArgsGui.py (1703 of 2030) UNSUPPORTED: lldb-api :: tools/lldb-vscode/completions/TestVSCode_completions.py (1704 of 2030) PASS: lldb-api :: functionalities/value_md5_crash/TestValueMD5Crash.py (1705 of 2030) PASS: lldb-shell :: SymbolFile/DWARF/dwarf5_locations.s (1706 of 2030) PASS: lldb-unit :: Utility/./UtilityTests/ArgsTest.EscapeLLDBCommandArgument (1707 of 2030) UNSUPPORTED: lldb-shell :: Register/arm-gp-read.test (1708 of 2030) PASS: lldb-api :: lang/cpp/unique-types/TestUniqueTypes.py (1709 of 2030) UNSUPPORTED: lldb-api :: commands/expression/multiline-navigation/TestMultilineNavigation.py (1710 of 2030) PASS: lldb-api :: commands/command/history/TestCommandHistory.py (1711 of 2030) PASS: lldb-shell :: SymbolFile/Breakpad/line-table-discontinuous-file-ids.test (1712 of 2030) UNSUPPORTED: lldb-api :: tools/lldb-server/platform-process-connect/TestPlatformProcessConnect.py (1713 of 2030) FAIL: lldb-api :: functionalities/data-formatter/data-formatter-objc/nsindexpath/TestDataFormatterNSIndexPath.py (1714 of 2030) ******************** TEST 'lldb-api :: functionalities/data-formatter/data-formatter-objc/nsindexpath/TestDataFormatterNSIndexPath.py' FAILED ******************** Script: -- /Users/buildslave/jenkins/workspace/lldb-cmake-sanitized/lldb-build/lldb-test-build.noindex/copied-system-python /Users/buildslave/jenkins/workspace/lldb-cmake-sanitized/llvm-project/lldb/test/API/dotest.py --arch x86_64 -s /Users/buildslave/jenkins/workspace/lldb-cmake-sanitized/lldb-build/lldb-test-traces -S nm -u CXXFLAGS -u CFLAGS --codesign-identity lldb_codesign --server /Users/buildslave/jenkins/workspace/lldb-cmake-sanitized/lldb-build/./bin/debugserver --arch x86_64 --build-dir /Users/buildslave/jenkins/workspace/lldb-cmake-sanitized/lldb-build/lldb-test-build.noindex -s=/Users/buildslave/jenkins/workspace/lldb-cmake-sanitized/test/logs -t --env TERM=vt100 --env LLVM_LIBS_DIR=/Users/buildslave/jenkins/workspace/lldb-cmake-sanitized/lldb-build/./lib --inferior-env ASAN_OPTIONS=detect_stack_use_after_return=1 --inferior-env DYLD_INSERT_LIBRARIES=/Users/buildslave/jenkins/workspace/lldb-cmake-sanitized/host-compiler/lib/clang/11.0.0/lib/darwin/libclang_rt.asan_osx_dynamic.dylib --build-dir /Users/buildslave/jenkins/workspace/lldb-cmake-sanitized/lldb-build/lldb-test-build.noindex --lldb-module-cache-dir /Users/buildslave/jenkins/workspace/lldb-cmake-sanitized/lldb-build/lldb-test-build.noindex/module-cache-lldb/lldb-api --clang-module-cache-dir /Users/buildslave/jenkins/workspace/lldb-cmake-sanitized/lldb-build/lldb-test-build.noindex/module-cache-clang/lldb-api --executable /Users/buildslave/jenkins/workspace/lldb-cmake-sanitized/lldb-build/./bin/lldb --compiler /Users/buildslave/jenkins/workspace/lldb-cmake-sanitized/lldb-build/./bin/clang --dsymutil /Users/buildslave/jenkins/workspace/lldb-cmake-sanitized/lldb-build/./bin/dsymutil --filecheck /Users/buildslave/jenkins/workspace/lldb-cmake-sanitized/lldb-build/./bin/FileCheck --lldb-libs-dir /Users/buildslave/jenkins/workspace/lldb-cmake-sanitized/lldb-build/./lib /Users/buildslave/jenkins/workspace/lldb-cmake-sanitized/llvm-project/lldb/test/API/functionalities/data-formatter/data-formatter-objc/nsindexpath -p TestDataFormatterNSIndexPath.py -- Exit Code: -6

Hide Details

Command Output (stdout): -- lldb version 11.0.99 clang revision 82aac878beb48cd326b4684918b7ff2375fae439 llvm revision 82aac878beb48cd326b4684918b7ff2375fae439

Hide Details

-- Command Output (stderr): --

Hide Details

Session logs for test failures/errors/unexpected successes will go into directory '/Users/buildslave/jenkins/workspace/lldb-cmake-sanitized/test/logs' Command invoked: /Users/buildslave/jenkins/workspace/lldb-cmake-sanitized/llvm-project/lldb/test/API/dotest.py --arch x86_64 -s /Users/buildslave/jenkins/workspace/lldb-cmake-sanitized/lldb-build/lldb-test-traces -S nm -u CXXFLAGS -u CFLAGS --codesign-identity lldb_codesign --server /Users/buildslave/jenkins/workspace/lldb-cmake-sanitized/lldb-build/./bin/debugserver --arch x86_64 --build-dir /Users/buildslave/jenkins/workspace/lldb-cmake-sanitized/lldb-build/lldb-test-build.noindex -s=/Users/buildslave/jenkins/workspace/lldb-cmake-sanitized/test/logs -t --env TERM=vt100 --env LLVM_LIBS_DIR=/Users/buildslave/jenkins/workspace/lldb-cmake-sanitized/lldb-build/./lib --inferior-env ASAN_OPTIONS=detect_stack_use_after_return=1 --inferior-env DYLD_INSERT_LIBRARIES=/Users/buildslave/jenkins/workspace/lldb-cmake-sanitized/host-compiler/lib/clang/11.0.0/lib/darwin/libclang_rt.asan_osx_dynamic.dylib --build-dir /Users/buildslave/jenkins/workspace/lldb-cmake-sanitized/lldb-build/lldb-test-build.noindex --lldb-module-cache-dir /Users/buildslave/jenkins/workspace/lldb-cmake-sanitized/lldb-build/lldb-test-build.noindex/module-cache-lldb/lldb-api --clang-module-cache-dir /Users/buildslave/jenkins/workspace/lldb-cmake-sanitized/lldb-build/lldb-test-build.noindex/module-cache-clang/lldb-api --executable /Users/buildslave/jenkins/workspace/lldb-cmake-sanitized/lldb-build/./bin/lldb --compiler /Users/buildslave/jenkins/workspace/lldb-cmake-sanitized/lldb-build/./bin/clang --dsymutil /Users/buildslave/jenkins/workspace/lldb-cmake-sanitized/lldb-build/./bin/dsymutil --filecheck /Users/buildslave/jenkins/workspace/lldb-cmake-sanitized/lldb-build/./bin/FileCheck --lldb-libs-dir /Users/buildslave/jenkins/workspace/lldb-cmake-sanitized/lldb-build/./lib /Users/buildslave/jenkins/workspace/lldb-cmake-sanitized/llvm-project/lldb/test/API/functionalities/data-formatter/data-formatter-objc/nsindexpath -p TestDataFormatterNSIndexPath.py Change dir to: /Users/buildslave/jenkins/workspace/lldb-cmake-sanitized/llvm-project/lldb/test/API/functionalities/data-formatter/data-formatter-objc/nsindexpath runCmd: settings clear -all output:

Hide Details

runCmd: settings set symbols.enable-external-lookup false output:

Hide Details

runCmd: settings set target.auto-apply-fixits false output:

Hide Details

runCmd: settings set plugin.process.gdb-remote.packet-timeout 60 output:

Hide Details

runCmd: settings set symbols.clang-modules-cache-path "/Users/buildslave/jenkins/workspace/lldb-cmake-sanitized/lldb-build/lldb-test-build.noindex/module-cache-lldb/lldb-api" output:

Hide Details

runCmd: settings set use-color false output:

Hide Details

runCmd: setting set target.prefer-dynamic-value no-dynamic-values output:

Hide Details

runCmd: settings set target.env-vars ASAN_OPTIONS=detect_stack_use_after_return=1 DYLD_INSERT_LIBRARIES=/Users/buildslave/jenkins/workspace/lldb-cmake-sanitized/host-compiler/lib/clang/11.0.0/lib/darwin/libclang_rt.asan_osx_dynamic.dylib output:

Hide Details

runCmd: file /Users/buildslave/jenkins/workspace/lldb-cmake-sanitized/lldb-build/lldb-test-build.noindex/functionalities/data-formatter/data-formatter-objc/nsindexpath/TestDataFormatterNSIndexPath.test_nsindexpath_with_run_command_dsym/a.out output: Current executable set to '/Users/buildslave/jenkins/workspace/lldb-cmake-sanitized/lldb-build/lldb-test-build.noindex/functionalities/data-formatter/data-formatter-objc/nsindexpath/TestDataFormatterNSIndexPath.test_nsindexpath_with_run_command_dsym/a.out' (x86_64).

Hide Details

Hide Details

runCmd: breakpoint set -f "main.m" -l 15 output: Breakpoint 1: where = a.out`main + 301 at main.m:15:22, address = 0x0000000100000e9d

Hide Details

Hide Details

Expecting pattern: ^Breakpoint (?P<bpno>[0-9]+): (?P<num_locations>[0-9]+) locations\.$ Not matched

Hide Details

Expecting pattern: ^Breakpoint (?P<bpno>[0-9]+): (?P<num_locations>no) locations \(pending\)\. Not matched

Hide Details

Expecting pattern: ^Breakpoint (?P<bpno>[0-9]+): where = (?P<module>.*)`(?P<symbol>[+\-]{0,1}[^+]+)( \+ (?P<offset>[0-9]+)){0,1}( \[inlined\] (?P<inline_symbol>.*)){0,1} at (?P<file>[^:]+):(?P<line_no>[0-9]+)(?P<column>(:[0-9]+)?), address = (?P<address>0x[0-9a-fA-F]+)$ Matched

Hide Details

runCmd: run output: Process 37761 stopped * thread #1, queue = 'com.apple.main-thread', stop reason = breakpoint 1.1 frame #0: 0x0000000100000e9d a.out`main(argc=1, argv=0x00007ffeefbff650) at main.m:15:22 12 NSIndexPath* indexPath4 = [NSIndexPath indexPathWithIndexes:values length:4]; 13 NSIndexPath* indexPath5 = [NSIndexPath indexPathWithIndexes:values length:5]; 14 -> 15 NSLog(@"%@", indexPath1); // break here ^ 16 NSLog(@"%@", indexPath2); 17 NSLog(@"%@", indexPath3); 18 NSLog(@"%@", indexPath4);

Hide Details

Process 37761 launched: '/Users/buildslave/jenkins/workspace/lldb-cmake-sanitized/lldb-build/lldb-test-build.noindex/functionalities/data-formatter/data-formatter-objc/nsindexpath/TestDataFormatterNSIndexPath.test_nsindexpath_with_run_command_dsym/a.out' (x86_64)

Hide Details

Hide Details

runCmd: thread list output: Process 37761 stopped * thread #1: tid = 0x391b4b, 0x0000000100000e9d a.out`main(argc=1, argv=0x00007ffeefbff650) at main.m:15:22, queue = 'com.apple.main-thread', stop reason = breakpoint 1.1

Hide Details

Hide Details

Expecting sub string: stopped Matched

Hide Details

Expecting sub string: stop reason = breakpoint Matched

Hide Details

Adding tearDown hook: def cleanup(): self.runCmd('type format clear', check=False) self.runCmd('type summary clear', check=False) self.runCmd('type synth clear', check=False)

Hide Details

Hide Details

runCmd: frame variable --ptr-depth=1 -d run -- indexPath1 output: (NSIndexPath *) indexPath1 = 0xb37bf1c3252b98af { [0] = 1 }

Hide Details

Hide Details

Expecting sub string: [0] = 1 Matched

Hide Details

runCmd: frame variable --ptr-depth=1 -d run -- indexPath2 output: (NSIndexPath *) indexPath2 = 0xb37bf1c3212b992f { [0] = 1 [1] = 2 }

Hide Details

Hide Details

Expecting sub string: [0] = 1 Matched

Hide Details

Expecting sub string: [1] = 2 Matched

Hide Details

runCmd: frame variable --ptr-depth=1 -d run -- indexPath3 output: (NSIndexPath *) indexPath3 = 0xb37bf103212b99af { [0] = 1 [1] = 2 [2] = 3 }

Hide Details

Hide Details

Expecting sub string: [0] = 1 Matched

Hide Details

Expecting sub string: [1] = 2 Matched

Hide Details

Expecting sub string: [2] = 3 Matched

Hide Details

runCmd: frame variable --ptr-depth=1 -d run -- indexPath4 output: (NSIndexPath *) indexPath4 = 0xb35bf103212b9a2f { [0] = 1 [1] = 2 [2] = 3 [3] = 4 }

Hide Details

Hide Details

Expecting sub string: [0] = 1 Matched

Hide Details

Expecting sub string: [1] = 2 Matched

Hide Details

Expecting sub string: [2] = 3 Matched

Hide Details

Expecting sub string: [3] = 4 Matched

Hide Details

runCmd: frame variable --ptr-depth=1 -d run -- indexPath5 output: (NSIndexPath *) indexPath5 = 0x0000603000002f20 { [0] = 1 [1] = 2 [2] = 3 [3] = 4 [4] = 5 }

Hide Details

Hide Details

Expecting sub string: [0] = 1 Matched

Hide Details

Expecting sub string: [1] = 2 Matched

Hide Details

Expecting sub string: [2] = 3 Matched

Hide Details

Expecting sub string: [3] = 4 Matched

Hide Details

Expecting sub string: [4] = 5 Matched

Hide Details

runCmd: expression --ptr-depth=1 -d run -- indexPath1 output: (NSIndexPath *) $0 = 0xb37bf1c3252b98af { [0] = 1 }

Hide Details

Hide Details

Expecting sub string: [0] = 1 Matched

Hide Details

runCmd: expression --ptr-depth=1 -d run -- indexPath2 output: (NSIndexPath *) $1 = 0xb37bf1c3212b992f { [0] = 1 [1] = 2 }

Hide Details

Hide Details

Expecting sub string: [0] = 1 Matched

Hide Details

Expecting sub string: [1] = 2 Matched

Hide Details

runCmd: expression --ptr-depth=1 -d run -- indexPath3 output: (NSIndexPath *) $2 = 0xb37bf103212b99af { [0] = 1 [1] = 2 [2] = 3 }

Hide Details

Hide Details

Expecting sub string: [0] = 1 Matched

Hide Details

Expecting sub string: [1] = 2 Matched

Hide Details

Expecting sub string: [2] = 3 Matched

Hide Details

runCmd: expression --ptr-depth=1 -d run -- indexPath4 output: (NSIndexPath *) $3 = 0xb35bf103212b9a2f { [0] = 1 [1] = 2 [2] = 3 [3] = 4 }

Hide Details

Hide Details

Expecting sub string: [0] = 1 Matched

Hide Details

Expecting sub string: [1] = 2 Matched

Hide Details

Expecting sub string: [2] = 3 Matched

Hide Details

Expecting sub string: [3] = 4 Matched

Hide Details

runCmd: expression --ptr-depth=1 -d run -- indexPath5 output: (NSIndexPath *) $4 = 0x0000603000002f20 { [0] = 1 [1] = 2 [2] = 3 [3] = 4 [4] = 5 }

Hide Details

Hide Details

Expecting sub string: [0] = 1 Matched

Hide Details

Expecting sub string: [1] = 2 Matched

Hide Details

Expecting sub string: [2] = 3 Matched

Hide Details

Expecting sub string: [3] = 4 Matched Assertion failed: (tokenKind == tok::kw___bridge_retain), function ParseParenExpression, file /Users/buildslave/jenkins/workspace/lldb-cmake-sanitized/llvm-project/clang/lib/Parse/ParseExpr.cpp, line 2819.

Hide Details

--

Hide Details

******************** PASS: lldb-api :: lang/objc/foundation/TestObjCMethods2.py (1715 of 2030) PASS: lldb-unit :: Utility/./UtilityTests/ArgsTest.TestSingleArg (1716 of 2030) PASS: lldb-unit :: Utility/./UtilityTests/CompletionRequest.DuplicateFilteringWithComments (1717 of 2030) PASS: lldb-unit :: Utility/./UtilityTests/OptionsWithRawTest.TerminatedQuote (1718 of 2030) PASS: lldb-api :: functionalities/data-formatter/data-formatter-proper-plurals/TestFormattersOneIsSingular.py (1719 of 2030) PASS: lldb-api :: commands/disassemble/basic/TestDisassembleBreakpoint.py (1720 of 2030) PASS: lldb-api :: commands/watchpoints/watchpoint_commands/TestWatchpointCommands.py (1721 of 2030) PASS: lldb-api :: lang/cpp/auto/TestCPPAuto.py (1722 of 2030) PASS: lldb-api :: commands/watchpoints/watchpoint_set_command/TestWatchLocationWithWatchSet.py (1723 of 2030) PASS: lldb-unit :: Interpreter/./InterpreterTests/CompletionTest.DirCompletionAbsolute (1724 of 2030) PASS: lldb-unit :: Process/gdb-remote/./ProcessGdbRemoteTests/GDBRemoteCommunicationClientTest.GetQOffsets (1725 of 2030) PASS: lldb-shell :: SymbolFile/DWARF/debug_line-relative_path.s (1726 of 2030) PASS: lldb-unit :: Utility/./UtilityTests/RegularExpression.CopyAssignment (1727 of 2030) PASS: lldb-api :: functionalities/plugins/command_plugin/TestPluginCommands.py (1728 of 2030) PASS: lldb-unit :: Symbol/./SymbolTests/PostfixExpression.ToDWARF (1729 of 2030) PASS: lldb-unit :: Utility/./UtilityTests/FileSpecTest.IsRelative (1730 of 2030) PASS: lldb-shell :: SymbolFile/Breakpad/unwind-via-raSearch.test (1731 of 2030) PASS: lldb-shell :: ObjectFile/ELF/avr-basic-info.yaml (1732 of 2030) PASS: lldb-unit :: Utility/./UtilityTests/StringListTest.PopBack (1733 of 2030) PASS: lldb-api :: commands/settings/TestSettings.py (1734 of 2030) PASS: lldb-api :: lang/cpp/namespace_conflicts/TestNamespaceConflicts.py (1735 of 2030) PASS: lldb-api :: commands/expression/namespace_local_var_same_name_cpp_and_c/TestNamespaceLocalVarSameNameCppAndC.py (1736 of 2030) PASS: lldb-unit :: Utility/./UtilityTests/RangeTest.SetRangeBase (1737 of 2030) FAIL: lldb-api :: lang/objc/objc-struct-argument/TestObjCStructArgument.py (1738 of 2030) ******************** TEST 'lldb-api :: lang/objc/objc-struct-argument/TestObjCStructArgument.py' FAILED ******************** Script: -- /Users/buildslave/jenkins/workspace/lldb-cmake-sanitized/lldb-build/lldb-test-build.noindex/copied-system-python /Users/buildslave/jenkins/workspace/lldb-cmake-sanitized/llvm-project/lldb/test/API/dotest.py --arch x86_64 -s /Users/buildslave/jenkins/workspace/lldb-cmake-sanitized/lldb-build/lldb-test-traces -S nm -u CXXFLAGS -u CFLAGS --codesign-identity lldb_codesign --server /Users/buildslave/jenkins/workspace/lldb-cmake-sanitized/lldb-build/./bin/debugserver --arch x86_64 --build-dir /Users/buildslave/jenkins/workspace/lldb-cmake-sanitized/lldb-build/lldb-test-build.noindex -s=/Users/buildslave/jenkins/workspace/lldb-cmake-sanitized/test/logs -t --env TERM=vt100 --env LLVM_LIBS_DIR=/Users/buildslave/jenkins/workspace/lldb-cmake-sanitized/lldb-build/./lib --inferior-env ASAN_OPTIONS=detect_stack_use_after_return=1 --inferior-env DYLD_INSERT_LIBRARIES=/Users/buildslave/jenkins/workspace/lldb-cmake-sanitized/host-compiler/lib/clang/11.0.0/lib/darwin/libclang_rt.asan_osx_dynamic.dylib --build-dir /Users/buildslave/jenkins/workspace/lldb-cmake-sanitized/lldb-build/lldb-test-build.noindex --lldb-module-cache-dir /Users/buildslave/jenkins/workspace/lldb-cmake-sanitized/lldb-build/lldb-test-build.noindex/module-cache-lldb/lldb-api --clang-module-cache-dir /Users/buildslave/jenkins/workspace/lldb-cmake-sanitized/lldb-build/lldb-test-build.noindex/module-cache-clang/lldb-api --executable /Users/buildslave/jenkins/workspace/lldb-cmake-sanitized/lldb-build/./bin/lldb --compiler /Users/buildslave/jenkins/workspace/lldb-cmake-sanitized/lldb-build/./bin/clang --dsymutil /Users/buildslave/jenkins/workspace/lldb-cmake-sanitized/lldb-build/./bin/dsymutil --filecheck /Users/buildslave/jenkins/workspace/lldb-cmake-sanitized/lldb-build/./bin/FileCheck --lldb-libs-dir /Users/buildslave/jenkins/workspace/lldb-cmake-sanitized/lldb-build/./lib /Users/buildslave/jenkins/workspace/lldb-cmake-sanitized/llvm-project/lldb/test/API/lang/objc/objc-struct-argument -p TestObjCStructArgument.py -- Exit Code: -6

Hide Details

Command Output (stdout): -- lldb version 11.0.99 clang revision 82aac878beb48cd326b4684918b7ff2375fae439 llvm revision 82aac878beb48cd326b4684918b7ff2375fae439

Hide Details

-- Command Output (stderr): -- Assertion failed: (tokenKind == tok::kw___bridge_retain), function ParseParenExpression, file /Users/buildslave/jenkins/workspace/lldb-cmake-sanitized/llvm-project/clang/lib/Parse/ParseExpr.cpp, line 2819.

Hide Details

--

Hide Details

******************** UNSUPPORTED: lldb-shell :: Register/x86-64-zmm-write.test (1739 of 2030) PASS: lldb-api :: functionalities/breakpoint/breakpoint_hit_count/TestBreakpointHitCount.py (1740 of 2030) PASS: lldb-api :: functionalities/data-formatter/data-formatter-objc/TestDataFormatterObjCNSData.py (1741 of 2030) PASS: lldb-shell :: SymbolFile/NativePDB/ast-functions.cpp (1742 of 2030) PASS: lldb-unit :: Utility/./UtilityTests/AnsiTerminal.AtEnd (1743 of 2030) PASS: lldb-unit :: Utility/./UtilityTests/LogTest.Register (1744 of 2030) PASS: lldb-api :: tools/lldb-server/TestLldbGdbServer.py (1745 of 2030) PASS: lldb-unit :: Utility/./UtilityTests/TimeoutTest.Format (1746 of 2030) UNSUPPORTED: lldb-api :: functionalities/thread/thread_specific_break_plus_condition/TestThreadSpecificBpPlusCondition.py (1747 of 2030) PASS: lldb-unit :: ObjectFile/ELF/./ObjectFileELFTests/ObjectFileELFTest.GetSymtab_NoSymEntryPointArmAddressClass (1748 of 2030) PASS: lldb-shell :: Heap/heap-cstr.test (1749 of 2030) PASS: lldb-shell :: SymbolFile/NativePDB/globals-bss.cpp (1750 of 2030) PASS: lldb-api :: tools/lldb-server/register-reading/TestGdbRemoteGPacket.py (1751 of 2030) PASS: lldb-unit :: Utility/./UtilityTests/LogChannelEnabledTest.LogGetLogThread (1752 of 2030) PASS: lldb-shell :: ObjectFile/ELF/gnu-debuglink.yaml (1753 of 2030) PASS: lldb-api :: commands/frame/diagnose/dereference-this/TestDiagnoseDereferenceThis.py (1754 of 2030) PASS: lldb-unit :: Host/./HostTests/FileSystemTest.EmptyTest (1755 of 2030) PASS: lldb-unit :: Host/./HostTests/NativeProcessProtocolTest.SetBreakpointFailWrite (1756 of 2030) PASS: lldb-api :: lang/cpp/limit-debug-info/TestWithLimitDebugInfo.py (1757 of 2030) PASS: lldb-api :: lang/c/step-target/TestStepTarget.py (1758 of 2030) PASS: lldb-unit :: Utility/./UtilityTests/UriParserTest.Empty (1759 of 2030) UNSUPPORTED: lldb-api :: benchmarks/expression/TestExpressionCmd.py (1760 of 2030) PASS: lldb-unit :: Language/Highlighting/./HighlighterTests/HighlighterTest.ClangCursorPosAfterOtherToken (1761 of 2030) PASS: lldb-unit :: Utility/./UtilityTests/FileSpecTest.Match (1762 of 2030) PASS: lldb-api :: commands/expression/radar_9673664/TestExprHelpExamples.py (1763 of 2030) PASS: lldb-api :: functionalities/thread/concurrent_events/TestConcurrentTwoBreakpointThreads.py (1764 of 2030) PASS: lldb-shell :: SymbolFile/DWARF/debug-types-basic.test (1765 of 2030) PASS: lldb-shell :: SymbolFile/DWARF/module-ownership.mm (1766 of 2030) PASS: lldb-api :: commands/expression/calculator_mode/TestCalculatorMode.py (1767 of 2030) PASS: lldb-api :: commands/watchpoints/watchpoint_commands/command/TestWatchpointCommandPython.py (1768 of 2030) PASS: lldb-api :: commands/target/create-deps/TestTargetCreateDeps.py (1769 of 2030) PASS: lldb-unit :: Utility/./UtilityTests/ArchSpecTest.TestSetTriple (1770 of 2030) PASS: lldb-unit :: Utility/./UtilityTests/ProcessInstanceInfo.Dump (1771 of 2030) PASS: lldb-shell :: Driver/TestHelp.test (1772 of 2030) PASS: lldb-api :: python_api/get-value-32bit-int/TestGetValue32BitInt.py (1773 of 2030) PASS: lldb-api :: python_api/sbdata/TestSBData.py (1774 of 2030) PASS: lldb-api :: functionalities/thread/concurrent_events/TestConcurrentTwoBreakpointsOneSignal.py (1775 of 2030) PASS: lldb-unit :: DataFormatter/./LLDBFormatterTests/FormatManagerTests.CompatibleLangs (1776 of 2030) PASS: lldb-unit :: Expression/./ExpressionTests/DiagnosticManagerTest.GetStringMultipleDiags (1777 of 2030) PASS: lldb-unit :: UnwindAssembly/x86/./UnwindAssemblyx86Tests/Testx86AssemblyInspectionEngine.TestPopR12 (1778 of 2030) PASS: lldb-unit :: Utility/./UtilityTests/StreamTest.PutHex64ByteOrderLittle (1779 of 2030) PASS: lldb-unit :: Utility/./UtilityTests/StringListTest.Assignment (1780 of 2030) PASS: lldb-shell :: SymbolFile/DWARF/gnu-style-compression.cpp (1781 of 2030) PASS: lldb-unit :: Language/Highlighting/./HighlighterTests/HighlighterTest.ClangTrailingBackslashBeforeNewline (1782 of 2030) PASS: lldb-api :: functionalities/thread/concurrent_events/TestConcurrentNWatchNBreak.py (1783 of 2030) PASS: lldb-shell :: ObjectFile/ELF/section-permissions.yaml (1784 of 2030) PASS: lldb-api :: macosx/function-starts/TestFunctionStarts.py (1785 of 2030) PASS: lldb-unit :: SymbolFile/NativePDB/./SymbolFileNativePDBTests/PDBFPOProgramToDWARFExpressionTests.InvalidOpBinary (1786 of 2030) PASS: lldb-api :: functionalities/breakpoint/objc/TestObjCBreakpoints.py (1787 of 2030) PASS: lldb-unit :: Symbol/./SymbolTests/LineEntryTest.GetSameLineContiguousAddressRangeNestedInline (1788 of 2030) PASS: lldb-unit :: Interpreter/./InterpreterTests/OptionArgParserTest.toBoolean (1789 of 2030) PASS: lldb-api :: functionalities/breakpoint/breakpoint_command/TestRegexpBreakCommand.py (1790 of 2030) PASS: lldb-api :: functionalities/data-formatter/ptr_ref_typedef/TestPtrRef2Typedef.py (1791 of 2030) PASS: lldb-api :: lang/cpp/constructors/TestCppConstructors.py (1792 of 2030) PASS: lldb-api :: commands/log/basic/TestLogging.py (1793 of 2030) PASS: lldb-api :: python_api/watchpoint/condition/TestWatchpointConditionAPI.py (1794 of 2030) PASS: lldb-unit :: Utility/./UtilityTests/StringListTest.ShiftStdString (1795 of 2030) PASS: lldb-api :: functionalities/thread/num_threads/TestNumThreads.py (1796 of 2030) PASS: lldb-unit :: ScriptInterpreter/Python/./ScriptInterpreterPythonTests/PythonDataObjectsTest.TestPythonDictionaryValueEquality (1797 of 2030) XFAIL: lldb-shell :: SymbolFile/DWARF/find-type-in-function.cpp (1798 of 2030) PASS: lldb-unit :: Utility/./UtilityTests/RegularExpression.Invalid (1799 of 2030) PASS: lldb-unit :: Expression/./ExpressionTests/CppModuleConfigurationTest.Xcode (1800 of 2030) PASS: lldb-unit :: Expression/./ExpressionTests/DWARFExpression.DW_OP_convert (1801 of 2030) PASS: lldb-api :: commands/expression/import-std-module/vector-of-vectors/TestVectorOfVectorsFromStdModule.py (1802 of 2030) PASS: lldb-api :: lang/cpp/symbols/TestSymbols.py (1803 of 2030) PASS: lldb-unit :: Symbol/./SymbolTests/TestTypeSystemClang.TestDeletingImplicitCopyCstrDueToMoveCStr (1804 of 2030) PASS: lldb-shell :: SymbolFile/NativePDB/break-by-function.cpp (1805 of 2030) UNSUPPORTED: lldb-api :: benchmarks/libcxxmap/TestBenchmarkLibcxxMap.py (1806 of 2030) PASS: lldb-api :: commands/expression/deleting-implicit-copy-constructor/TestDeletingImplicitCopyConstructor.py (1807 of 2030) PASS: lldb-unit :: Utility/./UtilityTests/StringListTest.CopyListSingle (1808 of 2030) PASS: lldb-api :: macosx/profile_vrs_detach/TestDetachVrsProfile.py (1809 of 2030) PASS: lldb-unit :: Expression/./ExpressionTests/DiagnosticManagerTest.PutStringSeverities (1810 of 2030) PASS: lldb-shell :: Minidump/disassemble-no-module.yaml (1811 of 2030) PASS: lldb-shell :: SymbolFile/Breakpad/stack-cfi-parsing.test (1812 of 2030) PASS: lldb-api :: commands/expression/static-initializers/TestStaticInitializers.py (1813 of 2030) PASS: lldb-unit :: Host/./HostTests/FileSystemTest.MakeAbsolute (1814 of 2030) PASS: lldb-unit :: Utility/./UtilityTests/ArchSpecTest.TestParseMachCPUDashSubtypeTripleSimple (1815 of 2030) UNSUPPORTED: lldb-shell :: SymbolFile/target-symbols-add-unwind.test (1816 of 2030) UNSUPPORTED: lldb-shell :: SymbolFile/PDB/class-layout.test (1817 of 2030) PASS: lldb-unit :: Utility/./UtilityTests/StreamTest.PutHex32ByteOrderBig (1818 of 2030) PASS: lldb-api :: functionalities/tail_call_frames/thread_step_out_message/TestArtificialFrameStepOutMessage.py (1819 of 2030) PASS: lldb-unit :: Expression/./ExpressionTests/CppModuleConfigurationTest.IgnoreLibStdCpp (1820 of 2030) PASS: lldb-shell :: Breakpoint/dummy-target.test (1821 of 2030) PASS: lldb-api :: types/TestLongTypes.py (1822 of 2030) PASS: lldb-unit :: Utility/./UtilityTests/StreamTest.ShiftOperatorStrings (1823 of 2030) PASS: lldb-shell :: SymbolFile/DWARF/find-qualified-variable.cpp (1824 of 2030) UNSUPPORTED: lldb-api :: functionalities/darwin_log/filter/exact_match/activity-chain/TestDarwinLogFilterMatchActivityChain.py (1825 of 2030) PASS: lldb-unit :: UnwindAssembly/x86/./UnwindAssemblyx86Tests/Testx86AssemblyInspectionEngine.TestPushEDX (1826 of 2030) FAIL: lldb-api :: lang/objc/unicode-string/TestUnicodeString.py (1827 of 2030) ******************** TEST 'lldb-api :: lang/objc/unicode-string/TestUnicodeString.py' FAILED ******************** Script: -- /Users/buildslave/jenkins/workspace/lldb-cmake-sanitized/lldb-build/lldb-test-build.noindex/copied-system-python /Users/buildslave/jenkins/workspace/lldb-cmake-sanitized/llvm-project/lldb/test/API/dotest.py --arch x86_64 -s /Users/buildslave/jenkins/workspace/lldb-cmake-sanitized/lldb-build/lldb-test-traces -S nm -u CXXFLAGS -u CFLAGS --codesign-identity lldb_codesign --server /Users/buildslave/jenkins/workspace/lldb-cmake-sanitized/lldb-build/./bin/debugserver --arch x86_64 --build-dir /Users/buildslave/jenkins/workspace/lldb-cmake-sanitized/lldb-build/lldb-test-build.noindex -s=/Users/buildslave/jenkins/workspace/lldb-cmake-sanitized/test/logs -t --env TERM=vt100 --env LLVM_LIBS_DIR=/Users/buildslave/jenkins/workspace/lldb-cmake-sanitized/lldb-build/./lib --inferior-env ASAN_OPTIONS=detect_stack_use_after_return=1 --inferior-env DYLD_INSERT_LIBRARIES=/Users/buildslave/jenkins/workspace/lldb-cmake-sanitized/host-compiler/lib/clang/11.0.0/lib/darwin/libclang_rt.asan_osx_dynamic.dylib --build-dir /Users/buildslave/jenkins/workspace/lldb-cmake-sanitized/lldb-build/lldb-test-build.noindex --lldb-module-cache-dir /Users/buildslave/jenkins/workspace/lldb-cmake-sanitized/lldb-build/lldb-test-build.noindex/module-cache-lldb/lldb-api --clang-module-cache-dir /Users/buildslave/jenkins/workspace/lldb-cmake-sanitized/lldb-build/lldb-test-build.noindex/module-cache-clang/lldb-api --executable /Users/buildslave/jenkins/workspace/lldb-cmake-sanitized/lldb-build/./bin/lldb --compiler /Users/buildslave/jenkins/workspace/lldb-cmake-sanitized/lldb-build/./bin/clang --dsymutil /Users/buildslave/jenkins/workspace/lldb-cmake-sanitized/lldb-build/./bin/dsymutil --filecheck /Users/buildslave/jenkins/workspace/lldb-cmake-sanitized/lldb-build/./bin/FileCheck --lldb-libs-dir /Users/buildslave/jenkins/workspace/lldb-cmake-sanitized/lldb-build/./lib /Users/buildslave/jenkins/workspace/lldb-cmake-sanitized/llvm-project/lldb/test/API/lang/objc/unicode-string -p TestUnicodeString.py -- Exit Code: -6

Hide Details

Command Output (stdout): -- lldb version 11.0.99 clang revision 82aac878beb48cd326b4684918b7ff2375fae439 llvm revision 82aac878beb48cd326b4684918b7ff2375fae439

Hide Details

-- Command Output (stderr): -- Assertion failed: (tokenKind == tok::kw___bridge_retain), function ParseParenExpression, file /Users/buildslave/jenkins/workspace/lldb-cmake-sanitized/llvm-project/clang/lib/Parse/ParseExpr.cpp, line 2819.

Hide Details

--

Hide Details

******************** PASS: lldb-api :: lang/cpp/rvalue-references/TestRvalueReferences.py (1828 of 2030) PASS: lldb-api :: lang/objc/objc-ivar-stripped/TestObjCIvarStripped.py (1829 of 2030) PASS: lldb-unit :: UnwindAssembly/x86/./UnwindAssemblyx86Tests/Testx86AssemblyInspectionEngine.TestSimple64bitFrameFunction (1830 of 2030) PASS: lldb-unit :: Utility/./UtilityTests/StringListTest.GetMaxStringLengthMixed (1831 of 2030) PASS: lldb-api :: functionalities/data-formatter/type_summary_list_arg/TestTypeSummaryListArg.py (1832 of 2030) UNSUPPORTED: lldb-api :: lang/cpp/function-template-parameter-pack/TestFunctionTemplateParameterPack.py (1833 of 2030) PASS: lldb-shell :: ObjectFile/ELF/section-types.yaml (1834 of 2030) PASS: lldb-api :: lang/cpp/llvm-style/TestLLVMStyle.py (1835 of 2030) PASS: lldb-api :: lang/c/bitfields/TestBitfields.py (1836 of 2030) PASS: lldb-shell :: ObjectFile/PECOFF/section-types.yaml (1837 of 2030) PASS: lldb-unit :: SymbolFile/NativePDB/./SymbolFileNativePDBTests/PDBFPOProgramToDWARFExpressionTests.DependencyChain (1838 of 2030) PASS: lldb-shell :: SymbolFile/Breakpad/symtab-macho.test (1839 of 2030) PASS: lldb-unit :: Utility/./UtilityTests/UriParserTest.TypicalPortPathIPv4 (1840 of 2030) PASS: lldb-unit :: Expression/./ExpressionTests/CppModuleConfigurationTest.Linux (1841 of 2030) PASS: lldb-unit :: Utility/./UtilityTests/PassiveReplayTest.InstrumentedBarPtr (1842 of 2030) PASS: lldb-unit :: Utility/./UtilityTests/StringExtractorTest.GetU64LittleEndian (1843 of 2030) UNSUPPORTED: lldb-shell :: ScriptInterpreter/Lua/convenience_variables.test (1844 of 2030) PASS: lldb-unit :: Host/./HostTests/SocketTest.TCPGetAddress (1845 of 2030) PASS: lldb-unit :: Utility/./UtilityTests/StreamTeeTest.Flush (1846 of 2030) PASS: lldb-shell :: Reproducer/TestDSYM.test (1847 of 2030) PASS: lldb-unit :: tools/lldb-server/tests/./LLDBServerTests/TestBase.DebugserverEnv (1848 of 2030) UNSUPPORTED: lldb-shell :: ScriptInterpreter/Lua/persistent_state.test (1849 of 2030) PASS: lldb-unit :: Utility/./UtilityTests/StatusTest.ErrorConstructor (1850 of 2030) PASS: lldb-unit :: Utility/./UtilityTests/BinaryStreamTest.PutULEB128One (1851 of 2030) PASS: lldb-api :: functionalities/thread/concurrent_events/TestConcurrentWatchBreakDelay.py (1852 of 2030) PASS: lldb-unit :: Utility/./UtilityTests/ArgsTest.BareSingleQuote (1853 of 2030) PASS: lldb-api :: functionalities/tail_call_frames/disambiguate_paths_to_common_sink/TestDisambiguatePathsToCommonSink.py (1854 of 2030) PASS: lldb-unit :: Host/./HostTests/FileSystemTest.OpenErrno (1855 of 2030) PASS: lldb-shell :: Quit/TestQuitExitCodeNonInt.test (1856 of 2030) PASS: lldb-shell :: Reproducer/TestRelativePath.test (1857 of 2030) PASS: lldb-api :: lang/cpp/gmodules/TestWithModuleDebugging.py (1858 of 2030) PASS: lldb-api :: lang/c/step_over_no_deadlock/TestStepOverDoesntBlock.py (1859 of 2030) PASS: lldb-api :: lang/c/modules/TestCModules.py (1860 of 2030) PASS: lldb-unit :: Utility/./UtilityTests/ConstStringTest.UpdateMangledCounterpart (1861 of 2030) PASS: lldb-api :: functionalities/data-formatter/data-formatter-disabling/TestDataFormatterDisabling.py (1862 of 2030) PASS: lldb-unit :: Process/minidump/./LLDBMinidumpTests/MinidumpParserTest.GetMiscInfo_no_stream (1863 of 2030) PASS: lldb-api :: functionalities/param_entry_vals/basic_entry_values/TestBasicEntryValues.py (1864 of 2030) PASS: lldb-unit :: SymbolFile/NativePDB/./SymbolFileNativePDBTests/PDBFPOProgramToDWARFExpressionTests.MultipleIndependentAssignments (1865 of 2030) PASS: lldb-shell :: SymbolFile/DWARF/debug_ranges_and_rnglists.test (1866 of 2030) PASS: lldb-unit :: Utility/./UtilityTests/NameMatchesTest.EndsWith (1867 of 2030) PASS: lldb-unit :: Utility/./UtilityTests/LogChannelEnabledTest.LogVerboseThread (1868 of 2030) PASS: lldb-unit :: Host/./HostTests/NativeProcessProtocolTest.ReadCStringFromMemory_MaxSize (1869 of 2030) UNSUPPORTED: lldb-api :: functionalities/thread/state/TestThreadStates.py (1870 of 2030) PASS: lldb-unit :: Utility/./UtilityTests/StringExtractorTest.GetHexBytesAvail_Underflow (1871 of 2030) PASS: lldb-shell :: SymbolFile/Breakpad/line-table-edgecases.test (1872 of 2030) PASS: lldb-api :: functionalities/thread/backtrace_limit/TestBacktraceLimit.py (1873 of 2030) PASS: lldb-api :: commands/process/launch-with-shellexpand/TestLaunchWithShellExpand.py (1874 of 2030) PASS: lldb-shell :: Breakpoint/debug_rnglist_offset_pair.test (1875 of 2030) PASS: lldb-api :: python_api/interpreter/TestCommandInterpreterAPI.py (1876 of 2030) PASS: lldb-api :: functionalities/gdb_remote_client/TestNestedRegDefinitions.py (1877 of 2030) PASS: lldb-unit :: Utility/./UtilityTests/GeneratorTest.Create (1878 of 2030) PASS: lldb-unit :: Utility/./UtilityTests/UriParserTest.BracketedHostname (1879 of 2030) PASS: lldb-api :: functionalities/target-new-solib-notifications/TestModuleLoadedNotifys.py (1880 of 2030) UNSUPPORTED: lldb-api :: functionalities/tsan/cpp_global_location/TestTsanCPPGlobalLocation.py (1881 of 2030) PASS: lldb-unit :: Utility/./UtilityTests/OptionsWithRawTest.EmptySuffix (1882 of 2030) PASS: lldb-unit :: Utility/./UtilityTests/ListenerTest.GetEventImmediate (1883 of 2030) PASS: lldb-api :: commands/expression/import-std-module/list-dbg-info-content/TestDbgInfoContentListFromStdModule.py (1884 of 2030) PASS: lldb-api :: lang/cpp/unsigned_types/TestUnsignedTypes.py (1885 of 2030) PASS: lldb-shell :: SymbolFile/DWARF/parallel-indexing-stress.s (1886 of 2030) PASS: lldb-api :: functionalities/postmortem/wow64_minidump/TestWow64MiniDump.py (1887 of 2030) PASS: lldb-unit :: Expression/./ExpressionTests/CppModuleConfigurationTest.LibCppV2 (1888 of 2030) PASS: lldb-unit :: Language/Highlighting/./HighlighterTests/HighlighterTest.ClangCursorPos (1889 of 2030) PASS: lldb-unit :: UnwindAssembly/x86/./UnwindAssemblyx86Tests/Testx86AssemblyInspectionEngine.Test32BitOnlyInstruction (1890 of 2030) PASS: lldb-api :: python_api/value/empty_class/TestValueAPIEmptyClass.py (1891 of 2030) FAIL: lldb-api :: lang/objc/objc-new-syntax/TestObjCNewSyntaxLiteral.py (1892 of 2030) ******************** TEST 'lldb-api :: lang/objc/objc-new-syntax/TestObjCNewSyntaxLiteral.py' FAILED ******************** Script: -- /Users/buildslave/jenkins/workspace/lldb-cmake-sanitized/lldb-build/lldb-test-build.noindex/copied-system-python /Users/buildslave/jenkins/workspace/lldb-cmake-sanitized/llvm-project/lldb/test/API/dotest.py --arch x86_64 -s /Users/buildslave/jenkins/workspace/lldb-cmake-sanitized/lldb-build/lldb-test-traces -S nm -u CXXFLAGS -u CFLAGS --codesign-identity lldb_codesign --server /Users/buildslave/jenkins/workspace/lldb-cmake-sanitized/lldb-build/./bin/debugserver --arch x86_64 --build-dir /Users/buildslave/jenkins/workspace/lldb-cmake-sanitized/lldb-build/lldb-test-build.noindex -s=/Users/buildslave/jenkins/workspace/lldb-cmake-sanitized/test/logs -t --env TERM=vt100 --env LLVM_LIBS_DIR=/Users/buildslave/jenkins/workspace/lldb-cmake-sanitized/lldb-build/./lib --inferior-env ASAN_OPTIONS=detect_stack_use_after_return=1 --inferior-env DYLD_INSERT_LIBRARIES=/Users/buildslave/jenkins/workspace/lldb-cmake-sanitized/host-compiler/lib/clang/11.0.0/lib/darwin/libclang_rt.asan_osx_dynamic.dylib --build-dir /Users/buildslave/jenkins/workspace/lldb-cmake-sanitized/lldb-build/lldb-test-build.noindex --lldb-module-cache-dir /Users/buildslave/jenkins/workspace/lldb-cmake-sanitized/lldb-build/lldb-test-build.noindex/module-cache-lldb/lldb-api --clang-module-cache-dir /Users/buildslave/jenkins/workspace/lldb-cmake-sanitized/lldb-build/lldb-test-build.noindex/module-cache-clang/lldb-api --executable /Users/buildslave/jenkins/workspace/lldb-cmake-sanitized/lldb-build/./bin/lldb --compiler /Users/buildslave/jenkins/workspace/lldb-cmake-sanitized/lldb-build/./bin/clang --dsymutil /Users/buildslave/jenkins/workspace/lldb-cmake-sanitized/lldb-build/./bin/dsymutil --filecheck /Users/buildslave/jenkins/workspace/lldb-cmake-sanitized/lldb-build/./bin/FileCheck --lldb-libs-dir /Users/buildslave/jenkins/workspace/lldb-cmake-sanitized/lldb-build/./lib /Users/buildslave/jenkins/workspace/lldb-cmake-sanitized/llvm-project/lldb/test/API/lang/objc/objc-new-syntax -p TestObjCNewSyntaxLiteral.py -- Exit Code: -6

Hide Details

Command Output (stdout): -- lldb version 11.0.99 clang revision 82aac878beb48cd326b4684918b7ff2375fae439 llvm revision 82aac878beb48cd326b4684918b7ff2375fae439

Hide Details

-- Command Output (stderr): -- Assertion failed: (tokenKind == tok::kw___bridge_retain), function ParseParenExpression, file /Users/buildslave/jenkins/workspace/lldb-cmake-sanitized/llvm-project/clang/lib/Parse/ParseExpr.cpp, line 2819.

Hide Details

--

Hide Details

******************** PASS: lldb-api :: macosx/find-dsym/bundle-with-dot-in-filename/TestBundleWithDotInFilename.py (1893 of 2030) PASS: lldb-api :: functionalities/mtc/simple/TestMTCSimple.py (1894 of 2030) PASS: lldb-api :: functionalities/breakpoint/address_breakpoints/TestAddressBreakpoints.py (1895 of 2030) PASS: lldb-api :: functionalities/thread/concurrent_events/TestConcurrentTwoWatchpointsOneSignal.py (1896 of 2030) PASS: lldb-api :: functionalities/data-formatter/data-formatter-stl/libcxx/bitset/TestDataFormatterLibcxxBitset.py (1897 of 2030) PASS: lldb-unit :: Utility/./UtilityTests/Flags.AllSet (1898 of 2030) PASS: lldb-api :: lang/cpp/frame-var-anon-unions/TestFrameVariableAnonymousUnions.py (1899 of 2030) PASS: lldb-api :: functionalities/thread/concurrent_events/TestConcurrentDelaySignalWatch.py (1900 of 2030) PASS: lldb-api :: functionalities/breakpoint/breakpoint_set_restart/TestBreakpointSetRestart.py (1901 of 2030) PASS: lldb-unit :: ScriptInterpreter/Python/./ScriptInterpreterPythonTests/PythonDataObjectsTest.TestPythonIntegerToStr (1902 of 2030) PASS: lldb-api :: types/TestLongTypesExpr.py (1903 of 2030) PASS: lldb-unit :: ScriptInterpreter/Python/./ScriptInterpreterPythonTests/PythonDataObjectsTest.TestObjectAttributes (1904 of 2030) PASS: lldb-unit :: Utility/./UtilityTests/StringLexerTest.PutBack (1905 of 2030) UNSUPPORTED: lldb-api :: functionalities/ptr_refs/TestPtrRefs.py (1906 of 2030) PASS: lldb-api :: lang/objcxx/hide-runtime-values/TestObjCXXHideRuntimeValues.py (1907 of 2030) PASS: lldb-unit :: Utility/./UtilityTests/FileSpecTest.Yaml (1908 of 2030) PASS: lldb-api :: macosx/indirect_symbol/TestIndirectSymbols.py (1909 of 2030) PASS: lldb-api :: functionalities/data-formatter/dump_dynamic/TestDumpDynamic.py (1910 of 2030) PASS: lldb-api :: api/listeners/TestListener.py (1911 of 2030) PASS: lldb-unit :: UnwindAssembly/x86/./UnwindAssemblyx86Tests/Testx86AssemblyInspectionEngine.TestPushECX (1912 of 2030) UNSUPPORTED: lldb-api :: linux/add-symbols/TestTargetSymbolsAddCommand.py (1913 of 2030) PASS: lldb-unit :: Utility/./UtilityTests/Predicate.WaitForValueNotEqualTo (1914 of 2030) PASS: lldb-api :: python_api/interpreter/TestRunCommandInterpreterAPI.py (1915 of 2030) PASS: lldb-unit :: Utility/./UtilityTests/Flags.IsClear (1916 of 2030) PASS: lldb-shell :: Expr/TestMultilineExpr.test (1917 of 2030) FAIL: lldb-api :: lang/objc/radar-9691614/TestObjCMethodReturningBOOL.py (1918 of 2030) ******************** TEST 'lldb-api :: lang/objc/radar-9691614/TestObjCMethodReturningBOOL.py' FAILED ******************** Script: -- /Users/buildslave/jenkins/workspace/lldb-cmake-sanitized/lldb-build/lldb-test-build.noindex/copied-system-python /Users/buildslave/jenkins/workspace/lldb-cmake-sanitized/llvm-project/lldb/test/API/dotest.py --arch x86_64 -s /Users/buildslave/jenkins/workspace/lldb-cmake-sanitized/lldb-build/lldb-test-traces -S nm -u CXXFLAGS -u CFLAGS --codesign-identity lldb_codesign --server /Users/buildslave/jenkins/workspace/lldb-cmake-sanitized/lldb-build/./bin/debugserver --arch x86_64 --build-dir /Users/buildslave/jenkins/workspace/lldb-cmake-sanitized/lldb-build/lldb-test-build.noindex -s=/Users/buildslave/jenkins/workspace/lldb-cmake-sanitized/test/logs -t --env TERM=vt100 --env LLVM_LIBS_DIR=/Users/buildslave/jenkins/workspace/lldb-cmake-sanitized/lldb-build/./lib --inferior-env ASAN_OPTIONS=detect_stack_use_after_return=1 --inferior-env DYLD_INSERT_LIBRARIES=/Users/buildslave/jenkins/workspace/lldb-cmake-sanitized/host-compiler/lib/clang/11.0.0/lib/darwin/libclang_rt.asan_osx_dynamic.dylib --build-dir /Users/buildslave/jenkins/workspace/lldb-cmake-sanitized/lldb-build/lldb-test-build.noindex --lldb-module-cache-dir /Users/buildslave/jenkins/workspace/lldb-cmake-sanitized/lldb-build/lldb-test-build.noindex/module-cache-lldb/lldb-api --clang-module-cache-dir /Users/buildslave/jenkins/workspace/lldb-cmake-sanitized/lldb-build/lldb-test-build.noindex/module-cache-clang/lldb-api --executable /Users/buildslave/jenkins/workspace/lldb-cmake-sanitized/lldb-build/./bin/lldb --compiler /Users/buildslave/jenkins/workspace/lldb-cmake-sanitized/lldb-build/./bin/clang --dsymutil /Users/buildslave/jenkins/workspace/lldb-cmake-sanitized/lldb-build/./bin/dsymutil --filecheck /Users/buildslave/jenkins/workspace/lldb-cmake-sanitized/lldb-build/./bin/FileCheck --lldb-libs-dir /Users/buildslave/jenkins/workspace/lldb-cmake-sanitized/lldb-build/./lib /Users/buildslave/jenkins/workspace/lldb-cmake-sanitized/llvm-project/lldb/test/API/lang/objc/radar-9691614 -p TestObjCMethodReturningBOOL.py -- Exit Code: -6

Hide Details

Command Output (stdout): -- lldb version 11.0.99 clang revision 82aac878beb48cd326b4684918b7ff2375fae439 llvm revision 82aac878beb48cd326b4684918b7ff2375fae439

Hide Details

-- Command Output (stderr): -- Assertion failed: (tokenKind == tok::kw___bridge_retain), function ParseParenExpression, file /Users/buildslave/jenkins/workspace/lldb-cmake-sanitized/llvm-project/clang/lib/Parse/ParseExpr.cpp, line 2819.

Hide Details

--

Hide Details

******************** PASS: lldb-unit :: Utility/./UtilityTests/XcodeSDKTest.SDKSupportsModules (1919 of 2030) PASS: lldb-api :: python_api/name_lookup/TestNameLookup.py (1920 of 2030) PASS: lldb-api :: driver/batch_mode/TestBatchMode.py (1921 of 2030) PASS: lldb-unit :: Symbol/./SymbolTests/TestClangASTImporter.MetadataPropagation (1922 of 2030) PASS: lldb-unit :: Utility/./UtilityTests/UUIDTest.Validity (1923 of 2030) PASS: lldb-shell :: ObjectFile/ELF/PT_LOAD-overlap-section.yaml (1924 of 2030) PASS: lldb-api :: functionalities/data-formatter/refpointer-recursion/TestDataFormatterRefPtrRecursion.py (1925 of 2030) PASS: lldb-shell :: Quit/TestQuitExitCode0.test (1926 of 2030) PASS: lldb-unit :: Utility/./UtilityTests/UriParserTest.BadPort2 (1927 of 2030) PASS: lldb-api :: commands/expression/import-std-module/conflicts/TestStdModuleWithConflicts.py (1928 of 2030) PASS: lldb-unit :: Language/Highlighting/./HighlighterTests/HighlighterTest.ClangOperators (1929 of 2030) PASS: lldb-shell :: ObjectFile/Breakpad/discontiguous-sections.test (1930 of 2030) PASS: lldb-api :: terminal/TestSTTYBeforeAndAfter.py (1931 of 2030) PASS: lldb-api :: python_api/module_section/TestModuleAndSection.py (1932 of 2030) UNSUPPORTED: lldb-api :: tools/intel-features/intel-pt/test/TestIntelPTSimpleBinary.py (1933 of 2030) PASS: lldb-unit :: Process/gdb-remote/./ProcessGdbRemoteTests/GDBRemoteCommunicationServerTest.SendErrorResponse_ErrorList (1934 of 2030) UNSUPPORTED: lldb-shell :: Register/aarch64-fp-read.test (1935 of 2030) UNSUPPORTED: lldb-shell :: ObjectFile/ELF/minidebuginfo-no-lzma.yaml (1936 of 2030) PASS: lldb-shell :: Host/TestCustomShell.test (1937 of 2030) PASS: lldb-unit :: Utility/./UtilityTests/RangeTest.ContainsEndInclusive (1938 of 2030) PASS: lldb-unit :: debugserver/./debugserverTests/RNBSocket.LoopBackListenIPv6 (1939 of 2030) PASS: lldb-shell :: SymbolFile/DWARF/dwarf5-atomic.s (1940 of 2030) PASS: lldb-api :: python_api/section/TestSectionAPI.py (1941 of 2030) PASS: lldb-unit :: Symbol/./SymbolTests/Type.GetTypeScopeAndBasename (1942 of 2030) PASS: lldb-shell :: Quit/TestQuitExitCodeHexA.test (1943 of 2030) PASS: lldb-shell :: Commands/command-thread-select.test (1944 of 2030) PASS: lldb-shell :: SymbolFile/DWARF/dir-separator-no-comp-dir-relative-name.s (1945 of 2030) PASS: lldb-api :: functionalities/postmortem/elf-core/thread_crash/TestLinuxCoreThreads.py (1946 of 2030) PASS: lldb-api :: functionalities/thread/thread_specific_break/TestThreadSpecificBreakpoint.py (1947 of 2030) PASS: lldb-shell :: SymbolFile/DWARF/find-variable-file.cpp (1948 of 2030) PASS: lldb-api :: lang/cpp/class-template-parameter-pack/TestClassTemplateParameterPack.py (1949 of 2030) PASS: lldb-api :: functionalities/thread/concurrent_events/TestConcurrentSignalBreak.py (1950 of 2030) PASS: lldb-api :: commands/process/launch/TestProcessLaunch.py (1951 of 2030) PASS: lldb-unit :: Utility/./UtilityTests/StringExtractorTest.GetHexU8_InvalidHex (1952 of 2030) PASS: lldb-unit :: Utility/./UtilityTests/FileSpecTest.EqualDotsPosix (1953 of 2030) PASS: lldb-unit :: ScriptInterpreter/Python/./ScriptInterpreterPythonTests/PythonDataObjectsTest.TestPythonStringToStr (1954 of 2030) FAIL: lldb-api :: lang/objc/foundation/TestConstStrings.py (1955 of 2030) ******************** TEST 'lldb-api :: lang/objc/foundation/TestConstStrings.py' FAILED ******************** Script: -- /Users/buildslave/jenkins/workspace/lldb-cmake-sanitized/lldb-build/lldb-test-build.noindex/copied-system-python /Users/buildslave/jenkins/workspace/lldb-cmake-sanitized/llvm-project/lldb/test/API/dotest.py --arch x86_64 -s /Users/buildslave/jenkins/workspace/lldb-cmake-sanitized/lldb-build/lldb-test-traces -S nm -u CXXFLAGS -u CFLAGS --codesign-identity lldb_codesign --server /Users/buildslave/jenkins/workspace/lldb-cmake-sanitized/lldb-build/./bin/debugserver --arch x86_64 --build-dir /Users/buildslave/jenkins/workspace/lldb-cmake-sanitized/lldb-build/lldb-test-build.noindex -s=/Users/buildslave/jenkins/workspace/lldb-cmake-sanitized/test/logs -t --env TERM=vt100 --env LLVM_LIBS_DIR=/Users/buildslave/jenkins/workspace/lldb-cmake-sanitized/lldb-build/./lib --inferior-env ASAN_OPTIONS=detect_stack_use_after_return=1 --inferior-env DYLD_INSERT_LIBRARIES=/Users/buildslave/jenkins/workspace/lldb-cmake-sanitized/host-compiler/lib/clang/11.0.0/lib/darwin/libclang_rt.asan_osx_dynamic.dylib --build-dir /Users/buildslave/jenkins/workspace/lldb-cmake-sanitized/lldb-build/lldb-test-build.noindex --lldb-module-cache-dir /Users/buildslave/jenkins/workspace/lldb-cmake-sanitized/lldb-build/lldb-test-build.noindex/module-cache-lldb/lldb-api --clang-module-cache-dir /Users/buildslave/jenkins/workspace/lldb-cmake-sanitized/lldb-build/lldb-test-build.noindex/module-cache-clang/lldb-api --executable /Users/buildslave/jenkins/workspace/lldb-cmake-sanitized/lldb-build/./bin/lldb --compiler /Users/buildslave/jenkins/workspace/lldb-cmake-sanitized/lldb-build/./bin/clang --dsymutil /Users/buildslave/jenkins/workspace/lldb-cmake-sanitized/lldb-build/./bin/dsymutil --filecheck /Users/buildslave/jenkins/workspace/lldb-cmake-sanitized/lldb-build/./bin/FileCheck --lldb-libs-dir /Users/buildslave/jenkins/workspace/lldb-cmake-sanitized/lldb-build/./lib /Users/buildslave/jenkins/workspace/lldb-cmake-sanitized/llvm-project/lldb/test/API/lang/objc/foundation -p TestConstStrings.py -- Exit Code: -6

Hide Details

Command Output (stdout): -- lldb version 11.0.99 clang revision 82aac878beb48cd326b4684918b7ff2375fae439 llvm revision 82aac878beb48cd326b4684918b7ff2375fae439

Hide Details

-- Command Output (stderr): -- Assertion failed: (tokenKind == tok::kw___bridge_retain), function ParseParenExpression, file /Users/buildslave/jenkins/workspace/lldb-cmake-sanitized/llvm-project/clang/lib/Parse/ParseExpr.cpp, line 2819.

Hide Details

--

Hide Details

******************** PASS: lldb-unit :: UnwindAssembly/x86/./UnwindAssemblyx86Tests/Testx86AssemblyInspectionEngine.TestStackRealignMSVC_i386 (1956 of 2030) PASS: lldb-unit :: ScriptInterpreter/Python/./ScriptInterpreterPythonTests/PythonDataObjectsTest.TestExceptions (1957 of 2030) PASS: lldb-unit :: Utility/./UtilityTests/StreamTest.AddressRange (1958 of 2030) PASS: lldb-unit :: Utility/./UtilityTests/StreamTest.PutULEB128 (1959 of 2030) PASS: lldb-unit :: Utility/./UtilityTests/BinaryStreamTest.PutULEB128OneByte (1960 of 2030) PASS: lldb-api :: api/multiple-targets/TestMultipleTargets.py (1961 of 2030) PASS: lldb-api :: commands/expression/import-std-module/unique_ptr/TestUniquePtrFromStdModule.py (1962 of 2030) PASS: lldb-api :: tools/lldb-server/TestGdbRemoteKill.py (1963 of 2030) PASS: lldb-api :: lang/cpp/global_operators/TestCppGlobalOperators.py (1964 of 2030) PASS: lldb-unit :: Utility/./UtilityTests/ScalarTest.ComparisonFloat (1965 of 2030) PASS: lldb-unit :: Target/./TargetTests/ModuleCacheTest.GetAndPutUuidExists (1966 of 2030) PASS: lldb-shell :: SymbolFile/DWARF/dir-separator-no-comp-dir.s (1967 of 2030) PASS: lldb-unit :: Utility/./UtilityTests/NameMatchesTest.Equals (1968 of 2030) PASS: lldb-unit :: Utility/./UtilityTests/StreamTest.PutCharNull (1969 of 2030) PASS: lldb-shell :: SymbolFile/DWARF/find-basic-namespace.cpp (1970 of 2030) PASS: lldb-api :: lang/cpp/virtual-functions/TestCppVirtualFunctions.py (1971 of 2030) PASS: lldb-api :: functionalities/breakpoint/cpp_exception/TestCPPExceptionBreakpoint.py (1972 of 2030) PASS: lldb-unit :: Utility/./UtilityTests/StringExtractorTest.GetHexBytesAvail_OddPair (1973 of 2030) PASS: lldb-shell :: SymbolFile/Breakpad/line-table.test (1974 of 2030) PASS: lldb-shell :: SymbolFile/DWARF/debug_loc-aslr.s (1975 of 2030) FAIL: lldb-api :: functionalities/data-formatter/data-formatter-objc/TestDataFormatterObjCCF.py (1976 of 2030) ******************** TEST 'lldb-api :: functionalities/data-formatter/data-formatter-objc/TestDataFormatterObjCCF.py' FAILED ******************** Script: -- /Users/buildslave/jenkins/workspace/lldb-cmake-sanitized/lldb-build/lldb-test-build.noindex/copied-system-python /Users/buildslave/jenkins/workspace/lldb-cmake-sanitized/llvm-project/lldb/test/API/dotest.py --arch x86_64 -s /Users/buildslave/jenkins/workspace/lldb-cmake-sanitized/lldb-build/lldb-test-traces -S nm -u CXXFLAGS -u CFLAGS --codesign-identity lldb_codesign --server /Users/buildslave/jenkins/workspace/lldb-cmake-sanitized/lldb-build/./bin/debugserver --arch x86_64 --build-dir /Users/buildslave/jenkins/workspace/lldb-cmake-sanitized/lldb-build/lldb-test-build.noindex -s=/Users/buildslave/jenkins/workspace/lldb-cmake-sanitized/test/logs -t --env TERM=vt100 --env LLVM_LIBS_DIR=/Users/buildslave/jenkins/workspace/lldb-cmake-sanitized/lldb-build/./lib --inferior-env ASAN_OPTIONS=detect_stack_use_after_return=1 --inferior-env DYLD_INSERT_LIBRARIES=/Users/buildslave/jenkins/workspace/lldb-cmake-sanitized/host-compiler/lib/clang/11.0.0/lib/darwin/libclang_rt.asan_osx_dynamic.dylib --build-dir /Users/buildslave/jenkins/workspace/lldb-cmake-sanitized/lldb-build/lldb-test-build.noindex --lldb-module-cache-dir /Users/buildslave/jenkins/workspace/lldb-cmake-sanitized/lldb-build/lldb-test-build.noindex/module-cache-lldb/lldb-api --clang-module-cache-dir /Users/buildslave/jenkins/workspace/lldb-cmake-sanitized/lldb-build/lldb-test-build.noindex/module-cache-clang/lldb-api --executable /Users/buildslave/jenkins/workspace/lldb-cmake-sanitized/lldb-build/./bin/lldb --compiler /Users/buildslave/jenkins/workspace/lldb-cmake-sanitized/lldb-build/./bin/clang --dsymutil /Users/buildslave/jenkins/workspace/lldb-cmake-sanitized/lldb-build/./bin/dsymutil --filecheck /Users/buildslave/jenkins/workspace/lldb-cmake-sanitized/lldb-build/./bin/FileCheck --lldb-libs-dir /Users/buildslave/jenkins/workspace/lldb-cmake-sanitized/lldb-build/./lib /Users/buildslave/jenkins/workspace/lldb-cmake-sanitized/llvm-project/lldb/test/API/functionalities/data-formatter/data-formatter-objc -p TestDataFormatterObjCCF.py -- Exit Code: -6

Hide Details

Command Output (stdout): -- lldb version 11.0.99 clang revision 82aac878beb48cd326b4684918b7ff2375fae439 llvm revision 82aac878beb48cd326b4684918b7ff2375fae439

Hide Details

-- Command Output (stderr): --

Hide Details

Session logs for test failures/errors/unexpected successes will go into directory '/Users/buildslave/jenkins/workspace/lldb-cmake-sanitized/test/logs' Command invoked: /Users/buildslave/jenkins/workspace/lldb-cmake-sanitized/llvm-project/lldb/test/API/dotest.py --arch x86_64 -s /Users/buildslave/jenkins/workspace/lldb-cmake-sanitized/lldb-build/lldb-test-traces -S nm -u CXXFLAGS -u CFLAGS --codesign-identity lldb_codesign --server /Users/buildslave/jenkins/workspace/lldb-cmake-sanitized/lldb-build/./bin/debugserver --arch x86_64 --build-dir /Users/buildslave/jenkins/workspace/lldb-cmake-sanitized/lldb-build/lldb-test-build.noindex -s=/Users/buildslave/jenkins/workspace/lldb-cmake-sanitized/test/logs -t --env TERM=vt100 --env LLVM_LIBS_DIR=/Users/buildslave/jenkins/workspace/lldb-cmake-sanitized/lldb-build/./lib --inferior-env ASAN_OPTIONS=detect_stack_use_after_return=1 --inferior-env DYLD_INSERT_LIBRARIES=/Users/buildslave/jenkins/workspace/lldb-cmake-sanitized/host-compiler/lib/clang/11.0.0/lib/darwin/libclang_rt.asan_osx_dynamic.dylib --build-dir /Users/buildslave/jenkins/workspace/lldb-cmake-sanitized/lldb-build/lldb-test-build.noindex --lldb-module-cache-dir /Users/buildslave/jenkins/workspace/lldb-cmake-sanitized/lldb-build/lldb-test-build.noindex/module-cache-lldb/lldb-api --clang-module-cache-dir /Users/buildslave/jenkins/workspace/lldb-cmake-sanitized/lldb-build/lldb-test-build.noindex/module-cache-clang/lldb-api --executable /Users/buildslave/jenkins/workspace/lldb-cmake-sanitized/lldb-build/./bin/lldb --compiler /Users/buildslave/jenkins/workspace/lldb-cmake-sanitized/lldb-build/./bin/clang --dsymutil /Users/buildslave/jenkins/workspace/lldb-cmake-sanitized/lldb-build/./bin/dsymutil --filecheck /Users/buildslave/jenkins/workspace/lldb-cmake-sanitized/lldb-build/./bin/FileCheck --lldb-libs-dir /Users/buildslave/jenkins/workspace/lldb-cmake-sanitized/lldb-build/./lib /Users/buildslave/jenkins/workspace/lldb-cmake-sanitized/llvm-project/lldb/test/API/functionalities/data-formatter/data-formatter-objc -p TestDataFormatterObjCCF.py Change dir to: /Users/buildslave/jenkins/workspace/lldb-cmake-sanitized/llvm-project/lldb/test/API/functionalities/data-formatter/data-formatter-objc runCmd: settings clear -all output:

Hide Details

runCmd: settings set symbols.enable-external-lookup false output:

Hide Details

runCmd: settings set target.auto-apply-fixits false output:

Hide Details

runCmd: settings set plugin.process.gdb-remote.packet-timeout 60 output:

Hide Details

runCmd: settings set symbols.clang-modules-cache-path "/Users/buildslave/jenkins/workspace/lldb-cmake-sanitized/lldb-build/lldb-test-build.noindex/module-cache-lldb/lldb-api" output:

Hide Details

runCmd: settings set use-color false output:

Hide Details

runCmd: setting set target.prefer-dynamic-value no-dynamic-values output:

Hide Details

runCmd: settings set target.env-vars ASAN_OPTIONS=detect_stack_use_after_return=1 DYLD_INSERT_LIBRARIES=/Users/buildslave/jenkins/workspace/lldb-cmake-sanitized/host-compiler/lib/clang/11.0.0/lib/darwin/libclang_rt.asan_osx_dynamic.dylib output:

Hide Details

runCmd: settings set target.env-vars ASAN_OPTIONS=detect_stack_use_after_return=1 DYLD_INSERT_LIBRARIES=/Users/buildslave/jenkins/workspace/lldb-cmake-sanitized/host-compiler/lib/clang/11.0.0/lib/darwin/libclang_rt.asan_osx_dynamic.dylib output:

Hide Details

runCmd: thread list output: Process 58921 stopped * thread #1: tid = 0x39bcaf, 0x000000010000489b a.out`main(argc=1, argv=0x00007ffeefbff670) at main.m:770:4, queue = 'com.apple.main-thread', stop reason = breakpoint 1.1 thread #2: tid = 0x39bd55, 0x00007fff7d8915be libsystem_kernel.dylib`__workq_kernreturn + 10 thread #3: tid = 0x39bd56, 0x00007fff7d8915be libsystem_kernel.dylib`__workq_kernreturn + 10

Hide Details

Hide Details

Expecting sub string: stopped Matched

Hide Details

Expecting sub string: stop reason = breakpoint Matched

Hide Details

runCmd: frame variable output: (int) argc = 1 (const char **) argv = 0x00007ffeefbff670 (NSAutoreleasePool *) pool = 0x00006040000016d0 (MyClass *) object = 0x0000603000002ef0 (MyOtherClass *) object2 = 0x0000603000002f20 (NSNumber *) num1 = 0xcc8116fdfe1e0e65 (int)5 (NSNumber *) num2 = 0x0000603000002fb0 (float)3.140000 (NSNumber *) num3 = 0x0000603000002fe0 (double)3.14 (NSNumber *) num4 = 0x0000603000003010 (int128_t)18446744073709551614 (NSNumber *) num5 = 0xcc8116fdfe1e4a45 (char)65 (NSNumber *) num6 = 0xcc8116fdfe1ef475 (long)255 (NSNumber *) num7 = 0xcc8116fde09a8b75 (long)2000000 (NSNumber *) num8_Y = 0x00007fffa7fe6c30 YES (NSNumber *) num8_N = 0x00007fffa7fe6c40 NO (NSNumber *) num9 = 0x337ee902019a8b55 (short)-31616 (NSNumber *) num_at1 = 0xcc8116fdfe1e0765 (int)12 (NSNumber *) num_at2 = 0x337ee90201e1ff65 (int)-12 (NSNumber *) num_at3 = 0x0000603000003040 (double)12.5 (NSNumber *) num_at4 = 0x0000603000003070 (double)-12.5 (NSDecimalNumber *) decimal_number = 0x00006030000030a0 123456 x 10^-10 (NSDecimalNumber *) decimal_number_neg = 0x00006030000030d0 -123456 x 10^10 (NSDecimalNumber *) decimal_one = 0x0000603000003100 1 x 10^0 (NSDecimalNumber *) decimal_zero = 0x0000602000002370 0 (NSDecimalNumber *) decimal_nan = 0x0000602000002390 NaN (NSString *) str0 = 0xcc8116fdcb2b3977 @"255" (NSString *) str1 = 0x0000606000008ba0 @"A rather short ASCII NSString object is here" (NSString *) str2 = 0x0000606000008c00 @"A rather short UTF8 NSString object is here" (NSString *) str3 = 0x0000000100006170 @"A string made with the at sign is here" (NSString *) str4 = 0x0000606000008c60 @"This is string number 4 right here" (NSRect) ns_rect_4str = (origin = (x = 1, y = 1), size = (width = 5, height = 5)) (NSString *) str5 = 0x0000604000001810 @"{{1, 1}, {5, 5}}" (NSString *) str6 = 0x00006030000031f0 @"1ST" (const unichar [3]) myCharacters = { [0] = U+03c3 u'σ' [1] = U+0078 u'x' [2] = U+0078 u'x' } (NSString *) str7 = 0x0000603000003220 @"σxx" (NSString *) str8 = 0x000061b000000780 @"hasVeryLongExtensionThisTimehasVeryLongExtensionThisTimehasVeryLongExtensionThisTimehasVeryLongExtensionThisTimehasVeryLongExtensionThisTimehasVeryLongExtensionThisTimehasVeryLongExtensionThisTimehasVeryLongExtensionThisTimehasVeryLongExtensionThisTimehasVeryLongExtensionThisTimehasVeryLongExtensionThisTimehasVeryLongExtensionThisTimehasVeryLongExtensionThisTimehasVeryLongExtensionThisTimehasVeryLongExtensionThisTimehasVeryLongExtensionThisTimehasVeryLongExtensionThisTimehasVeryLongExtensionThisTimehasVeryLongExtensionThisTimehasVeryLongExtensionThisTimehasVeryLongExtensionThisTimehasVeryLongExtensionThisTimehasVeryLongExtensionThisTimehasVeryLongExtensionThisTimehasVeryLongExtensionThisTimehasVeryLongExtensionThisTimehasVeryLongExtensionThisTimehasVeryLongExtensionThisTime" (const unichar [54]) myOtherCharacters = { [0] = U+0061 u'a' [1] = U+0020 u' ' [2] = U+0076 u'v' [3] = U+0065 u'e' [4] = U+0072 u'r' [5] = U+0079 u'y' [6] = U+0020 u' ' [7] = U+006d u'm' [8] = U+0075 u'u' [9] = U+0063 u'c' [10] = U+0068 u'h' [11] = U+0020 u' ' [12] = U+0062 u'b' [13] = U+006f u'o' [14] = U+0072 u'r' [15] = U+0069 u'i' [16] = U+006e u'n' [17] = U+0067 u'g' [18] = U+0020 u' ' [19] = U+0074 u't' [20] = U+0061 u'a' [21] = U+0073 u's' [22] = U+006b u'k' [23] = U+0020 u' ' [24] = U+0074 u't' [25] = U+006f u'o' [26] = U+0020 u' ' [27] = U+0077 u'w' [28] = U+0072 u'r' [29] = U+0069 u'i' [30] = U+0074 u't' [31] = U+0065 u'e' [32] = U+0020 u' ' [33] = U+0061 u'a' [34] = U+0020 u' ' [35] = U+0073 u's' [36] = U+0074 u't' [37] = U+0072 u'r' [38] = U+0069 u'i' [39] = U+006e u'n' [40] = U+0067 u'g' [41] = U+0020 u' ' [42] = U+0074 u't' [43] = U+0068 u'h' [44] = U+0069 u'i' [45] = U+0073 u's' [46] = U+0020 u' ' [47] = U+0077 u'w' [48] = U+0061 u'a' [49] = U+0079 u'y' [50] = U+0021 u'!' [51] = U+0021 u'!' [52] = U+03c3 u'σ' [53] = U+0000 u'\0' } (NSString *) str9 = 0x000060d000001be0 @"a very much boring task to write a string this way!!σ\0" (const unichar [2]) myNextCharacters = { [0] = U+03c3 u'σ' [1] = U+0000 u'\0' } (NSString *) str10 = 0x000060c000002200 @"This is a Unicode string σ number 4 right here" (NSString *) str11 = 0x0000603000003250 @"__NSCFString" (NSString *) label1 = 0x0000000100006210 @"Process Name: " (NSString *) label2 = 0x0000000100006230 @"Process Id: " (NSString *) processName = 0xcc81628891306a17 @"a.out" (NSString *) processID = 0xcc8127cfc7263e17 @"58921" (NSString *) str12 = 0x0000606000008f00 @"Process Name: a.out Process Id: 58921" (NSString *) strA1 = 0x0000606000008f60 @"A rather short ASCII NSString object is here" (NSString *) strA2 = 0x0000606000008fc0 @"A rather short UTF8 NSString object is here" (NSString *) strA3 = 0x0000000100006170 @"A string made with the at sign is here" (NSString *) strA4 = 0x0000606000009020 @"This is string number 4 right here" (NSString *) strA5 = 0x00006040000019d0 @"{{1, 1}, {5, 5}}" (NSString *) strA6 = 0x00006030000032e0 @"1ST" (NSString *) strA7 = 0x0000603000003310 @"σxx" (NSString *) strA8 = 0x000061b000001580 @"hasVeryLongExtensionThisTimehasVeryLongExtensionThisTimehasVeryLongExtensionThisTimehasVeryLongExtensionThisTimehasVeryLongExtensionThisTimehasVeryLongExtensionThisTimehasVeryLongExtensionThisTimehasVeryLongExtensionThisTimehasVeryLongExtensionThisTimehasVeryLongExtensionThisTimehasVeryLongExtensionThisTimehasVeryLongExtensionThisTimehasVeryLongExtensionThisTimehasVeryLongExtensionThisTimehasVeryLongExtensionThisTimehasVeryLongExtensionThisTimehasVeryLongExtensionThisTimehasVeryLongExtensionThisTimehasVeryLongExtensionThisTimehasVeryLongExtensionThisTimehasVeryLongExtensionThisTimehasVeryLongExtensionThisTimehasVeryLongExtensionThisTimehasVeryLongExtensionThisTimehasVeryLongExtensionThisTimehasVeryLongExtensionThisTimehasVeryLongExtensionThisTimehasVeryLongExtensionThisTime" (NSString *) strA9 = 0x000060d000001e50 @"a very much boring task to write a string this way!!σ\0" (NSString *) strA10 = 0x000060c000002680 @"This is a Unicode string σ number 4 right here" (NSString *) strA11 = 0x0000603000003340 @"__NSCFString" (NSString *) strA12 = 0x0000606000009080 @"Process Name: a.out Process Id: 58921" (NSString *) strB1 = 0x00006060000090e0 @"A rather short ASCII NSString object is here" (NSString *) strB2 = 0x0000606000009140 @"A rather short UTF8 NSString object is here" (NSString *) strB3 = 0x0000000100006170 @"A string made with the at sign is here" (NSString *) strB4 = 0x00006060000091a0 @"This is string number 4 right here" (NSString *) strB5 = 0x0000604000001b10 @"{{1, 1}, {5, 5}}" (NSString *) strB6 = 0x0000603000003370 @"1ST" (NSString *) strB7 = 0x00006030000033a0 @"σxx" (NSString *) strB8 = 0x000061b000002380 @"hasVeryLongExtensionThisTimehasVeryLongExtensionThisTimehasVeryLongExtensionThisTimehasVeryLongExtensionThisTimehasVeryLongExtensionThisTimehasVeryLongExtensionThisTimehasVeryLongExtensionThisTimehasVeryLongExtensionThisTimehasVeryLongExtensionThisTimehasVeryLongExtensionThisTimehasVeryLongExtensionThisTimehasVeryLongExtensionThisTimehasVeryLongExtensionThisTimehasVeryLongExtensionThisTimehasVeryLongExtensionThisTimehasVeryLongExtensionThisTimehasVeryLongExtensionThisTimehasVeryLongExtensionThisTimehasVeryLongExtensionThisTimehasVeryLongExtensionThisTimehasVeryLongExtensionThisTimehasVeryLongExtensionThisTimehasVeryLongExtensionThisTimehasVeryLongExtensionThisTimehasVeryLongExtensionThisTimehasVeryLongExtensionThisTimehasVeryLongExtensionThisTimehasVeryLongExtensionThisTime" (NSString *) strB9 = 0x000060d000001f20 @"a very much boring task to write a string this way!!σ\0" (NSString *) strB10 = 0x000060c000002a40 @"This is a Unicode string σ number 4 right here" (NSString *) strB11 = 0x00006030000033d0 @"__NSCFString" (NSString *) strB12 = 0x0000606000009200 @"Process Name: a.out Process Id: 58921" (NSString *) strC11 = 0x0000603000003400 @"__NSCFString" (NSString *) strC12 = 0x0000606000009260 @"Process Name: a.out Process Id: 58921" (NSString *) strC1 = 0x00006060000092c0 @"A rather short ASCII NSString object is here" (NSString *) strC2 = 0x0000606000009320 @"A rather short UTF8 NSString object is here" (NSString *) strC3 = 0x0000000100006170 @"A string made with the at sign is here" (NSString *) strC4 = 0x0000606000009380 @"This is string number 4 right here" (NSString *) strC5 = 0x0000604000001c90 @"{{1, 1}, {5, 5}}" (NSString *) strC6 = 0x0000603000003430 @"1ST" (NSString *) strC7 = 0x0000603000003460 @"σxx" (NSString *) strC8 = 0x000061b000003180 @"hasVeryLongExtensionThisTimehasVeryLongExtensionThisTimehasVeryLongExtensionThisTimehasVeryLongExtensionThisTimehasVeryLongExtensionThisTimehasVeryLongExtensionThisTimehasVeryLongExtensionThisTimehasVeryLongExtensionThisTimehasVeryLongExtensionThisTimehasVeryLongExtensionThisTimehasVeryLongExtensionThisTimehasVeryLongExtensionThisTimehasVeryLongExtensionThisTimehasVeryLongExtensionThisTimehasVeryLongExtensionThisTimehasVeryLongExtensionThisTimehasVeryLongExtensionThisTimehasVeryLongExtensionThisTimehasVeryLongExtensionThisTimehasVeryLongExtensionThisTimehasVeryLongExtensionThisTimehasVeryLongExtensionThisTimehasVeryLongExtensionThisTimehasVeryLongExtensionThisTimehasVeryLongExtensionThisTimehasVeryLongExtensionThisTimehasVeryLongExtensionThisTimehasVeryLongExtensionThisTime" (NSString *) strC9 = 0x000060d000001ff0 @"a very much boring task to write a string this way!!σ\0" (NSString *) strC10 = 0x000060c000002ec0 @"This is a Unicode string σ number 4 right here" (NSString *) strD11 = 0x0000603000003490 @"__NSCFString" (NSString *) strD12 = 0x00006060000093e0 @"Process Name: a.out Process Id: 58921" (NSString *) eAcute = 0x00006030000034f0 @"é" (NSString *) randomHaziChar = 0x0000603000003550 @"鷅" (NSString *) japanese = 0x00000001000062b0 @"色は匂へど散りぬるを" (NSString *) italian = 0x00000001000062d0 @"L'Italia è una Repubblica democratica, fondata sul lavoro. La sovranità appartiene al popolo, che la esercita nelle forme e nei limiti della Costituzione." (NSString *) french = 0x00000001000062f0 @"Que veut cette horde d'esclaves, De traîtres, de rois conjurés?" (NSString *) german = 0x0000000100006310 @"Über-Ich und aus den Ansprüchen der sozialen Umwelt" (void *[3]) data_set = ([0] = 0x0000606000008ba0, [1] = 0x0000606000008c00, [2] = 0x0000000100006170) (NSString *) hebrew = 0x0000000100006330 @"לילה טוב" (NSArray *) newArray = 0x0000604000001dd0 @"50 elements" (NSDictionary *) newDictionary = 0x0000619000001980 12 key/value pairs (NSDictionary *) newMutableDictionary = 0x0000603000003610 21 key/value pairs (id [4]) cfKeys = { [0] = 0x0000000100006350 [1] = 0x0000000100006610 [2] = 0x0000000100006630 [3] = 0x0000000100006650 } (id [4]) cfValues = { [0] = 0x0000000100006350 [1] = 0x0000000100006610 [2] = 0x0000000100006630 [3] = 0x0000000100006650 } (NSDictionary *) nsDictionary = 0x00006060000095c0 2 key/value pairs (NSDictionary *) nscfDictionary = 0x0000606000009620 4 key/value pairs (CFDictionaryRef) cfDictionaryRef = 0x00006060000095c0 2 key/value pairs (NSAttributedString *) attrString = 0x00006030000036a0 @"hello world from foo" (NSAttributedString *) mutableAttrString = 0x00006030000037f0 @"hello world from foo" (NSString *) mutableString = 0x0000604000001f90 @"foo said this string needs to be very long so much longer than whatever other string has been seen ever before by anyone of the mankind that of course this is still not long enough given what foo our friend foo our lovely dearly friend foo desired of us so i am adding more stuff here for the sake of it and for the joy of our friend who is named guess what just foo. hence, dear friend foo, stay safe, your string is now long enough to accommodate your testing need and I will make sure that if not we extend it with even more fuzzy random meaningless words pasted one after the other from a long tiresome friday evening spent working in my office. my office mate went home but I am still randomly typing just for the fun of seeing what happens of the length of a Mutable String in Cocoa if it goes beyond one byte.. so be it, dear foo" (NSString *) mutableGetConst = 0x0000618000000080 @"foo said this string needs to be very long so much longer than whatever other string has been seen ever before by anyone of the mankind that of course this is still not long enough given what foo our friend foo our lovely dearly friend foo desired of us so i am adding more stuff here for the sake of it and for the joy of our friend who is named guess what just foo. hence, dear friend foo, stay safe, your string is now long enough to accommodate your testing need and I will make sure that if not we extend it with even more fuzzy random meaningless words pasted one after the other from a long tiresome friday evening spent working in my office. my office mate went home but I am still randomly typing just for the fun of seeing what happens of the length of a Mutable String in Cocoa if it goes beyond one byte.. so be it, dear foo" (NSData *) immutableData = 0x0000603000003850 5 bytes (NSData *) mutableData = 0x0000604000002010 14 bytes (unsigned int) concreteLength = 100000 (void *) zeroes1 = 0x0000633000000800 (NSData *) concreteData = 0x0000603000003880 100000 bytes (void *) zeroes2 = 0x000063300001c800 (NSMutableData *) concreteMutableData = 0x0000604000002050 100000 bytes (NSSet *) nsset = 0x0000604000002090 3 elements (NSSet *) nsmutableset = 0x00006030000038e0 4 elements (NSSet *) nscfSet = 0x00006040000020d0 2 elements (CFSetRef) cfSetRef = 0x00006040000020d0 2 elements (CFDataRef) data_ref = 0x0000607000003f20 @"5 bytes" (CFMutableDataRef) mutable_data_ref = 0x0000607000003f90 @"5 bytes" (CFMutableStringRef) mutable_string_ref = 0x0000604000002110 @"Wish ya knew" (CFStringRef) cfstring_ref = 0x00000001000066d0 @"HELLO WORLD" (CFArrayRef) cfarray_ref = 0x0000607000004000 @"3 elements" (CFMutableArrayRef) mutable_array_ref = 0x0000604000002150 @"11 elements" (CFBinaryHeapRef) binheap_ref = 0x000060c000003640 @"21 items" (CFURLRef) cfurl_ref = 0x000060b000002350 @"http://www.foo.bar/" (CFURLRef) cfchildurl_ref = 0x00006070000040e0 @"page.html -- http://www.foo.bar/" (CFURLRef) cfgchildurl_ref = 0x0000607000004150 @"?whatever -- http://www.foo.bar/page.html" (NSDictionary *) error_userInfo = 0x0000606000009e60 2 key/value pairs (NSError *) nserror = 0x0000604000002290 domain: @"Foobar" - code: 12 (NSError **) nserrorptr = 0x00007ffeefbff078 domain: @"Foobar" - code: 12 (NSBundle *) bundle_string = 0x0000607000004310 @"/System/Library/Frameworks/Accelerate.framework" (NSBundle *) bundle_url = 0x0000607000004af0 @"/System/Library/Frameworks/Foundation.framework" (NSBundle *) main_bundle = 0x0000607000004cb0 @"/Users/buildslave/jenkins/workspace/lldb-cmake-sanitized/lldb-build/lldb-test-build.noindex/functionalities/data-formatter/data-formatter-objc/TestDataFormatterObjCCF.test_coreframeworks_and_run_command_dsym" (NSArray *) bundles = 0x0000604000002450 @"1 element" (NSURL *) nsurl0 = 0x0000608000001320 @"file:///Users/buildslave/jenkins/workspace/lldb-cmake-sanitized/lldb-build/lldb-test-build.noindex/functionalities/data-formatter/data-formatter-objc/TestDataFormatterObjCCF.test_coreframeworks_and_run_command_dsym/" (NSException *) except0 = 0x00006040000024d0 @"First" (NSException *) except1 = 0x0000604000002510 @"Second" (NSException *) except2 = 0x0000604000002550 @"Third" (NSException *) except3 = 0x0000604000002590 @"Fourth" (NSURL *) nsurl = 0x000060b0000028d0 @"http://www.foo.bar" (NSURL *) nsurl2 = 0x0000607000004ee0 @"page.html -- http://www.foo.bar" (NSURL *) nsurl3 = 0x0000607000004f50 @"?whatever -- http://www.foo.bar/page.html" (NSDate *) date1 = 0x0d3c82019e1e0b4f 1985-04-10 18:00:00 UTC (NSDate *) date2 = 0x0000604000008e90 2011-01-01 08:00:00 UTC (NSDate *) date3 = 0x0000602000003bb0 2020-06-03 13:59:43 UTC (NSDate *) date4 = 0x0d4c31c67e1e0b4f 1970-01-02 00:00:00 UTC (NSDate *) date5 = 0x8d43550fd99e0b4f 2020-06-03 13:59:43 UTC (CFAbsoluteTime) date1_abs = 1985-04-10 10:00:00 PST (CFAbsoluteTime) date2_abs = 2011-01-01 00:00:00 PST (CFAbsoluteTime) date3_abs = 2020-06-03 06:59:43 PDT (CFAbsoluteTime) date4_abs = 1970-01-01 16:00:00 PST (CFAbsoluteTime) date5_abs = 2020-06-03 06:59:43 PDT (NSIndexSet *) iset1 = 0x00006030000097f0 4 indexes (NSIndexSet *) iset2 = 0x0000603000009820 512 indexes (NSMutableIndexSet *) imset = 0x0000604000008f10 10 indexes (CFTimeZoneRef) cupertino = 0x0000608000001a20 @"America/Los_Angeles" (CFTimeZoneRef) home = 0x0000608000001ba0 @"Europe/Rome" (CFTimeZoneRef) europe = 0x0000608000001d20 @"Europe/Paris" (NSTimeZone *) cupertino_ns = 0x0000608000001a20 @"America/Los_Angeles" (NSTimeZone *) home_ns = 0x0000608000001ba0 @"Europe/Rome" (NSTimeZone *) europe_ns = 0x0000608000001d20 @"Europe/Paris" (CFGregorianUnits) cf_greg_units = 1 years, 3 months, 5 days, 12 hours, 5 minutes 7 seconds (CFGregorianDate) cf_greg_date = @"4/10/1985 18:0:0" (CFRange) cf_range = location=4 length=4 (NSPoint) ns_point = (x = 4, y = 4) (NSRange) ns_range = location=4, length=4 (NSRect) ns_rect = (origin = (x = 1, y = 1), size = (width = 5, height = 5)) (NSRect *) ns_rect_ptr = (origin = (x = 1, y = 1), size = (width = 5, height = 5)) (NSRectArray) ns_rect_arr = ((x = 1, y = 1), (width = 5, height = 5)), ... (NSSize) ns_size = (width = 5, height = 7) (NSSize *) ns_size_ptr = (width = 5, height = 7) (CGSize) cg_size = (width = 1, height = 6) (CGPoint) cg_point = (x = 2, y = 7) (CGRect) cg_rect = (origin = (x = 1, y = 2), size = (width = 7, height = 7)) (RGBColor) rgb_color = red=3 green=56 blue=35 (RGBColor *) rgb_color_ptr = red=3 green=56 blue=35 (Rect) rect = (t=4, l=8, b=4, r=7) (Rect *) rect_ptr = (t=4, l=8, b=4, r=7) (Point) point = (v=7, h=12) (Point *) point_ptr = (v=7, h=12) (HIPoint) hi_point = (x=7, y=12) (HIRect) hi_rect = origin=(x = 3, y = 5) size=(width = 4, height = 6) (SEL) foo_selector = "foo_selector_impl" (CFMutableBitVectorRef) mut_bv = 0x0000604000009490 1110 0110 1011 0000 1101 1010 1000 1111 0011 0101 1101 0001 00 (Molecule *) molecule = 0x0000602000003c50 (Class) myclass = NSValue (Class) myclass2 = NSTaggedPointerString (Class) myclass3 = Molecule (Class) myclass4 = NSMutableArray (Class) myclass5 = nil (NSArray *) components = 0x00006040000094d0 @"3 elements" (NSString *) path = 0x0000604000009510 @"usr/blah/stuff"

Hide Details

Hide Details

Expecting sub string: (CFGregorianUnits) cf_greg_units = 1 years, 3 months, 5 days, 12 hours, 5 minutes 7 seconds Matched

Hide Details

Expecting sub string: (CFGregorianDate) cf_greg_date = @"4/10/1985 18:0:0" Matched

Hide Details

Expecting sub string: (CFRange) cf_range = location=4 length=4 Matched

Hide Details

Expecting sub string: (NSPoint) ns_point = (x = 4, y = 4) Matched

Hide Details

Expecting sub string: (NSRange) ns_range = location=4, length=4 Matched

Hide Details

Expecting sub string: (NSRect) ns_rect = (origin = (x = 1, y = 1), size = (width = 5, height = 5)) Matched

Hide Details

Expecting sub string: (NSRectArray) ns_rect_arr = ((x = 1, y = 1), (width = 5, height = 5)), ... Matched

Hide Details

Expecting sub string: (NSSize) ns_size = (width = 5, height = 7) Matched

Hide Details

Expecting sub string: (CGSize) cg_size = (width = 1, height = 6) Matched

Hide Details

Expecting sub string: (CGPoint) cg_point = (x = 2, y = 7) Matched

Hide Details

Expecting sub string: (CGRect) cg_rect = (origin = (x = 1, y = 2), size = (width = 7, height = 7)) Matched

Hide Details

Expecting sub string: (Rect) rect = (t=4, l=8, b=4, r=7) Matched

Hide Details

Expecting sub string: (Rect *) rect_ptr = (t=4, l=8, b=4, r=7) Matched

Hide Details

Expecting sub string: (Point) point = (v=7, h=12) Matched

Hide Details

Expecting sub string: (Point *) point_ptr = (v=7, h=12) Matched

Hide Details

Expecting sub string: (SEL) foo_selector = "foo_selector_impl" Matched

Hide Details

runCmd: frame variable output: (int) argc = 1 (const char **) argv = 0x00007ffeefbff670 (NSAutoreleasePool *) pool = 0x00006040000016d0 (MyClass *) object = 0x0000603000002ef0 (MyOtherClass *) object2 = 0x0000603000002f20 (NSNumber *) num1 = 0xcc8116fdfe1e0e65 (int)5 (NSNumber *) num2 = 0x0000603000002fb0 (float)3.140000 (NSNumber *) num3 = 0x0000603000002fe0 (double)3.14 (NSNumber *) num4 = 0x0000603000003010 (int128_t)18446744073709551614 (NSNumber *) num5 = 0xcc8116fdfe1e4a45 (char)65 (NSNumber *) num6 = 0xcc8116fdfe1ef475 (long)255 (NSNumber *) num7 = 0xcc8116fde09a8b75 (long)2000000 (NSNumber *) num8_Y = 0x00007fffa7fe6c30 YES (NSNumber *) num8_N = 0x00007fffa7fe6c40 NO (NSNumber *) num9 = 0x337ee902019a8b55 (short)-31616 (NSNumber *) num_at1 = 0xcc8116fdfe1e0765 (int)12 (NSNumber *) num_at2 = 0x337ee90201e1ff65 (int)-12 (NSNumber *) num_at3 = 0x0000603000003040 (double)12.5 (NSNumber *) num_at4 = 0x0000603000003070 (double)-12.5 (NSDecimalNumber *) decimal_number = 0x00006030000030a0 123456 x 10^-10 (NSDecimalNumber *) decimal_number_neg = 0x00006030000030d0 -123456 x 10^10 (NSDecimalNumber *) decimal_one = 0x0000603000003100 1 x 10^0 (NSDecimalNumber *) decimal_zero = 0x0000602000002370 0 (NSDecimalNumber *) decimal_nan = 0x0000602000002390 NaN (NSString *) str0 = 0xcc8116fdcb2b3977 @"255" (NSString *) str1 = 0x0000606000008ba0 @"A rather short ASCII NSString object is here" (NSString *) str2 = 0x0000606000008c00 @"A rather short UTF8 NSString object is here" (NSString *) str3 = 0x0000000100006170 @"A string made with the at sign is here" (NSString *) str4 = 0x0000606000008c60 @"This is string number 4 right here" (NSRect) ns_rect_4str = (origin = (x = 1, y = 1), size = (width = 5, height = 5)) (NSString *) str5 = 0x0000604000001810 @"{{1, 1}, {5, 5}}" (NSString *) str6 = 0x00006030000031f0 @"1ST" (const unichar [3]) myCharacters = { [0] = U+03c3 u'σ' [1] = U+0078 u'x' [2] = U+0078 u'x' } (NSString *) str7 = 0x0000603000003220 @"σxx" (NSString *) str8 = 0x000061b000000780 @"hasVeryLongExtensionThisTimehasVeryLongExtensionThisTimehasVeryLongExtensionThisTimehasVeryLongExtensionThisTimehasVeryLongExtensionThisTimehasVeryLongExtensionThisTimehasVeryLongExtensionThisTimehasVeryLongExtensionThisTimehasVeryLongExtensionThisTimehasVeryLongExtensionThisTimehasVeryLongExtensionThisTimehasVeryLongExtensionThisTimehasVeryLongExtensionThisTimehasVeryLongExtensionThisTimehasVeryLongExtensionThisTimehasVeryLongExtensionThisTimehasVeryLongExtensionThisTimehasVeryLongExtensionThisTimehasVeryLongExtensionThisTimehasVeryLongExtensionThisTimehasVeryLongExtensionThisTimehasVeryLongExtensionThisTimehasVeryLongExtensionThisTimehasVeryLongExtensionThisTimehasVeryLongExtensionThisTimehasVeryLongExtensionThisTimehasVeryLongExtensionThisTimehasVeryLongExtensionThisTime" (const unichar [54]) myOtherCharacters = { [0] = U+0061 u'a' [1] = U+0020 u' ' [2] = U+0076 u'v' [3] = U+0065 u'e' [4] = U+0072 u'r' [5] = U+0079 u'y' [6] = U+0020 u' ' [7] = U+006d u'm' [8] = U+0075 u'u' [9] = U+0063 u'c' [10] = U+0068 u'h' [11] = U+0020 u' ' [12] = U+0062 u'b' [13] = U+006f u'o' [14] = U+0072 u'r' [15] = U+0069 u'i' [16] = U+006e u'n' [17] = U+0067 u'g' [18] = U+0020 u' ' [19] = U+0074 u't' [20] = U+0061 u'a' [21] = U+0073 u's' [22] = U+006b u'k' [23] = U+0020 u' ' [24] = U+0074 u't' [25] = U+006f u'o' [26] = U+0020 u' ' [27] = U+0077 u'w' [28] = U+0072 u'r' [29] = U+0069 u'i' [30] = U+0074 u't' [31] = U+0065 u'e' [32] = U+0020 u' ' [33] = U+0061 u'a' [34] = U+0020 u' ' [35] = U+0073 u's' [36] = U+0074 u't' [37] = U+0072 u'r' [38] = U+0069 u'i' [39] = U+006e u'n' [40] = U+0067 u'g' [41] = U+0020 u' ' [42] = U+0074 u't' [43] = U+0068 u'h' [44] = U+0069 u'i' [45] = U+0073 u's' [46] = U+0020 u' ' [47] = U+0077 u'w' [48] = U+0061 u'a' [49] = U+0079 u'y' [50] = U+0021 u'!' [51] = U+0021 u'!' [52] = U+03c3 u'σ' [53] = U+0000 u'\0' } (NSString *) str9 = 0x000060d000001be0 @"a very much boring task to write a string this way!!σ\0" (const unichar [2]) myNextCharacters = { [0] = U+03c3 u'σ' [1] = U+0000 u'\0' } (NSString *) str10 = 0x000060c000002200 @"This is a Unicode string σ number 4 right here" (NSString *) str11 = 0x0000603000003250 @"__NSCFString" (NSString *) label1 = 0x0000000100006210 @"Process Name: " (NSString *) label2 = 0x0000000100006230 @"Process Id: " (NSString *) processName = 0xcc81628891306a17 @"a.out" (NSString *) processID = 0xcc8127cfc7263e17 @"58921" (NSString *) str12 = 0x0000606000008f00 @"Process Name: a.out Process Id: 58921" (NSString *) strA1 = 0x0000606000008f60 @"A rather short ASCII NSString object is here" (NSString *) strA2 = 0x0000606000008fc0 @"A rather short UTF8 NSString object is here" (NSString *) strA3 = 0x0000000100006170 @"A string made with the at sign is here" (NSString *) strA4 = 0x0000606000009020 @"This is string number 4 right here" (NSString *) strA5 = 0x00006040000019d0 @"{{1, 1}, {5, 5}}" (NSString *) strA6 = 0x00006030000032e0 @"1ST" (NSString *) strA7 = 0x0000603000003310 @"σxx" (NSString *) strA8 = 0x000061b000001580 @"hasVeryLongExtensionThisTimehasVeryLongExtensionThisTimehasVeryLongExtensionThisTimehasVeryLongExtensionThisTimehasVeryLongExtensionThisTimehasVeryLongExtensionThisTimehasVeryLongExtensionThisTimehasVeryLongExtensionThisTimehasVeryLongExtensionThisTimehasVeryLongExtensionThisTimehasVeryLongExtensionThisTimehasVeryLongExtensionThisTimehasVeryLongExtensionThisTimehasVeryLongExtensionThisTimehasVeryLongExtensionThisTimehasVeryLongExtensionThisTimehasVeryLongExtensionThisTimehasVeryLongExtensionThisTimehasVeryLongExtensionThisTimehasVeryLongExtensionThisTimehasVeryLongExtensionThisTimehasVeryLongExtensionThisTimehasVeryLongExtensionThisTimehasVeryLongExtensionThisTimehasVeryLongExtensionThisTimehasVeryLongExtensionThisTimehasVeryLongExtensionThisTimehasVeryLongExtensionThisTime" (NSString *) strA9 = 0x000060d000001e50 @"a very much boring task to write a string this way!!σ\0" (NSString *) strA10 = 0x000060c000002680 @"This is a Unicode string σ number 4 right here" (NSString *) strA11 = 0x0000603000003340 @"__NSCFString" (NSString *) strA12 = 0x0000606000009080 @"Process Name: a.out Process Id: 58921" (NSString *) strB1 = 0x00006060000090e0 @"A rather short ASCII NSString object is here" (NSString *) strB2 = 0x0000606000009140 @"A rather short UTF8 NSString object is here" (NSString *) strB3 = 0x0000000100006170 @"A string made with the at sign is here" (NSString *) strB4 = 0x00006060000091a0 @"This is string number 4 right here" (NSString *) strB5 = 0x0000604000001b10 @"{{1, 1}, {5, 5}}" (NSString *) strB6 = 0x0000603000003370 @"1ST" (NSString *) strB7 = 0x00006030000033a0 @"σxx" (NSString *) strB8 = 0x000061b000002380 @"hasVeryLongExtensionThisTimehasVeryLongExtensionThisTimehasVeryLongExtensionThisTimehasVeryLongExtensionThisTimehasVeryLongExtensionThisTimehasVeryLongExtensionThisTimehasVeryLongExtensionThisTimehasVeryLongExtensionThisTimehasVeryLongExtensionThisTimehasVeryLongExtensionThisTimehasVeryLongExtensionThisTimehasVeryLongExtensionThisTimehasVeryLongExtensionThisTimehasVeryLongExtensionThisTimehasVeryLongExtensionThisTimehasVeryLongExtensionThisTimehasVeryLongExtensionThisTimehasVeryLongExtensionThisTimehasVeryLongExtensionThisTimehasVeryLongExtensionThisTimehasVeryLongExtensionThisTimehasVeryLongExtensionThisTimehasVeryLongExtensionThisTimehasVeryLongExtensionThisTimehasVeryLongExtensionThisTimehasVeryLongExtensionThisTimehasVeryLongExtensionThisTimehasVeryLongExtensionThisTime" (NSString *) strB9 = 0x000060d000001f20 @"a very much boring task to write a string this way!!σ\0" (NSString *) strB10 = 0x000060c000002a40 @"This is a Unicode string σ number 4 right here" (NSString *) strB11 = 0x00006030000033d0 @"__NSCFString" (NSString *) strB12 = 0x0000606000009200 @"Process Name: a.out Process Id: 58921" (NSString *) strC11 = 0x0000603000003400 @"__NSCFString" (NSString *) strC12 = 0x0000606000009260 @"Process Name: a.out Process Id: 58921" (NSString *) strC1 = 0x00006060000092c0 @"A rather short ASCII NSString object is here" (NSString *) strC2 = 0x0000606000009320 @"A rather short UTF8 NSString object is here" (NSString *) strC3 = 0x0000000100006170 @"A string made with the at sign is here" (NSString *) strC4 = 0x0000606000009380 @"This is string number 4 right here" (NSString *) strC5 = 0x0000604000001c90 @"{{1, 1}, {5, 5}}" (NSString *) strC6 = 0x0000603000003430 @"1ST" (NSString *) strC7 = 0x0000603000003460 @"σxx" (NSString *) strC8 = 0x000061b000003180 @"hasVeryLongExtensionThisTimehasVeryLongExtensionThisTimehasVeryLongExtensionThisTimehasVeryLongExtensionThisTimehasVeryLongExtensionThisTimehasVeryLongExtensionThisTimehasVeryLongExtensionThisTimehasVeryLongExtensionThisTimehasVeryLongExtensionThisTimehasVeryLongExtensionThisTimehasVeryLongExtensionThisTimehasVeryLongExtensionThisTimehasVeryLongExtensionThisTimehasVeryLongExtensionThisTimehasVeryLongExtensionThisTimehasVeryLongExtensionThisTimehasVeryLongExtensionThisTimehasVeryLongExtensionThisTimehasVeryLongExtensionThisTimehasVeryLongExtensionThisTimehasVeryLongExtensionThisTimehasVeryLongExtensionThisTimehasVeryLongExtensionThisTimehasVeryLongExtensionThisTimehasVeryLongExtensionThisTimehasVeryLongExtensionThisTimehasVeryLongExtensionThisTimehasVeryLongExtensionThisTime" (NSString *) strC9 = 0x000060d000001ff0 @"a very much boring task to write a string this way!!σ\0" (NSString *) strC10 = 0x000060c000002ec0 @"This is a Unicode string σ number 4 right here" (NSString *) strD11 = 0x0000603000003490 @"__NSCFString" (NSString *) strD12 = 0x00006060000093e0 @"Process Name: a.out Process Id: 58921" (NSString *) eAcute = 0x00006030000034f0 @"é" (NSString *) randomHaziChar = 0x0000603000003550 @"鷅" (NSString *) japanese = 0x00000001000062b0 @"色は匂へど散りぬるを" (NSString *) italian = 0x00000001000062d0 @"L'Italia è una Repubblica democratica, fondata sul lavoro. La sovranità appartiene al popolo, che la esercita nelle forme e nei limiti della Costituzione." (NSString *) french = 0x00000001000062f0 @"Que veut cette horde d'esclaves, De traîtres, de rois conjurés?" (NSString *) german = 0x0000000100006310 @"Über-Ich und aus den Ansprüchen der sozialen Umwelt" (void *[3]) data_set = ([0] = 0x0000606000008ba0, [1] = 0x0000606000008c00, [2] = 0x0000000100006170) (NSString *) hebrew = 0x0000000100006330 @"לילה טוב" (NSArray *) newArray = 0x0000604000001dd0 @"50 elements" (NSDictionary *) newDictionary = 0x0000619000001980 12 key/value pairs (NSDictionary *) newMutableDictionary = 0x0000603000003610 21 key/value pairs (id [4]) cfKeys = { [0] = 0x0000000100006350 [1] = 0x0000000100006610 [2] = 0x0000000100006630 [3] = 0x0000000100006650 } (id [4]) cfValues = { [0] = 0x0000000100006350 [1] = 0x0000000100006610 [2] = 0x0000000100006630 [3] = 0x0000000100006650 } (NSDictionary *) nsDictionary = 0x00006060000095c0 2 key/value pairs (NSDictionary *) nscfDictionary = 0x0000606000009620 4 key/value pairs (CFDictionaryRef) cfDictionaryRef = 0x00006060000095c0 2 key/value pairs (NSAttributedString *) attrString = 0x00006030000036a0 @"hello world from foo" (NSAttributedString *) mutableAttrString = 0x00006030000037f0 @"hello world from foo" (NSString *) mutableString = 0x0000604000001f90 @"foo said this string needs to be very long so much longer than whatever other string has been seen ever before by anyone of the mankind that of course this is still not long enough given what foo our friend foo our lovely dearly friend foo desired of us so i am adding more stuff here for the sake of it and for the joy of our friend who is named guess what just foo. hence, dear friend foo, stay safe, your string is now long enough to accommodate your testing need and I will make sure that if not we extend it with even more fuzzy random meaningless words pasted one after the other from a long tiresome friday evening spent working in my office. my office mate went home but I am still randomly typing just for the fun of seeing what happens of the length of a Mutable String in Cocoa if it goes beyond one byte.. so be it, dear foo" (NSString *) mutableGetConst = 0x0000618000000080 @"foo said this string needs to be very long so much longer than whatever other string has been seen ever before by anyone of the mankind that of course this is still not long enough given what foo our friend foo our lovely dearly friend foo desired of us so i am adding more stuff here for the sake of it and for the joy of our friend who is named guess what just foo. hence, dear friend foo, stay safe, your string is now long enough to accommodate your testing need and I will make sure that if not we extend it with even more fuzzy random meaningless words pasted one after the other from a long tiresome friday evening spent working in my office. my office mate went home but I am still randomly typing just for the fun of seeing what happens of the length of a Mutable String in Cocoa if it goes beyond one byte.. so be it, dear foo" (NSData *) immutableData = 0x0000603000003850 5 bytes (NSData *) mutableData = 0x0000604000002010 14 bytes (unsigned int) concreteLength = 100000 (void *) zeroes1 = 0x0000633000000800 (NSData *) concreteData = 0x0000603000003880 100000 bytes (void *) zeroes2 = 0x000063300001c800 (NSMutableData *) concreteMutableData = 0x0000604000002050 100000 bytes (NSSet *) nsset = 0x0000604000002090 3 elements (NSSet *) nsmutableset = 0x00006030000038e0 4 elements (NSSet *) nscfSet = 0x00006040000020d0 2 elements (CFSetRef) cfSetRef = 0x00006040000020d0 2 elements (CFDataRef) data_ref = 0x0000607000003f20 @"5 bytes" (CFMutableDataRef) mutable_data_ref = 0x0000607000003f90 @"5 bytes" (CFMutableStringRef) mutable_string_ref = 0x0000604000002110 @"Wish ya knew" (CFStringRef) cfstring_ref = 0x00000001000066d0 @"HELLO WORLD" (CFArrayRef) cfarray_ref = 0x0000607000004000 @"3 elements" (CFMutableArrayRef) mutable_array_ref = 0x0000604000002150 @"11 elements" (CFBinaryHeapRef) binheap_ref = 0x000060c000003640 @"21 items" (CFURLRef) cfurl_ref = 0x000060b000002350 @"http://www.foo.bar/" (CFURLRef) cfchildurl_ref = 0x00006070000040e0 @"page.html -- http://www.foo.bar/" (CFURLRef) cfgchildurl_ref = 0x0000607000004150 @"?whatever -- http://www.foo.bar/page.html" (NSDictionary *) error_userInfo = 0x0000606000009e60 2 key/value pairs (NSError *) nserror = 0x0000604000002290 domain: @"Foobar" - code: 12 (NSError **) nserrorptr = 0x00007ffeefbff078 domain: @"Foobar" - code: 12 (NSBundle *) bundle_string = 0x0000607000004310 @"/System/Library/Frameworks/Accelerate.framework" (NSBundle *) bundle_url = 0x0000607000004af0 @"/System/Library/Frameworks/Foundation.framework" (NSBundle *) main_bundle = 0x0000607000004cb0 @"/Users/buildslave/jenkins/workspace/lldb-cmake-sanitized/lldb-build/lldb-test-build.noindex/functionalities/data-formatter/data-formatter-objc/TestDataFormatterObjCCF.test_coreframeworks_and_run_command_dsym" (NSArray *) bundles = 0x0000604000002450 @"1 element" (NSURL *) nsurl0 = 0x0000608000001320 @"file:///Users/buildslave/jenkins/workspace/lldb-cmake-sanitized/lldb-build/lldb-test-build.noindex/functionalities/data-formatter/data-formatter-objc/TestDataFormatterObjCCF.test_coreframeworks_and_run_command_dsym/" (NSException *) except0 = 0x00006040000024d0 @"First" (NSException *) except1 = 0x0000604000002510 @"Second" (NSException *) except2 = 0x0000604000002550 @"Third" (NSException *) except3 = 0x0000604000002590 @"Fourth" (NSURL *) nsurl = 0x000060b0000028d0 @"http://www.foo.bar" (NSURL *) nsurl2 = 0x0000607000004ee0 @"page.html -- http://www.foo.bar" (NSURL *) nsurl3 = 0x0000607000004f50 @"?whatever -- http://www.foo.bar/page.html" (NSDate *) date1 = 0x0d3c82019e1e0b4f 1985-04-10 18:00:00 UTC (NSDate *) date2 = 0x0000604000008e90 2011-01-01 08:00:00 UTC (NSDate *) date3 = 0x0000602000003bb0 2020-06-03 13:59:43 UTC (NSDate *) date4 = 0x0d4c31c67e1e0b4f 1970-01-02 00:00:00 UTC (NSDate *) date5 = 0x8d43550fd99e0b4f 2020-06-03 13:59:43 UTC (CFAbsoluteTime) date1_abs = 1985-04-10 10:00:00 PST (CFAbsoluteTime) date2_abs = 2011-01-01 00:00:00 PST (CFAbsoluteTime) date3_abs = 2020-06-03 06:59:43 PDT (CFAbsoluteTime) date4_abs = 1970-01-01 16:00:00 PST (CFAbsoluteTime) date5_abs = 2020-06-03 06:59:43 PDT (NSIndexSet *) iset1 = 0x00006030000097f0 4 indexes (NSIndexSet *) iset2 = 0x0000603000009820 512 indexes (NSMutableIndexSet *) imset = 0x0000604000008f10 10 indexes (CFTimeZoneRef) cupertino = 0x0000608000001a20 @"America/Los_Angeles" (CFTimeZoneRef) home = 0x0000608000001ba0 @"Europe/Rome" (CFTimeZoneRef) europe = 0x0000608000001d20 @"Europe/Paris" (NSTimeZone *) cupertino_ns = 0x0000608000001a20 @"America/Los_Angeles" (NSTimeZone *) home_ns = 0x0000608000001ba0 @"Europe/Rome" (NSTimeZone *) europe_ns = 0x0000608000001d20 @"Europe/Paris" (CFGregorianUnits) cf_greg_units = 1 years, 3 months, 5 days, 12 hours, 5 minutes 7 seconds (CFGregorianDate) cf_greg_date = @"4/10/1985 18:0:0" (CFRange) cf_range = location=4 length=4 (NSPoint) ns_point = (x = 4, y = 4) (NSRange) ns_range = location=4, length=4 (NSRect) ns_rect = (origin = (x = 1, y = 1), size = (width = 5, height = 5)) (NSRect *) ns_rect_ptr = (origin = (x = 1, y = 1), size = (width = 5, height = 5)) (NSRectArray) ns_rect_arr = ((x = 1, y = 1), (width = 5, height = 5)), ... (NSSize) ns_size = (width = 5, height = 7) (NSSize *) ns_size_ptr = (width = 5, height = 7) (CGSize) cg_size = (width = 1, height = 6) (CGPoint) cg_point = (x = 2, y = 7) (CGRect) cg_rect = (origin = (x = 1, y = 2), size = (width = 7, height = 7)) (RGBColor) rgb_color = red=3 green=56 blue=35 (RGBColor *) rgb_color_ptr = red=3 green=56 blue=35 (Rect) rect = (t=4, l=8, b=4, r=7) (Rect *) rect_ptr = (t=4, l=8, b=4, r=7) (Point) point = (v=7, h=12) (Point *) point_ptr = (v=7, h=12) (HIPoint) hi_point = (x=7, y=12) (HIRect) hi_rect = origin=(x = 3, y = 5) size=(width = 4, height = 6) (SEL) foo_selector = "foo_selector_impl" (CFMutableBitVectorRef) mut_bv = 0x0000604000009490 1110 0110 1011 0000 1101 1010 1000 1111 0011 0101 1101 0001 00 (Molecule *) molecule = 0x0000602000003c50 (Class) myclass = NSValue (Class) myclass2 = NSTaggedPointerString (Class) myclass3 = Molecule (Class) myclass4 = NSMutableArray (Class) myclass5 = nil (NSArray *) components = 0x00006040000094d0 @"3 elements" (NSString *) path = 0x0000604000009510 @"usr/blah/stuff"

Hide Details

Hide Details

Expecting sub string: (RGBColor) rgb_color = red=3 green=56 blue=35 Matched

Hide Details

Expecting sub string: (RGBColor *) rgb_color_ptr = red=3 green=56 blue=35 Matched

Hide Details

Expecting sub string: (HIPoint) hi_point = (x=7, y=12) Matched

Hide Details

Expecting sub string: (HIRect) hi_rect = origin=(x = 3, y = 5) size=(width = 4, height = 6) Matched

Hide Details

<bound method SBProcess.Kill of <lldb.SBProcess; proxy of <Swig Object of type 'lldb::SBProcess *' at 0x1244a0300> >>: success

Hide Details

PASS: LLDB (/Users/buildslave/jenkins/workspace/lldb-cmake-sanitized/lldb-build/bin/clang-11-x86_64) :: test_coreframeworks_and_run_command_dsym (TestDataFormatterObjCCF.ObjCDataFormatterCF) runCmd: settings clear -all output:

Hide Details

runCmd: settings set symbols.enable-external-lookup false output:

Hide Details

runCmd: settings set target.auto-apply-fixits false output:

Hide Details

runCmd: settings set plugin.process.gdb-remote.packet-timeout 60 output:

Hide Details

runCmd: settings set symbols.clang-modules-cache-path "/Users/buildslave/jenkins/workspace/lldb-cmake-sanitized/lldb-build/lldb-test-build.noindex/module-cache-lldb/lldb-api" output:

Hide Details

runCmd: settings set use-color false output:

Hide Details

runCmd: setting set target.prefer-dynamic-value no-dynamic-values output:

Hide Details

runCmd: settings set target.env-vars ASAN_OPTIONS=detect_stack_use_after_return=1 DYLD_INSERT_LIBRARIES=/Users/buildslave/jenkins/workspace/lldb-cmake-sanitized/host-compiler/lib/clang/11.0.0/lib/darwin/libclang_rt.asan_osx_dynamic.dylib output:

Hide Details

runCmd: settings set target.env-vars ASAN_OPTIONS=detect_stack_use_after_return=1 DYLD_INSERT_LIBRARIES=/Users/buildslave/jenkins/workspace/lldb-cmake-sanitized/host-compiler/lib/clang/11.0.0/lib/darwin/libclang_rt.asan_osx_dynamic.dylib output:

Hide Details

runCmd: thread list output: Process 59651 stopped * thread #1: tid = 0x39c35e, 0x000000010000489b a.out`main(argc=1, argv=0x00007ffeefbff670) at main.m:770:4, queue = 'com.apple.main-thread', stop reason = breakpoint 1.1 thread #2: tid = 0x39c3ec, 0x00007fff7d8915be libsystem_kernel.dylib`__workq_kernreturn + 10 thread #3: tid = 0x39c3ef, 0x00007fff7d8915be libsystem_kernel.dylib`__workq_kernreturn + 10

Hide Details

Hide Details

Expecting sub string: stopped Matched

Hide Details

Expecting sub string: stop reason = breakpoint Matched

Hide Details

runCmd: frame variable output: (int) argc = 1 (const char **) argv = 0x00007ffeefbff670 (NSAutoreleasePool *) pool = 0x00006040000016d0 (MyClass *) object = 0x0000603000002ef0 (MyOtherClass *) object2 = 0x0000603000002f20 (NSNumber *) num1 = 0xdc40c830e4b5b6b3 (int)5 (NSNumber *) num2 = 0x0000603000002fb0 (float)3.140000 (NSNumber *) num3 = 0x0000603000002fe0 (double)3.14 (NSNumber *) num4 = 0x0000603000003010 (int128_t)18446744073709551614 (NSNumber *) num5 = 0xdc40c830e4b5f293 (char)65 (NSNumber *) num6 = 0xdc40c830e4b54ca3 (long)255 (NSNumber *) num7 = 0xdc40c830fa3133a3 (long)2000000 (NSNumber *) num8_Y = 0x00007fffa7fe6c30 YES (NSNumber *) num8_N = 0x00007fffa7fe6c40 NO (NSNumber *) num9 = 0x23bf37cf1b313383 (short)-31616 (NSNumber *) num_at1 = 0xdc40c830e4b5bfb3 (int)12 (NSNumber *) num_at2 = 0x23bf37cf1b4a47b3 (int)-12 (NSNumber *) num_at3 = 0x0000603000003040 (double)12.5 (NSNumber *) num_at4 = 0x0000603000003070 (double)-12.5 (NSDecimalNumber *) decimal_number = 0x00006030000030a0 123456 x 10^-10 (NSDecimalNumber *) decimal_number_neg = 0x00006030000030d0 -123456 x 10^10 (NSDecimalNumber *) decimal_one = 0x0000603000003100 1 x 10^0 (NSDecimalNumber *) decimal_zero = 0x0000602000002370 0 (NSDecimalNumber *) decimal_nan = 0x0000602000002390 NaN (NSString *) str0 = 0xdc40c830d18081a1 @"255" (NSString *) str1 = 0x0000606000008ba0 @"A rather short ASCII NSString object is here" (NSString *) str2 = 0x0000606000008c00 @"A rather short UTF8 NSString object is here" (NSString *) str3 = 0x0000000100006170 @"A string made with the at sign is here" (NSString *) str4 = 0x0000606000008c60 @"This is string number 4 right here" (NSRect) ns_rect_4str = (origin = (x = 1, y = 1), size = (width = 5, height = 5)) (NSString *) str5 = 0x0000604000001810 @"{{1, 1}, {5, 5}}" (NSString *) str6 = 0x00006030000031f0 @"1ST" (const unichar [3]) myCharacters = { [0] = U+03c3 u'σ' [1] = U+0078 u'x' [2] = U+0078 u'x' } (NSString *) str7 = 0x0000603000003220 @"σxx" (NSString *) str8 = 0x000061b000000780 @"hasVeryLongExtensionThisTimehasVeryLongExtensionThisTimehasVeryLongExtensionThisTimehasVeryLongExtensionThisTimehasVeryLongExtensionThisTimehasVeryLongExtensionThisTimehasVeryLongExtensionThisTimehasVeryLongExtensionThisTimehasVeryLongExtensionThisTimehasVeryLongExtensionThisTimehasVeryLongExtensionThisTimehasVeryLongExtensionThisTimehasVeryLongExtensionThisTimehasVeryLongExtensionThisTimehasVeryLongExtensionThisTimehasVeryLongExtensionThisTimehasVeryLongExtensionThisTimehasVeryLongExtensionThisTimehasVeryLongExtensionThisTimehasVeryLongExtensionThisTimehasVeryLongExtensionThisTimehasVeryLongExtensionThisTimehasVeryLongExtensionThisTimehasVeryLongExtensionThisTimehasVeryLongExtensionThisTimehasVeryLongExtensionThisTimehasVeryLongExtensionThisTimehasVeryLongExtensionThisTime" (const unichar [54]) myOtherCharacters = { [0] = U+0061 u'a' [1] = U+0020 u' ' [2] = U+0076 u'v' [3] = U+0065 u'e' [4] = U+0072 u'r' [5] = U+0079 u'y' [6] = U+0020 u' ' [7] = U+006d u'm' [8] = U+0075 u'u' [9] = U+0063 u'c' [10] = U+0068 u'h' [11] = U+0020 u' ' [12] = U+0062 u'b' [13] = U+006f u'o' [14] = U+0072 u'r' [15] = U+0069 u'i' [16] = U+006e u'n' [17] = U+0067 u'g' [18] = U+0020 u' ' [19] = U+0074 u't' [20] = U+0061 u'a' [21] = U+0073 u's' [22] = U+006b u'k' [23] = U+0020 u' ' [24] = U+0074 u't' [25] = U+006f u'o' [26] = U+0020 u' ' [27] = U+0077 u'w' [28] = U+0072 u'r' [29] = U+0069 u'i' [30] = U+0074 u't' [31] = U+0065 u'e' [32] = U+0020 u' ' [33] = U+0061 u'a' [34] = U+0020 u' ' [35] = U+0073 u's' [36] = U+0074 u't' [37] = U+0072 u'r' [38] = U+0069 u'i' [39] = U+006e u'n' [40] = U+0067 u'g' [41] = U+0020 u' ' [42] = U+0074 u't' [43] = U+0068 u'h' [44] = U+0069 u'i' [45] = U+0073 u's' [46] = U+0020 u' ' [47] = U+0077 u'w' [48] = U+0061 u'a' [49] = U+0079 u'y' [50] = U+0021 u'!' [51] = U+0021 u'!' [52] = U+03c3 u'σ' [53] = U+0000 u'\0' } (NSString *) str9 = 0x000060d000001be0 @"a very much boring task to write a string this way!!σ\0" (const unichar [2]) myNextCharacters = { [0] = U+03c3 u'σ' [1] = U+0000 u'\0' } (NSString *) str10 = 0x000060c000002200 @"This is a Unicode string σ number 4 right here" (NSString *) str11 = 0x0000603000003250 @"__NSCFString" (NSString *) label1 = 0x0000000100006210 @"Process Name: " (NSString *) label2 = 0x0000000100006230 @"Process Id: " (NSString *) processName = 0xdc40bc458b9bd2c1 @"a.out" (NSString *) processID = 0xdc40f905d28c86c1 @"59651" (NSString *) str12 = 0x0000606000008f00 @"Process Name: a.out Process Id: 59651" (NSString *) strA1 = 0x0000606000008f60 @"A rather short ASCII NSString object is here" (NSString *) strA2 = 0x0000606000008fc0 @"A rather short UTF8 NSString object is here" (NSString *) strA3 = 0x0000000100006170 @"A string made with the at sign is here" (NSString *) strA4 = 0x0000606000009020 @"This is string number 4 right here" (NSString *) strA5 = 0x00006040000019d0 @"{{1, 1}, {5, 5}}" (NSString *) strA6 = 0x00006030000032e0 @"1ST" (NSString *) strA7 = 0x0000603000003310 @"σxx" (NSString *) strA8 = 0x000061b000001580 @"hasVeryLongExtensionThisTimehasVeryLongExtensionThisTimehasVeryLongExtensionThisTimehasVeryLongExtensionThisTimehasVeryLongExtensionThisTimehasVeryLongExtensionThisTimehasVeryLongExtensionThisTimehasVeryLongExtensionThisTimehasVeryLongExtensionThisTimehasVeryLongExtensionThisTimehasVeryLongExtensionThisTimehasVeryLongExtensionThisTimehasVeryLongExtensionThisTimehasVeryLongExtensionThisTimehasVeryLongExtensionThisTimehasVeryLongExtensionThisTimehasVeryLongExtensionThisTimehasVeryLongExtensionThisTimehasVeryLongExtensionThisTimehasVeryLongExtensionThisTimehasVeryLongExtensionThisTimehasVeryLongExtensionThisTimehasVeryLongExtensionThisTimehasVeryLongExtensionThisTimehasVeryLongExtensionThisTimehasVeryLongExtensionThisTimehasVeryLongExtensionThisTimehasVeryLongExtensionThisTime" (NSString *) strA9 = 0x000060d000001e50 @"a very much boring task to write a string this way!!σ\0" (NSString *) strA10 = 0x000060c000002680 @"This is a Unicode string σ number 4 right here" (NSString *) strA11 = 0x0000603000003340 @"__NSCFString" (NSString *) strA12 = 0x0000606000009080 @"Process Name: a.out Process Id: 59651" (NSString *) strB1 = 0x00006060000090e0 @"A rather short ASCII NSString object is here" (NSString *) strB2 = 0x0000606000009140 @"A rather short UTF8 NSString object is here" (NSString *) strB3 = 0x0000000100006170 @"A string made with the at sign is here" (NSString *) strB4 = 0x00006060000091a0 @"This is string number 4 right here" (NSString *) strB5 = 0x0000604000001b10 @"{{1, 1}, {5, 5}}" (NSString *) strB6 = 0x0000603000003370 @"1ST" (NSString *) strB7 = 0x00006030000033a0 @"σxx" (NSString *) strB8 = 0x000061b000002380 @"hasVeryLongExtensionThisTimehasVeryLongExtensionThisTimehasVeryLongExtensionThisTimehasVeryLongExtensionThisTimehasVeryLongExtensionThisTimehasVeryLongExtensionThisTimehasVeryLongExtensionThisTimehasVeryLongExtensionThisTimehasVeryLongExtensionThisTimehasVeryLongExtensionThisTimehasVeryLongExtensionThisTimehasVeryLongExtensionThisTimehasVeryLongExtensionThisTimehasVeryLongExtensionThisTimehasVeryLongExtensionThisTimehasVeryLongExtensionThisTimehasVeryLongExtensionThisTimehasVeryLongExtensionThisTimehasVeryLongExtensionThisTimehasVeryLongExtensionThisTimehasVeryLongExtensionThisTimehasVeryLongExtensionThisTimehasVeryLongExtensionThisTimehasVeryLongExtensionThisTimehasVeryLongExtensionThisTimehasVeryLongExtensionThisTimehasVeryLongExtensionThisTimehasVeryLongExtensionThisTime" (NSString *) strB9 = 0x000060d000001f20 @"a very much boring task to write a string this way!!σ\0" (NSString *) strB10 = 0x000060c000002a40 @"This is a Unicode string σ number 4 right here" (NSString *) strB11 = 0x00006030000033d0 @"__NSCFString" (NSString *) strB12 = 0x0000606000009200 @"Process Name: a.out Process Id: 59651" (NSString *) strC11 = 0x0000603000003400 @"__NSCFString" (NSString *) strC12 = 0x0000606000009260 @"Process Name: a.out Process Id: 59651" (NSString *) strC1 = 0x00006060000092c0 @"A rather short ASCII NSString object is here" (NSString *) strC2 = 0x0000606000009320 @"A rather short UTF8 NSString object is here" (NSString *) strC3 = 0x0000000100006170 @"A string made with the at sign is here" (NSString *) strC4 = 0x0000606000009380 @"This is string number 4 right here" (NSString *) strC5 = 0x0000604000001c90 @"{{1, 1}, {5, 5}}" (NSString *) strC6 = 0x0000603000003430 @"1ST" (NSString *) strC7 = 0x0000603000003460 @"σxx" (NSString *) strC8 = 0x000061b000003180 @"hasVeryLongExtensionThisTimehasVeryLongExtensionThisTimehasVeryLongExtensionThisTimehasVeryLongExtensionThisTimehasVeryLongExtensionThisTimehasVeryLongExtensionThisTimehasVeryLongExtensionThisTimehasVeryLongExtensionThisTimehasVeryLongExtensionThisTimehasVeryLongExtensionThisTimehasVeryLongExtensionThisTimehasVeryLongExtensionThisTimehasVeryLongExtensionThisTimehasVeryLongExtensionThisTimehasVeryLongExtensionThisTimehasVeryLongExtensionThisTimehasVeryLongExtensionThisTimehasVeryLongExtensionThisTimehasVeryLongExtensionThisTimehasVeryLongExtensionThisTimehasVeryLongExtensionThisTimehasVeryLongExtensionThisTimehasVeryLongExtensionThisTimehasVeryLongExtensionThisTimehasVeryLongExtensionThisTimehasVeryLongExtensionThisTimehasVeryLongExtensionThisTimehasVeryLongExtensionThisTime" (NSString *) strC9 = 0x000060d000001ff0 @"a very much boring task to write a string this way!!σ\0" (NSString *) strC10 = 0x000060c000002ec0 @"This is a Unicode string σ number 4 right here" (NSString *) strD11 = 0x0000603000003490 @"__NSCFString" (NSString *) strD12 = 0x00006060000093e0 @"Process Name: a.out Process Id: 59651" (NSString *) eAcute = 0x00006030000034f0 @"é" (NSString *) randomHaziChar = 0x0000603000003550 @"鷅" (NSString *) japanese = 0x00000001000062b0 @"色は匂へど散りぬるを" (NSString *) italian = 0x00000001000062d0 @"L'Italia è una Repubblica democratica, fondata sul lavoro. La sovranità appartiene al popolo, che la esercita nelle forme e nei limiti della Costituzione." (NSString *) french = 0x00000001000062f0 @"Que veut cette horde d'esclaves, De traîtres, de rois conjurés?" (NSString *) german = 0x0000000100006310 @"Über-Ich und aus den Ansprüchen der sozialen Umwelt" (void *[3]) data_set = ([0] = 0x0000606000008ba0, [1] = 0x0000606000008c00, [2] = 0x0000000100006170) (NSString *) hebrew = 0x0000000100006330 @"לילה טוב" (NSArray *) newArray = 0x0000604000001dd0 @"50 elements" (NSDictionary *) newDictionary = 0x0000619000001980 12 key/value pairs (NSDictionary *) newMutableDictionary = 0x0000603000003610 21 key/value pairs (id [4]) cfKeys = { [0] = 0x0000000100006350 [1] = 0x0000000100006610 [2] = 0x0000000100006630 [3] = 0x0000000100006650 } (id [4]) cfValues = { [0] = 0x0000000100006350 [1] = 0x0000000100006610 [2] = 0x0000000100006630 [3] = 0x0000000100006650 } (NSDictionary *) nsDictionary = 0x00006060000095c0 2 key/value pairs (NSDictionary *) nscfDictionary = 0x0000606000009620 4 key/value pairs (CFDictionaryRef) cfDictionaryRef = 0x00006060000095c0 2 key/value pairs (NSAttributedString *) attrString = 0x00006030000036a0 @"hello world from foo" (NSAttributedString *) mutableAttrString = 0x0000603000003790 @"hello world from foo" (NSString *) mutableString = 0x0000604000001f90 @"foo said this string needs to be very long so much longer than whatever other string has been seen ever before by anyone of the mankind that of course this is still not long enough given what foo our friend foo our lovely dearly friend foo desired of us so i am adding more stuff here for the sake of it and for the joy of our friend who is named guess what just foo. hence, dear friend foo, stay safe, your string is now long enough to accommodate your testing need and I will make sure that if not we extend it with even more fuzzy random meaningless words pasted one after the other from a long tiresome friday evening spent working in my office. my office mate went home but I am still randomly typing just for the fun of seeing what happens of the length of a Mutable String in Cocoa if it goes beyond one byte.. so be it, dear foo" (NSString *) mutableGetConst = 0x0000618000000080 @"foo said this string needs to be very long so much longer than whatever other string has been seen ever before by anyone of the mankind that of course this is still not long enough given what foo our friend foo our lovely dearly friend foo desired of us so i am adding more stuff here for the sake of it and for the joy of our friend who is named guess what just foo. hence, dear friend foo, stay safe, your string is now long enough to accommodate your testing need and I will make sure that if not we extend it with even more fuzzy random meaningless words pasted one after the other from a long tiresome friday evening spent working in my office. my office mate went home but I am still randomly typing just for the fun of seeing what happens of the length of a Mutable String in Cocoa if it goes beyond one byte.. so be it, dear foo" (NSData *) immutableData = 0x00006030000037f0 5 bytes (NSData *) mutableData = 0x0000604000002010 14 bytes (unsigned int) concreteLength = 100000 (void *) zeroes1 = 0x0000633000000800 (NSData *) concreteData = 0x0000603000003820 100000 bytes (void *) zeroes2 = 0x000063300001c800 (NSMutableData *) concreteMutableData = 0x0000604000002050 100000 bytes (NSSet *) nsset = 0x0000604000002090 3 elements (NSSet *) nsmutableset = 0x0000603000003880 4 elements (NSSet *) nscfSet = 0x00006040000020d0 2 elements (CFSetRef) cfSetRef = 0x00006040000020d0 2 elements (CFDataRef) data_ref = 0x0000607000003f20 @"5 bytes" (CFMutableDataRef) mutable_data_ref = 0x0000607000003f90 @"5 bytes" (CFMutableStringRef) mutable_string_ref = 0x0000604000002110 @"Wish ya knew" (CFStringRef) cfstring_ref = 0x00000001000066d0 @"HELLO WORLD" (CFArrayRef) cfarray_ref = 0x0000607000004000 @"3 elements" (CFMutableArrayRef) mutable_array_ref = 0x0000604000002150 @"11 elements" (CFBinaryHeapRef) binheap_ref = 0x000060c000003640 @"21 items" (CFURLRef) cfurl_ref = 0x000060b000002350 @"http://www.foo.bar/" (CFURLRef) cfchildurl_ref = 0x00006070000040e0 @"page.html -- http://www.foo.bar/" (CFURLRef) cfgchildurl_ref = 0x0000607000004150 @"?whatever -- http://www.foo.bar/page.html" (NSDictionary *) error_userInfo = 0x0000606000009e60 2 key/value pairs (NSError *) nserror = 0x0000604000002290 domain: @"Foobar" - code: 12 (NSError **) nserrorptr = 0x00007ffeefbff078 domain: @"Foobar" - code: 12 (NSBundle *) bundle_string = 0x0000607000004310 @"/System/Library/Frameworks/Accelerate.framework" (NSBundle *) bundle_url = 0x0000607000004af0 @"/System/Library/Frameworks/Foundation.framework" (NSBundle *) main_bundle = 0x0000607000004cb0 @"/Users/buildslave/jenkins/workspace/lldb-cmake-sanitized/lldb-build/lldb-test-build.noindex/functionalities/data-formatter/data-formatter-objc/TestDataFormatterObjCCF.test_coreframeworks_and_run_command_dwarf" (NSArray *) bundles = 0x0000604000002450 @"1 element" (NSURL *) nsurl0 = 0x0000608000001320 @"file:///Users/buildslave/jenkins/workspace/lldb-cmake-sanitized/lldb-build/lldb-test-build.noindex/functionalities/data-formatter/data-formatter-objc/TestDataFormatterObjCCF.test_coreframeworks_and_run_command_dwarf/" (NSException *) except0 = 0x00006040000024d0 @"First" (NSException *) except1 = 0x0000604000002510 @"Second" (NSException *) except2 = 0x0000604000002550 @"Third" (NSException *) except3 = 0x0000604000002590 @"Fourth" (NSURL *) nsurl = 0x000060b0000028d0 @"http://www.foo.bar" (NSURL *) nsurl2 = 0x0000607000004ee0 @"page.html -- http://www.foo.bar" (NSURL *) nsurl3 = 0x0000607000004f50 @"?whatever -- http://www.foo.bar/page.html" (NSDate *) date1 = 0x1dfd5ccc84b5b399 1985-04-10 18:00:00 UTC (NSDate *) date2 = 0x0000604000008e90 2011-01-01 08:00:00 UTC (NSDate *) date3 = 0x0000602000003bb0 2020-06-03 13:59:59 UTC (NSDate *) date4 = 0x1d8def0b64b5b399 1970-01-02 00:00:00 UTC (NSDate *) date5 = 0x9d828bc2cb35b399 2020-06-03 13:59:59 UTC (CFAbsoluteTime) date1_abs = 1985-04-10 10:00:00 PST (CFAbsoluteTime) date2_abs = 2011-01-01 00:00:00 PST (CFAbsoluteTime) date3_abs = 2020-06-03 06:59:59 PDT (CFAbsoluteTime) date4_abs = 1970-01-01 16:00:00 PST (CFAbsoluteTime) date5_abs = 2020-06-03 06:59:59 PDT (NSIndexSet *) iset1 = 0x0000603000009760 4 indexes (NSIndexSet *) iset2 = 0x0000603000009790 512 indexes (NSMutableIndexSet *) imset = 0x0000604000008f10 10 indexes (CFTimeZoneRef) cupertino = 0x0000608000001a20 @"America/Los_Angeles" (CFTimeZoneRef) home = 0x0000608000001ba0 @"Europe/Rome" (CFTimeZoneRef) europe = 0x0000608000001d20 @"Europe/Paris" (NSTimeZone *) cupertino_ns = 0x0000608000001a20 @"America/Los_Angeles" (NSTimeZone *) home_ns = 0x0000608000001ba0 @"Europe/Rome" (NSTimeZone *) europe_ns = 0x0000608000001d20 @"Europe/Paris" (CFGregorianUnits) cf_greg_units = 1 years, 3 months, 5 days, 12 hours, 5 minutes 7 seconds (CFGregorianDate) cf_greg_date = @"4/10/1985 18:0:0" (CFRange) cf_range = location=4 length=4 (NSPoint) ns_point = (x = 4, y = 4) (NSRange) ns_range = location=4, length=4 (NSRect) ns_rect = (origin = (x = 1, y = 1), size = (width = 5, height = 5)) (NSRect *) ns_rect_ptr = (origin = (x = 1, y = 1), size = (width = 5, height = 5)) (NSRectArray) ns_rect_arr = ((x = 1, y = 1), (width = 5, height = 5)), ... (NSSize) ns_size = (width = 5, height = 7) (NSSize *) ns_size_ptr = (width = 5, height = 7) (CGSize) cg_size = (width = 1, height = 6) (CGPoint) cg_point = (x = 2, y = 7) (CGRect) cg_rect = (origin = (x = 1, y = 2), size = (width = 7, height = 7)) (RGBColor) rgb_color = red=3 green=56 blue=35 (RGBColor *) rgb_color_ptr = red=3 green=56 blue=35 (Rect) rect = (t=4, l=8, b=4, r=7) (Rect *) rect_ptr = (t=4, l=8, b=4, r=7) (Point) point = (v=7, h=12) (Point *) point_ptr = (v=7, h=12) (HIPoint) hi_point = (x=7, y=12) (HIRect) hi_rect = origin=(x = 3, y = 5) size=(width = 4, height = 6) (SEL) foo_selector = "foo_selector_impl" (CFMutableBitVectorRef) mut_bv = 0x0000604000009490 1110 0110 1011 0000 1101 1010 1000 1111 0011 0101 1101 0001 00 (Molecule *) molecule = 0x0000602000003c50 (Class) myclass = NSValue (Class) myclass2 = NSTaggedPointerString (Class) myclass3 = Molecule (Class) myclass4 = NSMutableArray (Class) myclass5 = nil (NSArray *) components = 0x00006040000094d0 @"3 elements" (NSString *) path = 0x0000604000009510 @"usr/blah/stuff"

Hide Details

Hide Details

Expecting sub string: (CFGregorianUnits) cf_greg_units = 1 years, 3 months, 5 days, 12 hours, 5 minutes 7 seconds Matched

Hide Details

Expecting sub string: (CFGregorianDate) cf_greg_date = @"4/10/1985 18:0:0" Matched

Hide Details

Expecting sub string: (CFRange) cf_range = location=4 length=4 Matched

Hide Details

Expecting sub string: (NSPoint) ns_point = (x = 4, y = 4) Matched

Hide Details

Expecting sub string: (NSRange) ns_range = location=4, length=4 Matched

Hide Details

Expecting sub string: (NSRect) ns_rect = (origin = (x = 1, y = 1), size = (width = 5, height = 5)) Matched

Hide Details

Expecting sub string: (NSRectArray) ns_rect_arr = ((x = 1, y = 1), (width = 5, height = 5)), ... Matched

Hide Details

Expecting sub string: (NSSize) ns_size = (width = 5, height = 7) Matched

Hide Details

Expecting sub string: (CGSize) cg_size = (width = 1, height = 6) Matched

Hide Details

Expecting sub string: (CGPoint) cg_point = (x = 2, y = 7) Matched

Hide Details

Expecting sub string: (CGRect) cg_rect = (origin = (x = 1, y = 2), size = (width = 7, height = 7)) Matched

Hide Details

Expecting sub string: (Rect) rect = (t=4, l=8, b=4, r=7) Matched

Hide Details

Expecting sub string: (Rect *) rect_ptr = (t=4, l=8, b=4, r=7) Matched

Hide Details

Expecting sub string: (Point) point = (v=7, h=12) Matched

Hide Details

Expecting sub string: (Point *) point_ptr = (v=7, h=12) Matched

Hide Details

Expecting sub string: (SEL) foo_selector = "foo_selector_impl" Matched

Hide Details

runCmd: frame variable output: (int) argc = 1 (const char **) argv = 0x00007ffeefbff670 (NSAutoreleasePool *) pool = 0x00006040000016d0 (MyClass *) object = 0x0000603000002ef0 (MyOtherClass *) object2 = 0x0000603000002f20 (NSNumber *) num1 = 0xdc40c830e4b5b6b3 (int)5 (NSNumber *) num2 = 0x0000603000002fb0 (float)3.140000 (NSNumber *) num3 = 0x0000603000002fe0 (double)3.14 (NSNumber *) num4 = 0x0000603000003010 (int128_t)18446744073709551614 (NSNumber *) num5 = 0xdc40c830e4b5f293 (char)65 (NSNumber *) num6 = 0xdc40c830e4b54ca3 (long)255 (NSNumber *) num7 = 0xdc40c830fa3133a3 (long)2000000 (NSNumber *) num8_Y = 0x00007fffa7fe6c30 YES (NSNumber *) num8_N = 0x00007fffa7fe6c40 NO (NSNumber *) num9 = 0x23bf37cf1b313383 (short)-31616 (NSNumber *) num_at1 = 0xdc40c830e4b5bfb3 (int)12 (NSNumber *) num_at2 = 0x23bf37cf1b4a47b3 (int)-12 (NSNumber *) num_at3 = 0x0000603000003040 (double)12.5 (NSNumber *) num_at4 = 0x0000603000003070 (double)-12.5 (NSDecimalNumber *) decimal_number = 0x00006030000030a0 123456 x 10^-10 (NSDecimalNumber *) decimal_number_neg = 0x00006030000030d0 -123456 x 10^10 (NSDecimalNumber *) decimal_one = 0x0000603000003100 1 x 10^0 (NSDecimalNumber *) decimal_zero = 0x0000602000002370 0 (NSDecimalNumber *) decimal_nan = 0x0000602000002390 NaN (NSString *) str0 = 0xdc40c830d18081a1 @"255" (NSString *) str1 = 0x0000606000008ba0 @"A rather short ASCII NSString object is here" (NSString *) str2 = 0x0000606000008c00 @"A rather short UTF8 NSString object is here" (NSString *) str3 = 0x0000000100006170 @"A string made with the at sign is here" (NSString *) str4 = 0x0000606000008c60 @"This is string number 4 right here" (NSRect) ns_rect_4str = (origin = (x = 1, y = 1), size = (width = 5, height = 5)) (NSString *) str5 = 0x0000604000001810 @"{{1, 1}, {5, 5}}" (NSString *) str6 = 0x00006030000031f0 @"1ST" (const unichar [3]) myCharacters = { [0] = U+03c3 u'σ' [1] = U+0078 u'x' [2] = U+0078 u'x' } (NSString *) str7 = 0x0000603000003220 @"σxx" (NSString *) str8 = 0x000061b000000780 @"hasVeryLongExtensionThisTimehasVeryLongExtensionThisTimehasVeryLongExtensionThisTimehasVeryLongExtensionThisTimehasVeryLongExtensionThisTimehasVeryLongExtensionThisTimehasVeryLongExtensionThisTimehasVeryLongExtensionThisTimehasVeryLongExtensionThisTimehasVeryLongExtensionThisTimehasVeryLongExtensionThisTimehasVeryLongExtensionThisTimehasVeryLongExtensionThisTimehasVeryLongExtensionThisTimehasVeryLongExtensionThisTimehasVeryLongExtensionThisTimehasVeryLongExtensionThisTimehasVeryLongExtensionThisTimehasVeryLongExtensionThisTimehasVeryLongExtensionThisTimehasVeryLongExtensionThisTimehasVeryLongExtensionThisTimehasVeryLongExtensionThisTimehasVeryLongExtensionThisTimehasVeryLongExtensionThisTimehasVeryLongExtensionThisTimehasVeryLongExtensionThisTimehasVeryLongExtensionThisTime" (const unichar [54]) myOtherCharacters = { [0] = U+0061 u'a' [1] = U+0020 u' ' [2] = U+0076 u'v' [3] = U+0065 u'e' [4] = U+0072 u'r' [5] = U+0079 u'y' [6] = U+0020 u' ' [7] = U+006d u'm' [8] = U+0075 u'u' [9] = U+0063 u'c' [10] = U+0068 u'h' [11] = U+0020 u' ' [12] = U+0062 u'b' [13] = U+006f u'o' [14] = U+0072 u'r' [15] = U+0069 u'i' [16] = U+006e u'n' [17] = U+0067 u'g' [18] = U+0020 u' ' [19] = U+0074 u't' [20] = U+0061 u'a' [21] = U+0073 u's' [22] = U+006b u'k' [23] = U+0020 u' ' [24] = U+0074 u't' [25] = U+006f u'o' [26] = U+0020 u' ' [27] = U+0077 u'w' [28] = U+0072 u'r' [29] = U+0069 u'i' [30] = U+0074 u't' [31] = U+0065 u'e' [32] = U+0020 u' ' [33] = U+0061 u'a' [34] = U+0020 u' ' [35] = U+0073 u's' [36] = U+0074 u't' [37] = U+0072 u'r' [38] = U+0069 u'i' [39] = U+006e u'n' [40] = U+0067 u'g' [41] = U+0020 u' ' [42] = U+0074 u't' [43] = U+0068 u'h' [44] = U+0069 u'i' [45] = U+0073 u's' [46] = U+0020 u' ' [47] = U+0077 u'w' [48] = U+0061 u'a' [49] = U+0079 u'y' [50] = U+0021 u'!' [51] = U+0021 u'!' [52] = U+03c3 u'σ' [53] = U+0000 u'\0' } (NSString *) str9 = 0x000060d000001be0 @"a very much boring task to write a string this way!!σ\0" (const unichar [2]) myNextCharacters = { [0] = U+03c3 u'σ' [1] = U+0000 u'\0' } (NSString *) str10 = 0x000060c000002200 @"This is a Unicode string σ number 4 right here" (NSString *) str11 = 0x0000603000003250 @"__NSCFString" (NSString *) label1 = 0x0000000100006210 @"Process Name: " (NSString *) label2 = 0x0000000100006230 @"Process Id: " (NSString *) processName = 0xdc40bc458b9bd2c1 @"a.out" (NSString *) processID = 0xdc40f905d28c86c1 @"59651" (NSString *) str12 = 0x0000606000008f00 @"Process Name: a.out Process Id: 59651" (NSString *) strA1 = 0x0000606000008f60 @"A rather short ASCII NSString object is here" (NSString *) strA2 = 0x0000606000008fc0 @"A rather short UTF8 NSString object is here" (NSString *) strA3 = 0x0000000100006170 @"A string made with the at sign is here" (NSString *) strA4 = 0x0000606000009020 @"This is string number 4 right here" (NSString *) strA5 = 0x00006040000019d0 @"{{1, 1}, {5, 5}}" (NSString *) strA6 = 0x00006030000032e0 @"1ST" (NSString *) strA7 = 0x0000603000003310 @"σxx" (NSString *) strA8 = 0x000061b000001580 @"hasVeryLongExtensionThisTimehasVeryLongExtensionThisTimehasVeryLongExtensionThisTimehasVeryLongExtensionThisTimehasVeryLongExtensionThisTimehasVeryLongExtensionThisTimehasVeryLongExtensionThisTimehasVeryLongExtensionThisTimehasVeryLongExtensionThisTimehasVeryLongExtensionThisTimehasVeryLongExtensionThisTimehasVeryLongExtensionThisTimehasVeryLongExtensionThisTimehasVeryLongExtensionThisTimehasVeryLongExtensionThisTimehasVeryLongExtensionThisTimehasVeryLongExtensionThisTimehasVeryLongExtensionThisTimehasVeryLongExtensionThisTimehasVeryLongExtensionThisTimehasVeryLongExtensionThisTimehasVeryLongExtensionThisTimehasVeryLongExtensionThisTimehasVeryLongExtensionThisTimehasVeryLongExtensionThisTimehasVeryLongExtensionThisTimehasVeryLongExtensionThisTimehasVeryLongExtensionThisTime" (NSString *) strA9 = 0x000060d000001e50 @"a very much boring task to write a string this way!!σ\0" (NSString *) strA10 = 0x000060c000002680 @"This is a Unicode string σ number 4 right here" (NSString *) strA11 = 0x0000603000003340 @"__NSCFString" (NSString *) strA12 = 0x0000606000009080 @"Process Name: a.out Process Id: 59651" (NSString *) strB1 = 0x00006060000090e0 @"A rather short ASCII NSString object is here" (NSString *) strB2 = 0x0000606000009140 @"A rather short UTF8 NSString object is here" (NSString *) strB3 = 0x0000000100006170 @"A string made with the at sign is here" (NSString *) strB4 = 0x00006060000091a0 @"This is string number 4 right here" (NSString *) strB5 = 0x0000604000001b10 @"{{1, 1}, {5, 5}}" (NSString *) strB6 = 0x0000603000003370 @"1ST" (NSString *) strB7 = 0x00006030000033a0 @"σxx" (NSString *) strB8 = 0x000061b000002380 @"hasVeryLongExtensionThisTimehasVeryLongExtensionThisTimehasVeryLongExtensionThisTimehasVeryLongExtensionThisTimehasVeryLongExtensionThisTimehasVeryLongExtensionThisTimehasVeryLongExtensionThisTimehasVeryLongExtensionThisTimehasVeryLongExtensionThisTimehasVeryLongExtensionThisTimehasVeryLongExtensionThisTimehasVeryLongExtensionThisTimehasVeryLongExtensionThisTimehasVeryLongExtensionThisTimehasVeryLongExtensionThisTimehasVeryLongExtensionThisTimehasVeryLongExtensionThisTimehasVeryLongExtensionThisTimehasVeryLongExtensionThisTimehasVeryLongExtensionThisTimehasVeryLongExtensionThisTimehasVeryLongExtensionThisTimehasVeryLongExtensionThisTimehasVeryLongExtensionThisTimehasVeryLongExtensionThisTimehasVeryLongExtensionThisTimehasVeryLongExtensionThisTimehasVeryLongExtensionThisTime" (NSString *) strB9 = 0x000060d000001f20 @"a very much boring task to write a string this way!!σ\0" (NSString *) strB10 = 0x000060c000002a40 @"This is a Unicode string σ number 4 right here" (NSString *) strB11 = 0x00006030000033d0 @"__NSCFString" (NSString *) strB12 = 0x0000606000009200 @"Process Name: a.out Process Id: 59651" (NSString *) strC11 = 0x0000603000003400 @"__NSCFString" (NSString *) strC12 = 0x0000606000009260 @"Process Name: a.out Process Id: 59651" (NSString *) strC1 = 0x00006060000092c0 @"A rather short ASCII NSString object is here" (NSString *) strC2 = 0x0000606000009320 @"A rather short UTF8 NSString object is here" (NSString *) strC3 = 0x0000000100006170 @"A string made with the at sign is here" (NSString *) strC4 = 0x0000606000009380 @"This is string number 4 right here" (NSString *) strC5 = 0x0000604000001c90 @"{{1, 1}, {5, 5}}" (NSString *) strC6 = 0x0000603000003430 @"1ST" (NSString *) strC7 = 0x0000603000003460 @"σxx" (NSString *) strC8 = 0x000061b000003180 @"hasVeryLongExtensionThisTimehasVeryLongExtensionThisTimehasVeryLongExtensionThisTimehasVeryLongExtensionThisTimehasVeryLongExtensionThisTimehasVeryLongExtensionThisTimehasVeryLongExtensionThisTimehasVeryLongExtensionThisTimehasVeryLongExtensionThisTimehasVeryLongExtensionThisTimehasVeryLongExtensionThisTimehasVeryLongExtensionThisTimehasVeryLongExtensionThisTimehasVeryLongExtensionThisTimehasVeryLongExtensionThisTimehasVeryLongExtensionThisTimehasVeryLongExtensionThisTimehasVeryLongExtensionThisTimehasVeryLongExtensionThisTimehasVeryLongExtensionThisTimehasVeryLongExtensionThisTimehasVeryLongExtensionThisTimehasVeryLongExtensionThisTimehasVeryLongExtensionThisTimehasVeryLongExtensionThisTimehasVeryLongExtensionThisTimehasVeryLongExtensionThisTimehasVeryLongExtensionThisTime" (NSString *) strC9 = 0x000060d000001ff0 @"a very much boring task to write a string this way!!σ\0" (NSString *) strC10 = 0x000060c000002ec0 @"This is a Unicode string σ number 4 right here" (NSString *) strD11 = 0x0000603000003490 @"__NSCFString" (NSString *) strD12 = 0x00006060000093e0 @"Process Name: a.out Process Id: 59651" (NSString *) eAcute = 0x00006030000034f0 @"é" (NSString *) randomHaziChar = 0x0000603000003550 @"鷅" (NSString *) japanese = 0x00000001000062b0 @"色は匂へど散りぬるを" (NSString *) italian = 0x00000001000062d0 @"L'Italia è una Repubblica democratica, fondata sul lavoro. La sovranità appartiene al popolo, che la esercita nelle forme e nei limiti della Costituzione." (NSString *) french = 0x00000001000062f0 @"Que veut cette horde d'esclaves, De traîtres, de rois conjurés?" (NSString *) german = 0x0000000100006310 @"Über-Ich und aus den Ansprüchen der sozialen Umwelt" (void *[3]) data_set = ([0] = 0x0000606000008ba0, [1] = 0x0000606000008c00, [2] = 0x0000000100006170) (NSString *) hebrew = 0x0000000100006330 @"לילה טוב" (NSArray *) newArray = 0x0000604000001dd0 @"50 elements" (NSDictionary *) newDictionary = 0x0000619000001980 12 key/value pairs (NSDictionary *) newMutableDictionary = 0x0000603000003610 21 key/value pairs (id [4]) cfKeys = { [0] = 0x0000000100006350 [1] = 0x0000000100006610 [2] = 0x0000000100006630 [3] = 0x0000000100006650 } (id [4]) cfValues = { [0] = 0x0000000100006350 [1] = 0x0000000100006610 [2] = 0x0000000100006630 [3] = 0x0000000100006650 } (NSDictionary *) nsDictionary = 0x00006060000095c0 2 key/value pairs (NSDictionary *) nscfDictionary = 0x0000606000009620 4 key/value pairs (CFDictionaryRef) cfDictionaryRef = 0x00006060000095c0 2 key/value pairs (NSAttributedString *) attrString = 0x00006030000036a0 @"hello world from foo" (NSAttributedString *) mutableAttrString = 0x0000603000003790 @"hello world from foo" (NSString *) mutableString = 0x0000604000001f90 @"foo said this string needs to be very long so much longer than whatever other string has been seen ever before by anyone of the mankind that of course this is still not long enough given what foo our friend foo our lovely dearly friend foo desired of us so i am adding more stuff here for the sake of it and for the joy of our friend who is named guess what just foo. hence, dear friend foo, stay safe, your string is now long enough to accommodate your testing need and I will make sure that if not we extend it with even more fuzzy random meaningless words pasted one after the other from a long tiresome friday evening spent working in my office. my office mate went home but I am still randomly typing just for the fun of seeing what happens of the length of a Mutable String in Cocoa if it goes beyond one byte.. so be it, dear foo" (NSString *) mutableGetConst = 0x0000618000000080 @"foo said this string needs to be very long so much longer than whatever other string has been seen ever before by anyone of the mankind that of course this is still not long enough given what foo our friend foo our lovely dearly friend foo desired of us so i am adding more stuff here for the sake of it and for the joy of our friend who is named guess what just foo. hence, dear friend foo, stay safe, your string is now long enough to accommodate your testing need and I will make sure that if not we extend it with even more fuzzy random meaningless words pasted one after the other from a long tiresome friday evening spent working in my office. my office mate went home but I am still randomly typing just for the fun of seeing what happens of the length of a Mutable String in Cocoa if it goes beyond one byte.. so be it, dear foo" (NSData *) immutableData = 0x00006030000037f0 5 bytes (NSData *) mutableData = 0x0000604000002010 14 bytes (unsigned int) concreteLength = 100000 (void *) zeroes1 = 0x0000633000000800 (NSData *) concreteData = 0x0000603000003820 100000 bytes (void *) zeroes2 = 0x000063300001c800 (NSMutableData *) concreteMutableData = 0x0000604000002050 100000 bytes (NSSet *) nsset = 0x0000604000002090 3 elements (NSSet *) nsmutableset = 0x0000603000003880 4 elements (NSSet *) nscfSet = 0x00006040000020d0 2 elements (CFSetRef) cfSetRef = 0x00006040000020d0 2 elements (CFDataRef) data_ref = 0x0000607000003f20 @"5 bytes" (CFMutableDataRef) mutable_data_ref = 0x0000607000003f90 @"5 bytes" (CFMutableStringRef) mutable_string_ref = 0x0000604000002110 @"Wish ya knew" (CFStringRef) cfstring_ref = 0x00000001000066d0 @"HELLO WORLD" (CFArrayRef) cfarray_ref = 0x0000607000004000 @"3 elements" (CFMutableArrayRef) mutable_array_ref = 0x0000604000002150 @"11 elements" (CFBinaryHeapRef) binheap_ref = 0x000060c000003640 @"21 items" (CFURLRef) cfurl_ref = 0x000060b000002350 @"http://www.foo.bar/" (CFURLRef) cfchildurl_ref = 0x00006070000040e0 @"page.html -- http://www.foo.bar/" (CFURLRef) cfgchildurl_ref = 0x0000607000004150 @"?whatever -- http://www.foo.bar/page.html" (NSDictionary *) error_userInfo = 0x0000606000009e60 2 key/value pairs (NSError *) nserror = 0x0000604000002290 domain: @"Foobar" - code: 12 (NSError **) nserrorptr = 0x00007ffeefbff078 domain: @"Foobar" - code: 12 (NSBundle *) bundle_string = 0x0000607000004310 @"/System/Library/Frameworks/Accelerate.framework" (NSBundle *) bundle_url = 0x0000607000004af0 @"/System/Library/Frameworks/Foundation.framework" (NSBundle *) main_bundle = 0x0000607000004cb0 @"/Users/buildslave/jenkins/workspace/lldb-cmake-sanitized/lldb-build/lldb-test-build.noindex/functionalities/data-formatter/data-formatter-objc/TestDataFormatterObjCCF.test_coreframeworks_and_run_command_dwarf" (NSArray *) bundles = 0x0000604000002450 @"1 element" (NSURL *) nsurl0 = 0x0000608000001320 @"file:///Users/buildslave/jenkins/workspace/lldb-cmake-sanitized/lldb-build/lldb-test-build.noindex/functionalities/data-formatter/data-formatter-objc/TestDataFormatterObjCCF.test_coreframeworks_and_run_command_dwarf/" (NSException *) except0 = 0x00006040000024d0 @"First" (NSException *) except1 = 0x0000604000002510 @"Second" (NSException *) except2 = 0x0000604000002550 @"Third" (NSException *) except3 = 0x0000604000002590 @"Fourth" (NSURL *) nsurl = 0x000060b0000028d0 @"http://www.foo.bar" (NSURL *) nsurl2 = 0x0000607000004ee0 @"page.html -- http://www.foo.bar" (NSURL *) nsurl3 = 0x0000607000004f50 @"?whatever -- http://www.foo.bar/page.html" (NSDate *) date1 = 0x1dfd5ccc84b5b399 1985-04-10 18:00:00 UTC (NSDate *) date2 = 0x0000604000008e90 2011-01-01 08:00:00 UTC (NSDate *) date3 = 0x0000602000003bb0 2020-06-03 13:59:59 UTC (NSDate *) date4 = 0x1d8def0b64b5b399 1970-01-02 00:00:00 UTC (NSDate *) date5 = 0x9d828bc2cb35b399 2020-06-03 13:59:59 UTC (CFAbsoluteTime) date1_abs = 1985-04-10 10:00:00 PST (CFAbsoluteTime) date2_abs = 2011-01-01 00:00:00 PST (CFAbsoluteTime) date3_abs = 2020-06-03 06:59:59 PDT (CFAbsoluteTime) date4_abs = 1970-01-01 16:00:00 PST (CFAbsoluteTime) date5_abs = 2020-06-03 06:59:59 PDT (NSIndexSet *) iset1 = 0x0000603000009760 4 indexes (NSIndexSet *) iset2 = 0x0000603000009790 512 indexes (NSMutableIndexSet *) imset = 0x0000604000008f10 10 indexes (CFTimeZoneRef) cupertino = 0x0000608000001a20 @"America/Los_Angeles" (CFTimeZoneRef) home = 0x0000608000001ba0 @"Europe/Rome" (CFTimeZoneRef) europe = 0x0000608000001d20 @"Europe/Paris" (NSTimeZone *) cupertino_ns = 0x0000608000001a20 @"America/Los_Angeles" (NSTimeZone *) home_ns = 0x0000608000001ba0 @"Europe/Rome" (NSTimeZone *) europe_ns = 0x0000608000001d20 @"Europe/Paris" (CFGregorianUnits) cf_greg_units = 1 years, 3 months, 5 days, 12 hours, 5 minutes 7 seconds (CFGregorianDate) cf_greg_date = @"4/10/1985 18:0:0" (CFRange) cf_range = location=4 length=4 (NSPoint) ns_point = (x = 4, y = 4) (NSRange) ns_range = location=4, length=4 (NSRect) ns_rect = (origin = (x = 1, y = 1), size = (width = 5, height = 5)) (NSRect *) ns_rect_ptr = (origin = (x = 1, y = 1), size = (width = 5, height = 5)) (NSRectArray) ns_rect_arr = ((x = 1, y = 1), (width = 5, height = 5)), ... (NSSize) ns_size = (width = 5, height = 7) (NSSize *) ns_size_ptr = (width = 5, height = 7) (CGSize) cg_size = (width = 1, height = 6) (CGPoint) cg_point = (x = 2, y = 7) (CGRect) cg_rect = (origin = (x = 1, y = 2), size = (width = 7, height = 7)) (RGBColor) rgb_color = red=3 green=56 blue=35 (RGBColor *) rgb_color_ptr = red=3 green=56 blue=35 (Rect) rect = (t=4, l=8, b=4, r=7) (Rect *) rect_ptr = (t=4, l=8, b=4, r=7) (Point) point = (v=7, h=12) (Point *) point_ptr = (v=7, h=12) (HIPoint) hi_point = (x=7, y=12) (HIRect) hi_rect = origin=(x = 3, y = 5) size=(width = 4, height = 6) (SEL) foo_selector = "foo_selector_impl" (CFMutableBitVectorRef) mut_bv = 0x0000604000009490 1110 0110 1011 0000 1101 1010 1000 1111 0011 0101 1101 0001 00 (Molecule *) molecule = 0x0000602000003c50 (Class) myclass = NSValue (Class) myclass2 = NSTaggedPointerString (Class) myclass3 = Molecule (Class) myclass4 = NSMutableArray (Class) myclass5 = nil (NSArray *) components = 0x00006040000094d0 @"3 elements" (NSString *) path = 0x0000604000009510 @"usr/blah/stuff"

Hide Details

Assertion failed: (tokenKind == tok::kw___bridge_retain), function ParseParenExpression, file /Users/buildslave/jenkins/workspace/lldb-cmake-sanitized/llvm-project/clang/lib/Parse/ParseExpr.cpp, line 2819.

Hide Details

--

Hide Details

******************** PASS: lldb-api :: functionalities/breakpoint/serialize/TestBreakpointSerialization.py (1977 of 2030) UNSUPPORTED: lldb-api :: arm/breakpoint-thumb-codesection/TestBreakpointThumbCodesection.py (1978 of 2030) PASS: lldb-api :: functionalities/backticks/TestBackticksWithoutATarget.py (1979 of 2030) PASS: lldb-unit :: Process/minidump/./LLDBMinidumpTests/MinidumpParserTest.MinidumpDuplicateModuleMinAddress (1980 of 2030) PASS: lldb-api :: lang/c/shared_lib_stripped_symbols/TestSharedLibStrippedSymbols.py (1981 of 2030) PASS: lldb-shell :: SymbolFile/DWARF/split-dwarf-multiple-cu.ll (1982 of 2030) PASS: lldb-unit :: Symbol/./SymbolTests/TestTypeSystemClang.TestOwningModule (1983 of 2030) UNSUPPORTED: lldb-shell :: ObjectFile/ELF/minidebuginfo-set-and-hit-breakpoint.test (1984 of 2030) PASS: lldb-unit :: Utility/./UtilityTests/ArgsTest.Yaml (1985 of 2030) PASS: lldb-shell :: Reproducer/TestWorkingDir.test (1986 of 2030) UNSUPPORTED: lldb-shell :: Register/x86-zmm-read.test (1987 of 2030) PASS: lldb-api :: commands/command/script/import/TestImport.py (1988 of 2030) PASS: lldb-api :: functionalities/reproducers/attach/TestReproducerAttach.py (1989 of 2030) PASS: lldb-unit :: SymbolFile/NativePDB/./SymbolFileNativePDBTests/PDBFPOProgramToDWARFExpressionTests.SingleAssignmentRegisterRef (1990 of 2030) UNSUPPORTED: lldb-api :: python_api/event/TestEvents.py (1991 of 2030) PASS: lldb-api :: commands/expression/char/TestExprsChar.py (1992 of 2030) PASS: lldb-api :: commands/process/attach/attach_denied/TestAttachDenied.py (1993 of 2030) PASS: lldb-unit :: Utility/./UtilityTests/StreamTest.PutHex8 (1994 of 2030) UNSUPPORTED: lldb-api :: commands/register/register/intel_xtended_registers/mpx_bound_violation/TestBoundViolation.py (1995 of 2030) PASS: lldb-unit :: Process/gdb-remote/./ProcessGdbRemoteTests/GDBRemoteClientBaseTest.InterruptNoResponse (1996 of 2030) PASS: lldb-api :: functionalities/data-formatter/data-formatter-python-synth/TestDataFormatterPythonSynth.py (1997 of 2030) PASS: lldb-api :: functionalities/process_crash_info/TestProcessCrashInfo.py (1998 of 2030) PASS: lldb-unit :: Utility/./UtilityTests/StreamTest.SetIndentLevel (1999 of 2030) PASS: lldb-unit :: Utility/./UtilityTests/OptionsWithRawTest.QuotedSuffix (2000 of 2030) PASS: lldb-shell :: ObjectFile/ELF/netbsd-exec-8.99.30-amd64.yaml (2001 of 2030) PASS: lldb-api :: functionalities/data-formatter/stringprinter/TestStringPrinter.py (2002 of 2030) PASS: lldb-api :: tools/lldb-vscode/breakpoint/TestVSCode_setFunctionBreakpoints.py (2003 of 2030) PASS: lldb-api :: lang/c/unions/TestUnionMembers.py (2004 of 2030) PASS: lldb-shell :: Breakpoint/case-sensitive.test (2005 of 2030) PASS: lldb-unit :: ObjectFile/Breakpad/./ObjectFileBreakpadTests/StackWinRecord.parse (2006 of 2030) PASS: lldb-unit :: Utility/./UtilityTests/StreamTeeTest.SetStreamAtIndexOverwrite (2007 of 2030) PASS: lldb-shell :: Reproducer/TestReuseDirectory.test (2008 of 2030) PASS: lldb-api :: functionalities/data-formatter/typedef_array/TestTypedefArray.py (2009 of 2030) UNSUPPORTED: lldb-shell :: SymbolFile/PDB/func-symbols.test (2010 of 2030) UNSUPPORTED: lldb-api :: functionalities/darwin_log/source/info/TestDarwinLogSourceInfo.py (2011 of 2030) PASS: lldb-unit :: Utility/./UtilityTests/FileSpecTest.GetPath (2012 of 2030) PASS: lldb-api :: lang/cpp/incomplete-types/TestCppIncompleteTypes.py (2013 of 2030) PASS: lldb-shell :: ObjectFile/PECOFF/sections-names.yaml (2014 of 2030) PASS: lldb-unit :: Utility/./UtilityTests/StreamTeeTest.Write (2015 of 2030) PASS: lldb-unit :: Utility/./UtilityTests/OptionsWithRawTest.SingleWordSuffix (2016 of 2030) PASS: lldb-api :: commands/expression/persistent_types/TestNestedPersistentTypes.py (2017 of 2030) PASS: lldb-api :: functionalities/testid/TestTestId.py (2018 of 2030) PASS: lldb-unit :: Utility/./UtilityTests/StatusTest.ErrorCodeConstructor (2019 of 2030) PASS: lldb-unit :: Utility/./UtilityTests/StringExtractorTest.GetHexBytesAvail_Partial (2020 of 2030) PASS: lldb-unit :: Process/minidump/./LLDBMinidumpTests/MinidumpParserTest.GetMemory (2021 of 2030) PASS: lldb-api :: lang/cpp/operators/TestCppOperators.py (2022 of 2030) UNSUPPORTED: lldb-shell :: Register/x86-ymm-write.test (2023 of 2030) PASS: lldb-shell :: SymbolFile/Breakpad/line-table-missing-file.test (2024 of 2030) PASS: lldb-api :: commands/expression/rdar42038760/TestScalarURem.py (2025 of 2030) UNSUPPORTED: lldb-api :: iohandler/completion/TestIOHandlerCompletion.py (2026 of 2030) PASS: lldb-unit :: Language/Highlighting/./HighlighterTests/HighlighterTest.ClangCursorPosEndOfLine (2027 of 2030) PASS: lldb-api :: lang/cpp/unicode-literals/TestUnicodeLiterals.py (2028 of 2030) PASS: lldb-api :: functionalities/data-formatter/data-formatter-stl/libcxx/set/TestDataFormatterLibcxxSet.py (2029 of 2030) PASS: lldb-api :: types/TestShortTypeExpr.py (2030 of 2030) Slowest Tests: -------------------------------------------------------------------------- 352.56s: lldb-api :: tools/lldb-server/TestLldbGdbServer.py 264.30s: lldb-api :: lang/cpp/enum_types/TestCPP11EnumTypes.py 254.63s: lldb-api :: api/multithreaded/TestMultithreaded.py 246.23s: lldb-api :: tools/lldb-server/TestGdbRemoteThreadsInStopReply.py 156.62s: lldb-api :: lang/cpp/namespace/TestNamespaceLookup.py 156.49s: lldb-api :: lang/objc/exceptions/TestObjCExceptions.py 140.60s: lldb-api :: lang/objc/real-definition/TestRealDefinition.py 119.96s: lldb-api :: types/TestLongTypesExpr.py 119.13s: lldb-api :: tools/lldb-server/TestGdbRemote_qThreadStopInfo.py 109.44s: lldb-api :: lang/objc/foundation/TestObjCMethods.py 106.52s: lldb-api :: python_api/lldbutil/iter/TestLLDBIterator.py 94.42s: lldb-api :: lang/objc/forward-decl/TestForwardDecl.py 91.67s: lldb-api :: functionalities/gdb_remote_client/TestWasm.py 88.95s: lldb-api :: commands/settings/TestSettings.py 87.93s: lldb-api :: types/TestLongTypes.py 86.79s: lldb-api :: functionalities/data-formatter/compactvectors/TestCompactVectors.py 84.45s: lldb-api :: functionalities/data-formatter/ostypeformatting/TestFormattersOsType.py 82.24s: lldb-api :: api/check_public_api_headers/TestPublicAPIHeaders.py 80.45s: lldb-api :: commands/expression/import-std-module/deque-dbg-info-content/TestDbgInfoContentDequeFromStdModule.py 75.12s: lldb-api :: types/TestIntegerTypeExpr.py

Hide Details

Tests Times: -------------------------------------------------------------------------- [ Range ] :: [ Percentage ] :: [ Count ] -------------------------------------------------------------------------- [340s,360s) :: [ ] :: [ 1/2030] [320s,340s) :: [ ] :: [ 0/2030] [300s,320s) :: [ ] :: [ 0/2030] [280s,300s) :: [ ] :: [ 0/2030] [260s,280s) :: [ ] :: [ 2/2030] [240s,260s) :: [ ] :: [ 1/2030] [220s,240s) :: [ ] :: [ 0/2030] [200s,220s) :: [ ] :: [ 0/2030] [180s,200s) :: [ ] :: [ 0/2030] [160s,180s) :: [ ] :: [ 0/2030] [140s,160s) :: [ ] :: [ 3/2030] [120s,140s) :: [ ] :: [ 2/2030] [100s,120s) :: [ ] :: [ 2/2030] [ 80s,100s) :: [ ] :: [ 8/2030] [ 60s, 80s) :: [ ] :: [ 19/2030] [ 40s, 60s) :: [* ] :: [ 82/2030] [ 20s, 40s) :: [** ] :: [ 132/2030] [ 0s, 20s) :: [*********************************** ] :: [1778/2030] -------------------------------------------------------------------------- ******************** Failing Tests (53): lldb-api :: lang/objc/objc-class-method/TestObjCClassMethod.py lldb-api :: commands/expression/import_builtin_fileid/TestImportBuiltinFileID.py lldb-api :: commands/expression/two-files/TestObjCTypeQueryFromOtherCompileUnit.py lldb-api :: functionalities/data-formatter/data-formatter-objc/TestDataFormatterObjCNSContainer.py lldb-api :: lang/objc/objc-optimized/TestObjcOptimized.py lldb-api :: lang/objc/objc++/TestObjCXX.py lldb-api :: functionalities/data-formatter/synthupdate/TestSyntheticFilterRecompute.py lldb-api :: lang/objc/foundation/TestObjCMethodsNSArray.py lldb-api :: lang/objc/orderedset/TestOrderedSet.py lldb-api :: lang/objc/bitfield_ivars/TestBitfieldIvars.py lldb-api :: lang/objc/foundation/TestObjCMethodsString.py lldb-api :: lang/objc/variadic_methods/TestVariadicMethods.py lldb-api :: lang/objc/forward-decl/TestForwardDecl.py lldb-api :: lang/objc/modules-non-objc-target/TestObjCModulesNonObjCTarget.py lldb-api :: lang/objc/objc-static-method/TestObjCStaticMethod.py lldb-api :: lang/objc/foundation/TestObjCMethodsNSError.py lldb-api :: lang/objc/objc-super/TestObjCSuper.py lldb-api :: commands/expression/po_verbosity/TestPoVerbosity.py lldb-api :: functionalities/data-formatter/data-formatter-objc/TestDataFormatterObjCNSError.py lldb-api :: functionalities/data-formatter/data-formatter-objc/TestDataFormatterObjCExpr.py lldb-api :: lang/objc/objc-property/TestObjCProperty.py lldb-api :: lang/objc/modules/TestObjCModules.py lldb-api :: lang/objc/conflicting-definition/TestConflictingDefinition.py lldb-api :: lang/objc/objc-new-syntax/TestObjCNewSyntaxDictionary.py lldb-api :: lang/objc/objc_direct-methods/TestObjCDirectMethods.py lldb-api :: lang/objc/objc-new-syntax/TestObjCNewSyntaxArray.py lldb-api :: commands/expression/context-object-objc/TestContextObjectObjc.py lldb-api :: commands/expression/namespace_local_var_same_name_obj_c/TestNamespaceLocalVarSameNameObjC.py lldb-api :: commands/expression/persist_objc_pointeetype/TestPersistObjCPointeeType.py lldb-api :: lang/objc/objc-struct-return/TestObjCStructReturn.py lldb-api :: lang/objc/hidden-ivars/TestHiddenIvars.py lldb-api :: lang/objcxx/cxx-bridged-po/TestObjCXXBridgedPO.py lldb-api :: commands/expression/diagnostics/TestExprDiagnostics.py lldb-api :: functionalities/data-formatter/poarray/TestPrintObjectArray.py lldb-api :: lang/objc/print-obj/TestPrintObj.py lldb-api :: commands/expression/call-throws/TestCallThatThrows.py lldb-api :: lang/objc/objc-runtime-ivars/TestRuntimeIvars.py lldb-api :: lang/objc/self/TestObjCSelf.py lldb-api :: lang/objc/rdar-11355592/TestRdar11355592.py lldb-api :: lang/objc/blocks/TestObjCIvarsInBlocks.py lldb-api :: lang/objc/foundation/TestObjCMethods.py lldb-api :: lang/objcxx/objcxx-ivar-vector/TestIvarVector.py lldb-api :: lang/objc/foundation/TestRuntimeTypes.py lldb-api :: functionalities/set-data/TestSetData.py lldb-api :: lang/objc/objc-ivar-protocols/TestIvarProtocols.py lldb-api :: python_api/exprpath_synthetic/TestExprPathSynthetic.py lldb-api :: functionalities/data-formatter/data-formatter-objc/nsindexpath/TestDataFormatterNSIndexPath.py lldb-api :: lang/objc/objc-struct-argument/TestObjCStructArgument.py lldb-api :: lang/objc/unicode-string/TestUnicodeString.py lldb-api :: lang/objc/objc-new-syntax/TestObjCNewSyntaxLiteral.py lldb-api :: lang/objc/radar-9691614/TestObjCMethodReturningBOOL.py lldb-api :: lang/objc/foundation/TestConstStrings.py lldb-api :: functionalities/data-formatter/data-formatter-objc/TestDataFormatterObjCCF.py

Hide Details

Hide Details

Testing Time: 4165.78s Unsupported Tests : 170 Expected Passes : 1801 Expected Failures : 6 Unexpected Failures: 53 FAILED: tools/lldb/test/CMakeFiles/check-lldb-lit cd /Users/buildslave/jenkins/workspace/lldb-cmake-sanitized/lldb-build/tools/lldb/test && /usr/local/Frameworks/Python.framework/Versions/3.7/bin/python3.7 /Users/buildslave/jenkins/workspace/lldb-cmake-sanitized/lldb-build/./bin/llvm-lit -v --time-tests --shuffle --xunit-xml-output=/Users/buildslave/jenkins/workspace/lldb-cmake-sanitized/test/results.xml -v -j 4 --timeout 1200 /Users/buildslave/jenkins/workspace/lldb-cmake-sanitized/lldb-build/tools/lldb/test ninja: build stopped: subcommand failed. Command failed: Command '['/usr/bin/env', 'TERM=vt100', '/usr/local/bin/ninja', '-v', 'check-lldb']' returned non-zero exit status 1. Command: ['/usr/bin/env', 'TERM=vt100', '/usr/local/bin/ninja', '-v', 'check-lldb'] [Pipeline] } [Pipeline] // timeout [Pipeline] } [Pipeline] // stage [Pipeline] stage [Pipeline] { (Declarative: Post Actions) [Pipeline] scanForIssues [Clang (LLVM based)] Sleeping for 5 seconds due to JENKINS-32191... [Clang (LLVM based)] Parsing console log (workspace: '/Users/buildslave/jenkins/workspace/lldb-cmake-sanitized') [Clang (LLVM based)] Successfully parsed console log [Clang (LLVM based)] -> found 2 issues (skipped 0 duplicates) [Clang (LLVM based)] Post processing issues on 'green-dragon-23' with source code encoding 'UTF-8' [Clang (LLVM based)] Creating SCM blamer to obtain author and commit information for affected files [Clang (LLVM based)] Creating SCM miner to obtain statistics for affected repository files [Clang (LLVM based)] Resolving file names for all issues in source directory '/Users/buildslave/jenkins/workspace/lldb-cmake-sanitized' [Clang (LLVM based)] -> resolved paths in source directory (1 found, 0 not found) [Clang (LLVM based)] Resolving module names from module definitions (build.xml, pom.xml, or Manifest.mf files) [Clang (LLVM based)] -> resolved module names for 2 issues [Clang (LLVM based)] Resolving package names (or namespaces) by parsing the affected files [Clang (LLVM based)] -> resolved package names of 1 affected files [Clang (LLVM based)] No filter has been set, publishing all 2 issues [Clang (LLVM based)] Creating fingerprints for all affected code blocks to track issues over different builds [Clang (LLVM based)] -> created fingerprints for 2 issues (skipped 0 issues) [Clang (LLVM based)] Copying affected files to Jenkins' build folder '/Users/Shared/Jenkins/Home/jobs/lldb-cmake-sanitized/builds/1504/files-with-issues' [Clang (LLVM based)] -> 1 copied, 0 not in workspace, 0 not-found, 0 with I/O error [Pipeline] junit Recording test results [Pipeline] } [Pipeline] // stage [Pipeline] } [Pipeline] // withEnv [Pipeline] } [Pipeline] // node [Pipeline] End of Pipeline ERROR: script returned exit code 1 Finished: FAILURE