FailedConsole Output

Skipping 8,265 KB.. Full Log
42  	    // expression (char *)sel_getName(_cmd)
-> 43  	  if (self.descriptionPauses)  // Break here for description test
    	      ^
   44  	    {
   45  	        printf ("\nAbout to sleep.\n");
   46  	        usleep(100000);

Hide Details

Hide Details

Hide Details

runCmd: thread backtrace output: * thread #1, queue = 'com.apple.main-thread', stop reason = breakpoint 3.1 * frame #0: 0x00000001000015f0 a.out`-[MyString description](self=0x0000604000001cd0, _cmd="description") at main.m:43:7 frame #1: 0x0000000100001908 a.out`Test_MyString(program="/Users/buildslave/jenkins/workspace/lldb-cmake-sanitized/lldb-build/lldb-test-build.noindex/lang/objc/foundation/TestObjCMethods.test_break_dwarf/a.out") at main.m:96:37 frame #2: 0x0000000100001b54 a.out`main(argc=1, argv=0x00007ffeefbff6f0) at main.m:133:5 frame #3: 0x00007fff7d757085 libdyld.dylib`start + 1

Hide Details

Hide Details

Expecting sub string: a.out`-[MyString description] Matched

Hide Details

runCmd: process continue output: Process 41805 resuming Process 41805 stopped * thread #1, queue = 'com.apple.main-thread', stop reason = breakpoint 3.1 frame #0: 0x00000001000015f0 a.out`-[MyString description](self=0x0000604000001cd0, _cmd="description") at main.m:43:7 40 { 41 // Set a breakpoint on '-[MyString description]' and test expressions: 42 // expression (char *)sel_getName(_cmd) -> 43 if (self.descriptionPauses) // Break here for description test ^ 44 { 45 printf ("\nAbout to sleep.\n"); 46 usleep(100000);

Hide Details

Hide Details

Hide Details

runCmd: thread backtrace output: * thread #1, queue = 'com.apple.main-thread', stop reason = breakpoint 3.1 * frame #0: 0x00000001000015f0 a.out`-[MyString description](self=0x0000604000001cd0, _cmd="description") at main.m:43:7 frame #1: 0x0000000100001949 a.out`Test_MyString(program="/Users/buildslave/jenkins/workspace/lldb-cmake-sanitized/lldb-build/lldb-test-build.noindex/lang/objc/foundation/TestObjCMethods.test_break_dwarf/a.out") at main.m:98:37 frame #2: 0x0000000100001b54 a.out`main(argc=1, argv=0x00007ffeefbff6f0) at main.m:133:5 frame #3: 0x00007fff7d757085 libdyld.dylib`start + 1

Hide Details

Hide Details

Expecting sub string: a.out`-[MyString description] Matched

Hide Details

runCmd: process continue output: Process 41805 resuming Process 41805 stopped * thread #1, queue = 'com.apple.main-thread', stop reason = breakpoint 4.1 frame #0: 0x00007fff52989cee Foundation`-[NSAutoreleasePool release] Foundation`-[NSAutoreleasePool release]: -> 0x7fff52989cee <+0>: pushq %rbp 0x7fff52989cef <+1>: movq %rsp, %rbp 0x7fff52989cf2 <+4>: pushq %r15 0x7fff52989cf4 <+6>: pushq %r14

Hide Details

Hide Details

Hide Details

runCmd: thread backtrace output: * thread #1, queue = 'com.apple.main-thread', stop reason = breakpoint 4.1 * frame #0: 0x00007fff52989cee Foundation`-[NSAutoreleasePool release] frame #1: 0x0000000100001ba3 a.out`main(argc=1, argv=0x00007ffeefbff6f0) at main.m:139:5 frame #2: 0x00007fff7d757085 libdyld.dylib`start + 1

Hide Details

Hide Details

Expecting sub string: Foundation`-[NSAutoreleasePool release] Matched

Hide Details

<bound method SBProcess.Kill of <lldb.SBProcess; proxy of <Swig Object of type 'lldb::SBProcess *' at 0x10d3fabd0> >>: success

Hide Details

PASS: LLDB (/Users/buildslave/jenkins/workspace/lldb-cmake-sanitized/lldb-build/bin/clang-11-x86_64) :: test_break_dwarf (TestObjCMethods.FoundationTestCase) UNSUPPORTED: LLDB (/Users/buildslave/jenkins/workspace/lldb-cmake-sanitized/lldb-build/bin/clang-11-x86_64) :: test_break_dwo (TestObjCMethods.FoundationTestCase) (test case does not fall in any category of interest for this run) runCmd: settings clear -all output:

Hide Details

runCmd: settings set symbols.enable-external-lookup false output:

Hide Details

runCmd: settings set target.auto-apply-fixits false output:

Hide Details

runCmd: settings set plugin.process.gdb-remote.packet-timeout 60 output:

Hide Details

runCmd: settings set symbols.clang-modules-cache-path "/Users/buildslave/jenkins/workspace/lldb-cmake-sanitized/lldb-build/lldb-test-build.noindex/module-cache-lldb/lldb-api" output:

Hide Details

runCmd: settings set use-color false output:

Hide Details

runCmd: setting set target.prefer-dynamic-value no-dynamic-values output:

Hide Details

runCmd: settings set target.env-vars ASAN_OPTIONS=detect_stack_use_after_return=1 DYLD_INSERT_LIBRARIES=/Users/buildslave/jenkins/workspace/lldb-cmake-sanitized/host-compiler/lib/clang/11.0.0/lib/darwin/libclang_rt.asan_osx_dynamic.dylib output:

Hide Details

runCmd: file /Users/buildslave/jenkins/workspace/lldb-cmake-sanitized/lldb-build/lldb-test-build.noindex/lang/objc/foundation/TestObjCMethods.test_break_gmodules/a.out output: Current executable set to '/Users/buildslave/jenkins/workspace/lldb-cmake-sanitized/lldb-build/lldb-test-build.noindex/lang/objc/foundation/TestObjCMethods.test_break_gmodules/a.out' (x86_64).

Hide Details

Hide Details

runCmd: _regexp-break +[NSString stringWithFormat:] output: Breakpoint 1: where = Foundation`+[NSString stringWithFormat:], address = 0x0000000000004708

Hide Details

Hide Details

Expecting pattern: ^Breakpoint (?P<bpno>[0-9]+): (?P<num_locations>[0-9]+) locations\.$ Not matched

Hide Details

Expecting pattern: ^Breakpoint (?P<bpno>[0-9]+): (?P<num_locations>no) locations \(pending\)\. Not matched

Hide Details

Expecting pattern: ^Breakpoint (?P<bpno>[0-9]+): where = (?P<module>.*)`(?P<symbol>[+\-]{0,1}[^+]+)( \+ (?P<offset>[0-9]+)){0,1}( \[inlined\] (?P<inline_symbol>.*)){0,1} at (?P<file>[^:]+):(?P<line_no>[0-9]+)(?P<column>(:[0-9]+)?), address = (?P<address>0x[0-9a-fA-F]+)$ Not matched

Hide Details

Expecting pattern: ^Breakpoint (?P<bpno>[0-9]+): where = (?P<module>.*)`(?P<symbol>.*)( \+ (?P<offset>[0-9]+)){0,1}, address = (?P<address>0x[0-9a-fA-F]+)$ Matched

Hide Details

runCmd: breakpoint set -n "-[MyString initWithNSString:]" output: Breakpoint 2: where = a.out`-[MyString initWithNSString:] + 20 at main.m:23:16, address = 0x00000001000014c4

Hide Details

Hide Details

Expecting pattern: ^Breakpoint (?P<bpno>[0-9]+): (?P<num_locations>[0-9]+) locations\.$ Not matched

Hide Details

Expecting pattern: ^Breakpoint (?P<bpno>[0-9]+): (?P<num_locations>no) locations \(pending\)\. Not matched

Hide Details

Expecting pattern: ^Breakpoint (?P<bpno>[0-9]+): where = (?P<module>.*)`(?P<symbol>[+\-]{0,1}[^+]+)( \+ (?P<offset>[0-9]+)){0,1}( \[inlined\] (?P<inline_symbol>.*)){0,1} at (?P<file>[^:]+):(?P<line_no>[0-9]+)(?P<column>(:[0-9]+)?), address = (?P<address>0x[0-9a-fA-F]+)$ Matched

Hide Details

runCmd: breakpoint set -S "description" --shlib "a.out" output: Breakpoint 3: where = a.out`-[MyString description] + 16 at main.m:43:7, address = 0x00000001000015f0

Hide Details

Hide Details

Expecting pattern: ^Breakpoint (?P<bpno>[0-9]+): (?P<num_locations>[0-9]+) locations\.$ Not matched

Hide Details

Expecting pattern: ^Breakpoint (?P<bpno>[0-9]+): (?P<num_locations>no) locations \(pending\)\. Not matched

Hide Details

Expecting pattern: ^Breakpoint (?P<bpno>[0-9]+): where = (?P<module>.*)`(?P<symbol>[+\-]{0,1}[^+]+)( \+ (?P<offset>[0-9]+)){0,1}( \[inlined\] (?P<inline_symbol>.*)){0,1} at (?P<file>[^:]+):(?P<line_no>[0-9]+)(?P<column>(:[0-9]+)?), address = (?P<address>0x[0-9a-fA-F]+)$ Matched

Hide Details

runCmd: _regexp-break -[NSAutoreleasePool release] output: Breakpoint 4: where = Foundation`-[NSAutoreleasePool release], address = 0x0000000000003cee

Hide Details

Hide Details

Expecting pattern: ^Breakpoint (?P<bpno>[0-9]+): (?P<num_locations>[0-9]+) locations\.$ Not matched

Hide Details

Expecting pattern: ^Breakpoint (?P<bpno>[0-9]+): (?P<num_locations>no) locations \(pending\)\. Not matched

Hide Details

Expecting pattern: ^Breakpoint (?P<bpno>[0-9]+): where = (?P<module>.*)`(?P<symbol>[+\-]{0,1}[^+]+)( \+ (?P<offset>[0-9]+)){0,1}( \[inlined\] (?P<inline_symbol>.*)){0,1} at (?P<file>[^:]+):(?P<line_no>[0-9]+)(?P<column>(:[0-9]+)?), address = (?P<address>0x[0-9a-fA-F]+)$ Not matched

Hide Details

Expecting pattern: ^Breakpoint (?P<bpno>[0-9]+): where = (?P<module>.*)`(?P<symbol>.*)( \+ (?P<offset>[0-9]+)){0,1}, address = (?P<address>0x[0-9a-fA-F]+)$ Matched

Hide Details

runCmd: run output: Process 42340 stopped * thread #1, queue = 'com.apple.main-thread', stop reason = breakpoint 1.1 frame #0: 0x00007fff5298a708 Foundation`+[NSString stringWithFormat:] Foundation`+[NSString stringWithFormat:]: -> 0x7fff5298a708 <+0>: pushq %rbp 0x7fff5298a709 <+1>: movq %rsp, %rbp 0x7fff5298a70c <+4>: pushq %r15 0x7fff5298a70e <+6>: pushq %r14

Hide Details

Process 42340 launched: '/Users/buildslave/jenkins/workspace/lldb-cmake-sanitized/lldb-build/lldb-test-build.noindex/lang/objc/foundation/TestObjCMethods.test_break_gmodules/a.out' (x86_64)

Hide Details

Hide Details

runCmd: thread backtrace output: * thread #1, queue = 'com.apple.main-thread', stop reason = breakpoint 1.1 * frame #0: 0x00007fff5298a708 Foundation`+[NSString stringWithFormat:] frame #1: 0x00000001000017ab a.out`Test_NSString(program="/Users/buildslave/jenkins/workspace/lldb-cmake-sanitized/lldb-build/lldb-test-build.noindex/lang/objc/foundation/TestObjCMethods.test_break_gmodules/a.out") at main.m:69:21 frame #2: 0x0000000100001b45 a.out`main(argc=1, argv=0x00007ffeefbff6e0) at main.m:132:5 frame #3: 0x00007fff7d757085 libdyld.dylib`start + 1

Hide Details

Hide Details

Expecting sub string: Foundation`+[NSString stringWithFormat:] Matched

Hide Details

runCmd: process continue output: Process 42340 resuming Process 42340 stopped * thread #1, queue = 'com.apple.main-thread', stop reason = breakpoint 1.1 frame #0: 0x00007fff5298a708 Foundation`+[NSString stringWithFormat:] Foundation`+[NSString stringWithFormat:]: -> 0x7fff5298a708 <+0>: pushq %rbp 0x7fff5298a709 <+1>: movq %rsp, %rbp 0x7fff5298a70c <+4>: pushq %r15 0x7fff5298a70e <+6>: pushq %r14

Hide Details

Hide Details

Hide Details

runCmd: thread backtrace output: * thread #1, queue = 'com.apple.main-thread', stop reason = breakpoint 1.1 * frame #0: 0x00007fff5298a708 Foundation`+[NSString stringWithFormat:] frame #1: 0x00000001000018c9 a.out`Test_MyString(program="/Users/buildslave/jenkins/workspace/lldb-cmake-sanitized/lldb-build/lldb-test-build.noindex/lang/objc/foundation/TestObjCMethods.test_break_gmodules/a.out") at main.m:94:21 frame #2: 0x0000000100001b54 a.out`main(argc=1, argv=0x00007ffeefbff6e0) at main.m:133:5 frame #3: 0x00007fff7d757085 libdyld.dylib`start + 1

Hide Details

Hide Details

Expecting sub string: Foundation`+[NSString stringWithFormat:] Matched

Hide Details

runCmd: process continue output: Process 42340 resuming Process 42340 stopped * thread #1, queue = 'com.apple.main-thread', stop reason = breakpoint 2.1 frame #0: 0x00000001000014c4 a.out`-[MyString initWithNSString:](self=0x0000604000001cd0, _cmd="initWithNSString:", string=@"Hello from '/Users/buildslave/jenkins/workspace/lldb-cmake-sanitized/lldb-build/lldb-test-build.noindex/lang/objc/foundation/TestObjCMethods.test_break_gmodules/a.out'") at main.m:23:16 20 21 - (id)initWithNSString:(NSString *)string 22 { -> 23 if (self = [super init]) ^ 24 { 25 str = [NSString stringWithString:string]; 26 date = [NSDate date];

Hide Details

Hide Details

Hide Details

runCmd: thread backtrace output: * thread #1, queue = 'com.apple.main-thread', stop reason = breakpoint 2.1 * frame #0: 0x00000001000014c4 a.out`-[MyString initWithNSString:](self=0x0000604000001cd0, _cmd="initWithNSString:", string=@"Hello from '/Users/buildslave/jenkins/workspace/lldb-cmake-sanitized/lldb-build/lldb-test-build.noindex/lang/objc/foundation/TestObjCMethods.test_break_gmodules/a.out'") at main.m:23:16 frame #1: 0x00000001000018f0 a.out`Test_MyString(program="/Users/buildslave/jenkins/workspace/lldb-cmake-sanitized/lldb-build/lldb-test-build.noindex/lang/objc/foundation/TestObjCMethods.test_break_gmodules/a.out") at main.m:95:20 frame #2: 0x0000000100001b54 a.out`main(argc=1, argv=0x00007ffeefbff6e0) at main.m:133:5 frame #3: 0x00007fff7d757085 libdyld.dylib`start + 1

Hide Details

Hide Details

Expecting sub string: a.out`-[MyString initWithNSString:] Matched

Hide Details

runCmd: process continue output: Process 42340 resuming Process 42340 stopped * thread #1, queue = 'com.apple.main-thread', stop reason = breakpoint 3.1 frame #0: 0x00000001000015f0 a.out`-[MyString description](self=0x0000604000001cd0, _cmd="description") at main.m:43:7 40 { 41 // Set a breakpoint on '-[MyString description]' and test expressions: 42 // expression (char *)sel_getName(_cmd) -> 43 if (self.descriptionPauses) // Break here for description test ^ 44 { 45 printf ("\nAbout to sleep.\n"); 46 usleep(100000);

Hide Details

Hide Details

Hide Details

runCmd: thread backtrace output: * thread #1, queue = 'com.apple.main-thread', stop reason = breakpoint 3.1 * frame #0: 0x00000001000015f0 a.out`-[MyString description](self=0x0000604000001cd0, _cmd="description") at main.m:43:7 frame #1: 0x0000000100001908 a.out`Test_MyString(program="/Users/buildslave/jenkins/workspace/lldb-cmake-sanitized/lldb-build/lldb-test-build.noindex/lang/objc/foundation/TestObjCMethods.test_break_gmodules/a.out") at main.m:96:37 frame #2: 0x0000000100001b54 a.out`main(argc=1, argv=0x00007ffeefbff6e0) at main.m:133:5 frame #3: 0x00007fff7d757085 libdyld.dylib`start + 1

Hide Details

Hide Details

Expecting sub string: a.out`-[MyString description] Matched

Hide Details

runCmd: process continue output: Process 42340 resuming Process 42340 stopped * thread #1, queue = 'com.apple.main-thread', stop reason = breakpoint 3.1 frame #0: 0x00000001000015f0 a.out`-[MyString description](self=0x0000604000001cd0, _cmd="description") at main.m:43:7 40 { 41 // Set a breakpoint on '-[MyString description]' and test expressions: 42 // expression (char *)sel_getName(_cmd) -> 43 if (self.descriptionPauses) // Break here for description test ^ 44 { 45 printf ("\nAbout to sleep.\n"); 46 usleep(100000);

Hide Details

Hide Details

Hide Details

runCmd: thread backtrace output: * thread #1, queue = 'com.apple.main-thread', stop reason = breakpoint 3.1 * frame #0: 0x00000001000015f0 a.out`-[MyString description](self=0x0000604000001cd0, _cmd="description") at main.m:43:7 frame #1: 0x0000000100001949 a.out`Test_MyString(program="/Users/buildslave/jenkins/workspace/lldb-cmake-sanitized/lldb-build/lldb-test-build.noindex/lang/objc/foundation/TestObjCMethods.test_break_gmodules/a.out") at main.m:98:37 frame #2: 0x0000000100001b54 a.out`main(argc=1, argv=0x00007ffeefbff6e0) at main.m:133:5 frame #3: 0x00007fff7d757085 libdyld.dylib`start + 1

Hide Details

Hide Details

Expecting sub string: a.out`-[MyString description] Matched

Hide Details

runCmd: process continue output: Process 42340 resuming Process 42340 stopped * thread #1, queue = 'com.apple.main-thread', stop reason = breakpoint 4.1 frame #0: 0x00007fff52989cee Foundation`-[NSAutoreleasePool release] Foundation`-[NSAutoreleasePool release]: -> 0x7fff52989cee <+0>: pushq %rbp 0x7fff52989cef <+1>: movq %rsp, %rbp 0x7fff52989cf2 <+4>: pushq %r15 0x7fff52989cf4 <+6>: pushq %r14

Hide Details

Hide Details

Hide Details

runCmd: thread backtrace output: * thread #1, queue = 'com.apple.main-thread', stop reason = breakpoint 4.1 * frame #0: 0x00007fff52989cee Foundation`-[NSAutoreleasePool release] frame #1: 0x0000000100001ba3 a.out`main(argc=1, argv=0x00007ffeefbff6e0) at main.m:139:5 frame #2: 0x00007fff7d757085 libdyld.dylib`start + 1

Hide Details

Hide Details

Expecting sub string: Foundation`-[NSAutoreleasePool release] Matched

Hide Details

<bound method SBProcess.Kill of <lldb.SBProcess; proxy of <Swig Object of type 'lldb::SBProcess *' at 0x10d3fa540> >>: success

Hide Details

PASS: LLDB (/Users/buildslave/jenkins/workspace/lldb-cmake-sanitized/lldb-build/bin/clang-11-x86_64) :: test_break_gmodules (TestObjCMethods.FoundationTestCase) runCmd: settings clear -all output:

Hide Details

runCmd: settings set symbols.enable-external-lookup false output:

Hide Details

runCmd: settings set target.auto-apply-fixits false output:

Hide Details

runCmd: settings set plugin.process.gdb-remote.packet-timeout 60 output:

Hide Details

runCmd: settings set symbols.clang-modules-cache-path "/Users/buildslave/jenkins/workspace/lldb-cmake-sanitized/lldb-build/lldb-test-build.noindex/module-cache-lldb/lldb-api" output:

Hide Details

runCmd: settings set use-color false output:

Hide Details

runCmd: setting set target.prefer-dynamic-value no-dynamic-values output:

Hide Details

runCmd: settings set target.env-vars ASAN_OPTIONS=detect_stack_use_after_return=1 DYLD_INSERT_LIBRARIES=/Users/buildslave/jenkins/workspace/lldb-cmake-sanitized/host-compiler/lib/clang/11.0.0/lib/darwin/libclang_rt.asan_osx_dynamic.dylib output:

Hide Details

runCmd: file /Users/buildslave/jenkins/workspace/lldb-cmake-sanitized/lldb-build/lldb-test-build.noindex/lang/objc/foundation/TestObjCMethods.test_data_type_and_expr_dsym/a.out output: Current executable set to '/Users/buildslave/jenkins/workspace/lldb-cmake-sanitized/lldb-build/lldb-test-build.noindex/lang/objc/foundation/TestObjCMethods.test_data_type_and_expr_dsym/a.out' (x86_64).

Hide Details

Hide Details

runCmd: breakpoint set -n "-[MyString description]" output: Breakpoint 1: where = a.out`-[MyString description] + 16 at main.m:43:7, address = 0x00000001000015f0

Hide Details

Hide Details

Expecting pattern: ^Breakpoint (?P<bpno>[0-9]+): (?P<num_locations>[0-9]+) locations\.$ Not matched

Hide Details

Expecting pattern: ^Breakpoint (?P<bpno>[0-9]+): (?P<num_locations>no) locations \(pending\)\. Not matched

Hide Details

Expecting pattern: ^Breakpoint (?P<bpno>[0-9]+): where = (?P<module>.*)`(?P<symbol>[+\-]{0,1}[^+]+)( \+ (?P<offset>[0-9]+)){0,1}( \[inlined\] (?P<inline_symbol>.*)){0,1} at (?P<file>[^:]+):(?P<line_no>[0-9]+)(?P<column>(:[0-9]+)?), address = (?P<address>0x[0-9a-fA-F]+)$ Matched

Hide Details

runCmd: run output: Process 43106 stopped * thread #1, queue = 'com.apple.main-thread', stop reason = breakpoint 1.1 frame #0: 0x00000001000015f0 a.out`-[MyString description](self=0x0000604000001cd0, _cmd="description") at main.m:43:7 40 { 41 // Set a breakpoint on '-[MyString description]' and test expressions: 42 // expression (char *)sel_getName(_cmd) -> 43 if (self.descriptionPauses) // Break here for description test ^ 44 { 45 printf ("\nAbout to sleep.\n"); 46 usleep(100000);

Hide Details

Process 43106 launched: '/Users/buildslave/jenkins/workspace/lldb-cmake-sanitized/lldb-build/lldb-test-build.noindex/lang/objc/foundation/TestObjCMethods.test_data_type_and_expr_dsym/a.out' (x86_64)

Hide Details

Hide Details

runCmd: thread backtrace output: * thread #1, queue = 'com.apple.main-thread', stop reason = breakpoint 1.1 * frame #0: 0x00000001000015f0 a.out`-[MyString description](self=0x0000604000001cd0, _cmd="description") at main.m:43:7 frame #1: 0x0000000100001908 a.out`Test_MyString(program="/Users/buildslave/jenkins/workspace/lldb-cmake-sanitized/lldb-build/lldb-test-build.noindex/lang/objc/foundation/TestObjCMethods.test_data_type_and_expr_dsym/a.out") at main.m:96:37 frame #2: 0x0000000100001b54 a.out`main(argc=1, argv=0x00007ffeefbff6d0) at main.m:133:5 frame #3: 0x00007fff7d757085 libdyld.dylib`start + 1

Hide Details

Hide Details

Expecting sub string: a.out`-[MyString description] Matched

Hide Details

runCmd: image lookup -t NSString output: Best match found in /Users/buildslave/jenkins/workspace/lldb-cmake-sanitized/lldb-build/lldb-test-build.noindex/lang/objc/foundation/TestObjCMethods.test_data_type_and_expr_dsym/a.out: id = {0x7fffffff0000004d}, name = "NSString", byte-size = 8, decl = NSString.h:99, compiler_type = "@interface NSString : NSObject @property(readonly, getter = length, setter = <null selector>) NSUInteger length; @end"

Hide Details

Hide Details

Hide Details

Expecting sub string: name = "NSString" Matched

Hide Details

Expecting sub string: compiler_type = "@interface NSString Matched

Hide Details

runCmd: image lookup -t MyString output: Best match found in /Users/buildslave/jenkins/workspace/lldb-cmake-sanitized/lldb-build/lldb-test-build.noindex/lang/objc/foundation/TestObjCMethods.test_data_type_and_expr_dsym/a.out: id = {0x7fffffff000000a9}, name = "MyString", byte-size = 32, decl = main.m:5, compiler_type = "@interface MyString : MyBase{ NSString * str; NSDate * date; BOOL _desc_pauses; } @property(retain, readwrite, getter = str_property, setter = setStr_property:) NSString *str_property; @property(assign, readwrite, getter = descriptionPauses, setter = setDescriptionPauses:) BOOL descriptionPauses; @end"

Hide Details

Hide Details

Hide Details

Expecting sub string: name = "MyString" Matched

Hide Details

Expecting sub string: compiler_type = "@interface MyString Matched

Hide Details

Expecting sub string: NSString * str; Matched

Hide Details

Expecting sub string: NSDate * date; Matched

Hide Details

runCmd: frame variable --show-types --scope output: ARG: (MyString *) self = 0x0000604000001cd0 ARG: (SEL) _cmd = "description"

Hide Details

Hide Details

Expecting sub string: ARG: (MyString *) self Matched

Hide Details

Expecting pattern: ARG: \(.*\) _cmd Matched

Hide Details

Expecting pattern: (objc_selector *)|(SEL) Matched

Hide Details

runCmd: frame variable *_cmd output: (SEL) *_cmd = ""

Hide Details

Hide Details

runCmd: frame variable --show-types self->str output: (NSString *) self->str = 0x0000611000002980 @"Hello from '/Users/buildslave/jenkins/workspace/lldb-cmake-sanitized/lldb-build/lldb-test-build.noindex/lang/objc/foundation/TestObjCMethods.test_data_type_and_expr_dsym/a.out'"

Hide Details

Hide Details

Expecting start string: (NSString *) self->str Matched

Hide Details

runCmd: frame variable --show-types self->date output: (NSDate *) self->date = 0x00006020000024d0 2020-06-04 04:19:05 UTC

Hide Details

Hide Details

Expecting start string: (NSDate *) self->date Matched

Hide Details

runCmd: frame variable --show-types *self output: (MyString) *self = { (MyBase) MyBase = { (NSObject) NSObject = { (Class) isa = MyString } (int) propertyMovesThings = 0 } (NSString *) str = 0x0000611000002980 @"Hello from '/Users/buildslave/jenkins/workspace/lldb-cmake-sanitized/lldb-build/lldb-test-build.noindex/lang/objc/foundation/TestObjCMethods.test_data_type_and_expr_dsym/a.out'" (NSDate *) date = 0x00006020000024d0 2020-06-04 04:19:05 UTC (BOOL) _desc_pauses = NO }

Hide Details

Hide Details

Expecting sub string: (MyString) *self Matched

Hide Details

Expecting sub string: (NSString *) str Matched

Hide Details

Expecting sub string: (NSDate *) date Matched

Hide Details

runCmd: expression self->isa output: (Class) $0 = MyString

Hide Details

Hide Details

Expecting sub string: Class) Matched

Hide Details

runCmd: expression self->non_existent_member check of return status not required runCmd failed! error: <user expression 1>:1:7: 'MyString' does not have a member named 'non_existent_member' self->non_existent_member ~~~~ ^

Hide Details

Hide Details

Expecting sub string: error: Matched

Hide Details

Expecting sub string: 'MyString' does not have a member named 'non_existent_member' Matched

Hide Details

runCmd: expression self->str output: (NSString *) $1 = 0x0000611000002980 @"Hello from '/Users/buildslave/jenkins/workspace/lldb-cmake-sanitized/lldb-build/lldb-test-build.noindex/lang/objc/foundation/TestObjCMethods.test_data_type_and_expr_dsym/a.out'"

Hide Details

Hide Details

runCmd: expression self->date output: (NSDate *) $2 = 0x00006020000024d0 2020-06-04 04:19:05 UTC

Hide Details

Hide Details

runCmd: breakpoint delete 1 output: 1 breakpoints deleted; 0 breakpoint locations disabled.

Hide Details

Hide Details

runCmd: breakpoint set -f "main.m" -l 97 output: Breakpoint 2: where = a.out`Test_MyString + 156 at main.m:97:5, address = 0x000000010000191c

Hide Details

Hide Details

Expecting pattern: ^Breakpoint (?P<bpno>[0-9]+): (?P<num_locations>[0-9]+) locations\.$ Not matched

Hide Details

Expecting pattern: ^Breakpoint (?P<bpno>[0-9]+): (?P<num_locations>no) locations \(pending\)\. Not matched

Hide Details

Expecting pattern: ^Breakpoint (?P<bpno>[0-9]+): where = (?P<module>.*)`(?P<symbol>[+\-]{0,1}[^+]+)( \+ (?P<offset>[0-9]+)){0,1}( \[inlined\] (?P<inline_symbol>.*)){0,1} at (?P<file>[^:]+):(?P<line_no>[0-9]+)(?P<column>(:[0-9]+)?), address = (?P<address>0x[0-9a-fA-F]+)$ Matched

Hide Details

runCmd: process continue output: Process 43106 resuming Process 43106 stopped * thread #1, queue = 'com.apple.main-thread', stop reason = breakpoint 2.1 frame #0: 0x000000010000191c a.out`Test_MyString(program="/Users/buildslave/jenkins/workspace/lldb-cmake-sanitized/lldb-build/lldb-test-build.noindex/lang/objc/foundation/TestObjCMethods.test_data_type_and_expr_dsym/a.out") at main.m:97:5 94 NSString *str = [NSString stringWithFormat:@"Hello from '%s'", program]; 95 MyString *my = [[MyString alloc] initWithNSString:str]; 96 NSLog(@"MyString instance: %@", [my description]); -> 97 my.descriptionPauses = YES; // Set break point at this line. Test 'expression -o -- my'. ^ 98 NSLog(@"MyString instance: %@", [my description]); 99 } 100

Hide Details

Hide Details

Hide Details

runCmd: expression --object-description -- my output: Hello from '/Users/buildslave/jenkins/workspace/lldb-cmake-sanitized/lldb-build/lldb-test-build.noindex/lang/objc/foundation/TestObjCMethods.test_data_type_and_expr_dsym/a.out' with timestamp: 2020-06-04 04:19:05 +0000

Hide Details

Hide Details

Hide Details

Expecting pattern: Hello from.*a.out.*with timestamp: Matched

Hide Details

<bound method SBProcess.Kill of <lldb.SBProcess; proxy of <Swig Object of type 'lldb::SBProcess *' at 0x10d3fac00> >>: success

Hide Details

PASS: LLDB (/Users/buildslave/jenkins/workspace/lldb-cmake-sanitized/lldb-build/bin/clang-11-x86_64) :: test_data_type_and_expr_dsym (TestObjCMethods.FoundationTestCase) runCmd: settings clear -all output:

Hide Details

runCmd: settings set symbols.enable-external-lookup false output:

Hide Details

runCmd: settings set target.auto-apply-fixits false output:

Hide Details

runCmd: settings set plugin.process.gdb-remote.packet-timeout 60 output:

Hide Details

runCmd: settings set symbols.clang-modules-cache-path "/Users/buildslave/jenkins/workspace/lldb-cmake-sanitized/lldb-build/lldb-test-build.noindex/module-cache-lldb/lldb-api" output:

Hide Details

runCmd: settings set use-color false output:

Hide Details

runCmd: setting set target.prefer-dynamic-value no-dynamic-values output:

Hide Details

runCmd: settings set target.env-vars ASAN_OPTIONS=detect_stack_use_after_return=1 DYLD_INSERT_LIBRARIES=/Users/buildslave/jenkins/workspace/lldb-cmake-sanitized/host-compiler/lib/clang/11.0.0/lib/darwin/libclang_rt.asan_osx_dynamic.dylib output:

Hide Details

runCmd: file /Users/buildslave/jenkins/workspace/lldb-cmake-sanitized/lldb-build/lldb-test-build.noindex/lang/objc/foundation/TestObjCMethods.test_data_type_and_expr_dwarf/a.out output: Current executable set to '/Users/buildslave/jenkins/workspace/lldb-cmake-sanitized/lldb-build/lldb-test-build.noindex/lang/objc/foundation/TestObjCMethods.test_data_type_and_expr_dwarf/a.out' (x86_64).

Hide Details

Hide Details

runCmd: breakpoint set -n "-[MyString description]" output: Breakpoint 1: where = a.out`-[MyString description] + 16 at main.m:43:7, address = 0x00000001000015f0

Hide Details

Hide Details

Expecting pattern: ^Breakpoint (?P<bpno>[0-9]+): (?P<num_locations>[0-9]+) locations\.$ Not matched

Hide Details

Expecting pattern: ^Breakpoint (?P<bpno>[0-9]+): (?P<num_locations>no) locations \(pending\)\. Not matched

Hide Details

Expecting pattern: ^Breakpoint (?P<bpno>[0-9]+): where = (?P<module>.*)`(?P<symbol>[+\-]{0,1}[^+]+)( \+ (?P<offset>[0-9]+)){0,1}( \[inlined\] (?P<inline_symbol>.*)){0,1} at (?P<file>[^:]+):(?P<line_no>[0-9]+)(?P<column>(:[0-9]+)?), address = (?P<address>0x[0-9a-fA-F]+)$ Matched

Hide Details

runCmd: run output: Process 43629 stopped * thread #1, queue = 'com.apple.main-thread', stop reason = breakpoint 1.1 frame #0: 0x00000001000015f0 a.out`-[MyString description](self=0x0000604000001cd0, _cmd="description") at main.m:43:7 40 { 41 // Set a breakpoint on '-[MyString description]' and test expressions: 42 // expression (char *)sel_getName(_cmd) -> 43 if (self.descriptionPauses) // Break here for description test ^ 44 { 45 printf ("\nAbout to sleep.\n"); 46 usleep(100000);

Hide Details

Process 43629 launched: '/Users/buildslave/jenkins/workspace/lldb-cmake-sanitized/lldb-build/lldb-test-build.noindex/lang/objc/foundation/TestObjCMethods.test_data_type_and_expr_dwarf/a.out' (x86_64)

Hide Details

Hide Details

runCmd: thread backtrace output: * thread #1, queue = 'com.apple.main-thread', stop reason = breakpoint 1.1 * frame #0: 0x00000001000015f0 a.out`-[MyString description](self=0x0000604000001cd0, _cmd="description") at main.m:43:7 frame #1: 0x0000000100001908 a.out`Test_MyString(program="/Users/buildslave/jenkins/workspace/lldb-cmake-sanitized/lldb-build/lldb-test-build.noindex/lang/objc/foundation/TestObjCMethods.test_data_type_and_expr_dwarf/a.out") at main.m:96:37 frame #2: 0x0000000100001b54 a.out`main(argc=1, argv=0x00007ffeefbff6d0) at main.m:133:5 frame #3: 0x00007fff7d757085 libdyld.dylib`start + 1

Hide Details

Hide Details

Expecting sub string: a.out`-[MyString description] Matched

Hide Details

runCmd: image lookup -t NSString output: Best match found in /Users/buildslave/jenkins/workspace/lldb-cmake-sanitized/lldb-build/lldb-test-build.noindex/lang/objc/foundation/TestObjCMethods.test_data_type_and_expr_dwarf/a.out: id = {0x10000004d}, name = "NSString", byte-size = 8, decl = NSString.h:99, compiler_type = "@interface NSString : NSObject @property(readonly, getter = length, setter = <null selector>) NSUInteger length; @end"

Hide Details

Hide Details

Hide Details

Expecting sub string: name = "NSString" Matched

Hide Details

Expecting sub string: compiler_type = "@interface NSString Matched

Hide Details

runCmd: image lookup -t MyString output: Best match found in /Users/buildslave/jenkins/workspace/lldb-cmake-sanitized/lldb-build/lldb-test-build.noindex/lang/objc/foundation/TestObjCMethods.test_data_type_and_expr_dwarf/a.out: id = {0x1000000bf}, name = "MyString", byte-size = 32, decl = main.m:5, compiler_type = "@interface MyString : MyBase{ NSString * str; NSDate * date; BOOL _desc_pauses; } @property(retain, readwrite, getter = str_property, setter = setStr_property:) NSString *str_property; @property(assign, readwrite, getter = descriptionPauses, setter = setDescriptionPauses:) BOOL descriptionPauses; @end"

Hide Details

Hide Details

Hide Details

Expecting sub string: name = "MyString" Matched

Hide Details

Expecting sub string: compiler_type = "@interface MyString Matched

Hide Details

Expecting sub string: NSString * str; Matched

Hide Details

Expecting sub string: NSDate * date; Matched

Hide Details

runCmd: frame variable --show-types --scope output: ARG: (MyString *) self = 0x0000604000001cd0 ARG: (SEL) _cmd = "description"

Hide Details

Hide Details

Expecting sub string: ARG: (MyString *) self Matched

Hide Details

Expecting pattern: ARG: \(.*\) _cmd Matched

Hide Details

Expecting pattern: (objc_selector *)|(SEL) Matched

Hide Details

runCmd: frame variable *_cmd output: (SEL) *_cmd = ""

Hide Details

Hide Details

runCmd: frame variable --show-types self->str output: (NSString *) self->str = 0x0000611000002980 @"Hello from '/Users/buildslave/jenkins/workspace/lldb-cmake-sanitized/lldb-build/lldb-test-build.noindex/lang/objc/foundation/TestObjCMethods.test_data_type_and_expr_dwarf/a.out'"

Hide Details

Hide Details

Expecting start string: (NSString *) self->str Matched

Hide Details

runCmd: frame variable --show-types self->date output: (NSDate *) self->date = 0x00006020000024d0 2020-06-04 04:19:27 UTC

Hide Details

Hide Details

Expecting start string: (NSDate *) self->date Matched Assertion failed: (tokenKind == tok::kw___bridge_retain), function ParseParenExpression, file /Users/buildslave/jenkins/workspace/lldb-cmake-sanitized/llvm-project/clang/lib/Parse/ParseExpr.cpp, line 2819.

Hide Details

--

Hide Details

******************** PASS: lldb-unit :: Process/minidump/./LLDBMinidumpTests/RegisterContextMinidump.ConvertMinidumpContext_x86_64 (1269 of 2031) PASS: lldb-unit :: Host/./HostTests/MainLoopTest.DetectsEOF (1270 of 2031) PASS: lldb-shell :: Quit/TestQuitExitCode0.test (1271 of 2031) PASS: lldb-unit :: Utility/./UtilityTests/ArchSpecTest.TestParseMachCPUDashSubtypeTripleSimple (1272 of 2031) PASS: lldb-api :: functionalities/thread/concurrent_events/TestConcurrentDelaySignalBreak.py (1273 of 2031) PASS: lldb-unit :: Utility/./UtilityTests/StatusTest.Formatv (1274 of 2031) PASS: lldb-unit :: Utility/./UtilityTests/ArgsTest.TestMultipleArgs (1275 of 2031) PASS: lldb-unit :: Utility/./UtilityTests/FileSpecTest.PrependPathComponent (1276 of 2031) PASS: lldb-unit :: Utility/./UtilityTests/StructuredDataTest.ParseJSONFromFile (1277 of 2031) PASS: lldb-unit :: Expression/./ExpressionTests/DiagnosticManagerTest.GetStringPreserveOrder (1278 of 2031) PASS: lldb-unit :: Utility/./UtilityTests/StringListTest.LongestCommonPrefixSingleElement (1279 of 2031) PASS: lldb-unit :: Utility/./UtilityTests/FileSpecTest.GetPath (1280 of 2031) PASS: lldb-shell :: ObjectFile/ELF/compressed-sections.yaml (1281 of 2031) UNSUPPORTED: lldb-shell :: Register/x86-64-zmm-read.test (1282 of 2031) PASS: lldb-unit :: Utility/./UtilityTests/StringLexerTest.Next (1283 of 2031) PASS: lldb-unit :: Utility/./UtilityTests/StringListTest.GetSize (1284 of 2031) PASS: lldb-unit :: Symbol/./SymbolTests/LineEntryTest.GetSameLineContiguousAddressRangeNestedInline (1285 of 2031) PASS: lldb-shell :: Reproducer/TestGDBRemoteRepro.test (1286 of 2031) UNSUPPORTED: lldb-api :: lang/objc/ptr_refs/TestPtrRefsObjC.py (1287 of 2031) PASS: lldb-unit :: Utility/./UtilityTests/ArgsTest.ReplaceArgumentAtIndexShort (1288 of 2031) PASS: lldb-unit :: UnwindAssembly/x86/./UnwindAssemblyx86Tests/Testx86AssemblyInspectionEngine.Testi386IgnoredRegisters (1289 of 2031) PASS: lldb-unit :: Symbol/./SymbolTests/DWARFCallFrameInfoTest.Basic_dwarf3 (1290 of 2031) UNSUPPORTED: lldb-api :: arm/breakpoint-thumb-codesection/TestBreakpointThumbCodesection.py (1291 of 2031) PASS: lldb-shell :: Reproducer/TestDiscard.test (1292 of 2031) PASS: lldb-unit :: Utility/./UtilityTests/TimeoutTest.Construction (1293 of 2031) PASS: lldb-unit :: debugserver/./debugserverTests/JSON.Parse (1294 of 2031) PASS: lldb-unit :: Utility/./UtilityTests/StringExtractorTest.GetHexU8_Extra_NoEof (1295 of 2031) PASS: lldb-shell :: Settings/TestEchoCommands.test (1296 of 2031) PASS: lldb-api :: macosx/add-dsym/TestAddDsymMidExecutionCommand.py (1297 of 2031) PASS: lldb-api :: functionalities/thread/concurrent_events/TestConcurrentTwoBreakpointsOneDelaySignal.py (1298 of 2031) PASS: lldb-unit :: Language/Highlighting/./HighlighterTests/HighlighterTest.ClangComments (1299 of 2031) PASS: lldb-api :: lang/c/register_variables/TestRegisterVariables.py (1300 of 2031) PASS: lldb-unit :: Utility/./UtilityTests/UserIDResolver.GetUserName (1301 of 2031) PASS: lldb-unit :: Symbol/./SymbolTests/PostfixExpression.ToDWARF (1302 of 2031) PASS: lldb-api :: commands/expression/weak_symbols/TestWeakSymbols.py (1303 of 2031) PASS: lldb-api :: functionalities/gdb_remote_client/TestGDBRemoteLoad.py (1304 of 2031) PASS: lldb-shell :: Breakpoint/dummy-target.test (1305 of 2031) PASS: lldb-shell :: Register/x86-64-gp-read.test (1306 of 2031) PASS: lldb-unit :: Language/Highlighting/./HighlighterTests/HighlighterTest.ClangCursorPosAfterOtherToken (1307 of 2031) PASS: lldb-unit :: Utility/./UtilityTests/GeneratorTest.GetOrCreate (1308 of 2031) PASS: lldb-api :: functionalities/show_location/TestShowLocationDwarf5.py (1309 of 2031) PASS: lldb-api :: api/check_public_api_headers/TestPublicAPIHeaders.py (1310 of 2031) PASS: lldb-unit :: Expression/./ExpressionTests/DiagnosticManagerTest.GetStringBasic (1311 of 2031) PASS: lldb-api :: lang/objc/objc-dyn-sbtype/TestObjCDynamicSBType.py (1312 of 2031) PASS: lldb-unit :: SymbolFile/NativePDB/./SymbolFileNativePDBTests/PDBFPOProgramToDWARFExpressionTests.InvalidOpUnary (1313 of 2031) PASS: lldb-shell :: SymbolFile/DWARF/dwp.s (1314 of 2031) PASS: lldb-unit :: Utility/./UtilityTests/RangeTest.DoesAdjoinOrIntersect (1315 of 2031) PASS: lldb-api :: commands/expression/save_jit_objects/TestSaveJITObjects.py (1316 of 2031) PASS: lldb-shell :: Process/Optimization.test (1317 of 2031) PASS: lldb-api :: commands/expression/inline-namespace/TestInlineNamespace.py (1318 of 2031) PASS: lldb-api :: lang/objc/objc-baseclass-sbtype/TestObjCBaseClassSBType.py (1319 of 2031) PASS: lldb-shell :: SymbolFile/NativePDB/bitfields.cpp (1320 of 2031) PASS: lldb-unit :: Utility/./UtilityTests/OptionsWithRawTest.UnterminatedQuote (1321 of 2031) PASS: lldb-shell :: Reproducer/TestWorkingDir.test (1322 of 2031) PASS: lldb-unit :: ScriptInterpreter/Python/./ScriptInterpreterPythonTests/PythonDataObjectsTest.TestExceptions (1323 of 2031) PASS: lldb-unit :: Symbol/./SymbolTests/Type.GetTypeScopeAndBasename (1324 of 2031) PASS: lldb-api :: commands/settings/use_source_cache/TestUseSourceCache.py (1325 of 2031) PASS: lldb-unit :: Platform/./LLDBPlatformTests/PlatformDarwinTest.TestParseVersionBuildDir (1326 of 2031) PASS: lldb-unit :: Utility/./UtilityTests/UUIDTest.SetFromStringRef (1327 of 2031) PASS: lldb-unit :: ObjectFile/ELF/./ObjectFileELFTests/ObjectFileELFTest.GetSymtab_NoSymEntryPointArmThumbAddressClass (1328 of 2031) PASS: lldb-api :: commands/expression/pr35310/TestExprsBug35310.py (1329 of 2031) PASS: lldb-unit :: Process/gdb-remote/./ProcessGdbRemoteTests/GDBRemoteCommunicationClientTest.SendStartTracePacket (1330 of 2031) PASS: lldb-unit :: Utility/./UtilityTests/ScalarTest.Equality (1331 of 2031) PASS: lldb-shell :: Process/TestEnvironment.test (1332 of 2031) PASS: lldb-unit :: ScriptInterpreter/Python/./ScriptInterpreterPythonTests/PythonDataObjectsTest.TestPythonStringToStructuredString (1333 of 2031) PASS: lldb-unit :: Utility/./UtilityTests/DataExtractorTest.GetMaxU64_unchecked (1334 of 2031) PASS: lldb-shell :: VSCode/TestOptions.test (1335 of 2031) PASS: lldb-shell :: Breakpoint/jitbp_elf.test (1336 of 2031) PASS: lldb-api :: lang/cpp/unsigned_types/TestUnsignedTypes.py (1337 of 2031) PASS: lldb-api :: commands/frame/var/TestFrameVar.py (1338 of 2031) PASS: lldb-api :: macosx/universal/TestUniversal.py (1339 of 2031) PASS: lldb-shell :: SymbolFile/DWARF/DW_TAG_basic_type_DW_ATE_UTF_nonC.ll (1340 of 2031) UNSUPPORTED: lldb-api :: tools/lldb-server/platform-process-connect/TestPlatformProcessConnect.py (1341 of 2031) PASS: lldb-unit :: ScriptInterpreter/Python/./ScriptInterpreterPythonTests/PythonDataObjectsTest.TestInstanceNameResolutionNoDot (1342 of 2031) PASS: lldb-api :: commands/expression/result_numbering/TestResultNumbering.py (1343 of 2031) PASS: lldb-api :: lang/objc/ivar-IMP/TestObjCiVarIMP.py (1344 of 2031) PASS: lldb-unit :: Utility/./UtilityTests/NameMatchesTest.Contains (1345 of 2031) PASS: lldb-api :: functionalities/data-formatter/varscript_formatting/TestDataFormatterVarScriptFormatting.py (1346 of 2031) PASS: lldb-api :: lang/c/stepping/TestStepAndBreakpoints.py (1347 of 2031) UNSUPPORTED: lldb-api :: python_api/event/TestEvents.py (1348 of 2031) PASS: lldb-api :: commands/expression/unicode-in-variable/TestUnicodeInVariable.py (1349 of 2031) UNSUPPORTED: lldb-api :: benchmarks/startup/TestStartupDelays.py (1350 of 2031) PASS: lldb-shell :: SymbolFile/NativePDB/function-types-classes.cpp (1351 of 2031) PASS: lldb-unit :: Utility/./UtilityTests/StringLexerTest.GetUnlexed (1352 of 2031) PASS: lldb-api :: lang/objc/foundation/TestObjCMethods2.py (1353 of 2031) PASS: lldb-api :: functionalities/breakpoint/breakpoint_conditions/TestBreakpointConditions.py (1354 of 2031) PASS: lldb-shell :: SymbolFile/NativePDB/globals-bss.cpp (1355 of 2031) PASS: lldb-api :: commands/expression/persistent_variables/TestPersistentVariables.py (1356 of 2031) PASS: lldb-api :: functionalities/tail_call_frames/sbapi_support/TestTailCallFrameSBAPI.py (1357 of 2031) PASS: lldb-unit :: Language/Highlighting/./HighlighterTests/HighlighterTest.ClangCursorPos (1358 of 2031) PASS: lldb-unit :: Utility/./UtilityTests/StringExtractorTest.GetU64BigEndian (1359 of 2031) PASS: lldb-api :: lang/c/unicode/TestUnicodeSymbols.py (1360 of 2031) PASS: lldb-unit :: SymbolFile/DWARF/./SymbolFileDWARFTests/SymbolFileDWARFTests.TestAbbrevValidAttrNullForm (1361 of 2031) UNSUPPORTED: lldb-shell :: Unwind/eh-frame-small-fde.test (1362 of 2031) PASS: lldb-api :: functionalities/data-formatter/data-formatter-objc/TestDataFormatterObjCNSData.py (1363 of 2031) PASS: lldb-unit :: Utility/./UtilityTests/StringExtractorTest.GetHexBytes_FullString (1364 of 2031) PASS: lldb-unit :: Symbol/./SymbolTests/TestClangASTImporter.DeportDeclTagDecl (1365 of 2031) PASS: lldb-unit :: Interpreter/./InterpreterTests/OptionArgParserTest.toBoolean (1366 of 2031) PASS: lldb-api :: functionalities/data-formatter/data-formatter-ptr-to-array/TestPtrToArrayFormatting.py (1367 of 2031) PASS: lldb-unit :: Language/Highlighting/./HighlighterTests/HighlighterTest.Colons (1368 of 2031) PASS: lldb-unit :: Utility/./UtilityTests/CompletionRequest.DuplicateFiltering (1369 of 2031) PASS: lldb-unit :: Utility/./UtilityTests/StringListTest.GetMaxStringLengthEqualSize (1370 of 2031) PASS: lldb-unit :: Utility/./UtilityTests/UriParserTest.SchemeHostSeparator2 (1371 of 2031) PASS: lldb-shell :: Watchpoint/SetErrorCases.test (1372 of 2031) PASS: lldb-unit :: Symbol/./SymbolTests/TestClangASTImporter.RecordLayout (1373 of 2031) PASS: lldb-api :: functionalities/gdb_remote_client/TestNoGPacketSupported.py (1374 of 2031) PASS: lldb-api :: functionalities/breakpoint/debugbreak/TestDebugBreak.py (1375 of 2031) UNSUPPORTED: lldb-api :: lang/objc/rdar-12408181/TestRdar12408181.py (1376 of 2031) PASS: lldb-api :: functionalities/reproducers/attach/TestReproducerAttach.py (1377 of 2031) PASS: lldb-shell :: Driver/TestNoUseColor.test (1378 of 2031) PASS: lldb-api :: functionalities/data-formatter/data-formatter-stl/libcxx/queue/TestDataFormatterLibcxxQueue.py (1379 of 2031) PASS: lldb-unit :: Utility/./UtilityTests/StringListTest.AppendListCStringArrayEmpty (1380 of 2031) PASS: lldb-api :: functionalities/target_var/TestTargetVar.py (1381 of 2031) PASS: lldb-api :: functionalities/postmortem/mach-core/TestMachCore.py (1382 of 2031) PASS: lldb-api :: commands/expression/import-std-module/vector-of-vectors/TestVectorOfVectorsFromStdModule.py (1383 of 2031) PASS: lldb-api :: lang/cpp/signed_types/TestSignedTypes.py (1384 of 2031) PASS: lldb-unit :: Utility/./UtilityTests/DeserializerTest.HasData (1385 of 2031) FAIL: lldb-api :: lang/objc/objc++/TestObjCXX.py (1386 of 2031) ******************** TEST 'lldb-api :: lang/objc/objc++/TestObjCXX.py' FAILED ******************** Script: -- /Users/buildslave/jenkins/workspace/lldb-cmake-sanitized/lldb-build/lldb-test-build.noindex/copied-system-python /Users/buildslave/jenkins/workspace/lldb-cmake-sanitized/llvm-project/lldb/test/API/dotest.py --arch x86_64 -s /Users/buildslave/jenkins/workspace/lldb-cmake-sanitized/lldb-build/lldb-test-traces -S nm -u CXXFLAGS -u CFLAGS --codesign-identity lldb_codesign --server /Users/buildslave/jenkins/workspace/lldb-cmake-sanitized/lldb-build/./bin/debugserver --arch x86_64 --build-dir /Users/buildslave/jenkins/workspace/lldb-cmake-sanitized/lldb-build/lldb-test-build.noindex -s=/Users/buildslave/jenkins/workspace/lldb-cmake-sanitized/test/logs -t --env TERM=vt100 --env LLVM_LIBS_DIR=/Users/buildslave/jenkins/workspace/lldb-cmake-sanitized/lldb-build/./lib --inferior-env ASAN_OPTIONS=detect_stack_use_after_return=1 --inferior-env DYLD_INSERT_LIBRARIES=/Users/buildslave/jenkins/workspace/lldb-cmake-sanitized/host-compiler/lib/clang/11.0.0/lib/darwin/libclang_rt.asan_osx_dynamic.dylib --build-dir /Users/buildslave/jenkins/workspace/lldb-cmake-sanitized/lldb-build/lldb-test-build.noindex --lldb-module-cache-dir /Users/buildslave/jenkins/workspace/lldb-cmake-sanitized/lldb-build/lldb-test-build.noindex/module-cache-lldb/lldb-api --clang-module-cache-dir /Users/buildslave/jenkins/workspace/lldb-cmake-sanitized/lldb-build/lldb-test-build.noindex/module-cache-clang/lldb-api --executable /Users/buildslave/jenkins/workspace/lldb-cmake-sanitized/lldb-build/./bin/lldb --compiler /Users/buildslave/jenkins/workspace/lldb-cmake-sanitized/lldb-build/./bin/clang --dsymutil /Users/buildslave/jenkins/workspace/lldb-cmake-sanitized/lldb-build/./bin/dsymutil --filecheck /Users/buildslave/jenkins/workspace/lldb-cmake-sanitized/lldb-build/./bin/FileCheck --lldb-libs-dir /Users/buildslave/jenkins/workspace/lldb-cmake-sanitized/lldb-build/./lib /Users/buildslave/jenkins/workspace/lldb-cmake-sanitized/llvm-project/lldb/test/API/lang/objc/objc++ -p TestObjCXX.py -- Exit Code: -6

Hide Details

Command Output (stdout): -- lldb version 11.0.99 clang revision 01899bb4e41178af6f4cf7b32833e661fe1e3322 llvm revision 01899bb4e41178af6f4cf7b32833e661fe1e3322

Hide Details

-- Command Output (stderr): -- Assertion failed: (tokenKind == tok::kw___bridge_retain), function ParseParenExpression, file /Users/buildslave/jenkins/workspace/lldb-cmake-sanitized/llvm-project/clang/lib/Parse/ParseExpr.cpp, line 2819.

Hide Details

--

Hide Details

******************** PASS: lldb-unit :: Utility/./UtilityTests/SubsystemRAIITest.SubsystemWithErrorFailure (1387 of 2031) PASS: lldb-unit :: Symbol/./SymbolTests/TestClangASTImporter.ImportInvalidType (1388 of 2031) PASS: lldb-unit :: UnwindAssembly/x86/./UnwindAssemblyx86Tests/Testx86AssemblyInspectionEngine.TestPushRBPWithREX (1389 of 2031) PASS: lldb-unit :: Process/minidump/./LLDBMinidumpTests/MinidumpParserTest.GetThreadContext_x86_32_wow64 (1390 of 2031) PASS: lldb-api :: functionalities/data-formatter/boolreference/TestFormattersBoolRefPtr.py (1391 of 2031) PASS: lldb-api :: lang/mixed/TestMixedLanguages.py (1392 of 2031) PASS: lldb-shell :: SymbolFile/DWARF/dir-separator-posix.s (1393 of 2031) PASS: lldb-api :: functionalities/gdb_remote_client/TestJLink6Armv7RegisterDefinition.py (1394 of 2031) PASS: lldb-api :: commands/expression/ignore-artificial-constructors/TestIgnoreArtificialConstructors.py (1395 of 2031) PASS: lldb-unit :: Utility/./UtilityTests/StatusTest.ErrorConstructor (1396 of 2031) PASS: lldb-unit :: UnwindAssembly/x86/./UnwindAssemblyx86Tests/Testx86AssemblyInspectionEngine.TestPopRBP (1397 of 2031) PASS: lldb-api :: lang/objc/foundation/TestObjectDescriptionAPI.py (1398 of 2031) PASS: lldb-unit :: ScriptInterpreter/Python/./ScriptInterpreterPythonTests/PythonDataObjectsTest.TestRun (1399 of 2031) PASS: lldb-api :: lang/objc/direct-dispatch-step/TestObjCDirectDispatchStepping.py (1400 of 2031) PASS: lldb-api :: functionalities/data-formatter/data-formatter-globals/TestDataFormatterGlobals.py (1401 of 2031) PASS: lldb-unit :: Utility/./UtilityTests/StringExtractorTest.DecodeHexU8_Underflow2 (1402 of 2031) PASS: lldb-api :: functionalities/process_group/TestChangeProcessGroup.py (1403 of 2031) PASS: lldb-unit :: Utility/./UtilityTests/ArchSpecTest.Compatibility (1404 of 2031) PASS: lldb-api :: commands/expression/import-std-module/list/TestListFromStdModule.py (1405 of 2031) PASS: lldb-shell :: ObjectFile/PECOFF/uuid.yaml (1406 of 2031) FAIL: lldb-api :: commands/expression/two-files/TestObjCTypeQueryFromOtherCompileUnit.py (1407 of 2031) ******************** TEST 'lldb-api :: commands/expression/two-files/TestObjCTypeQueryFromOtherCompileUnit.py' FAILED ******************** Script: -- /Users/buildslave/jenkins/workspace/lldb-cmake-sanitized/lldb-build/lldb-test-build.noindex/copied-system-python /Users/buildslave/jenkins/workspace/lldb-cmake-sanitized/llvm-project/lldb/test/API/dotest.py --arch x86_64 -s /Users/buildslave/jenkins/workspace/lldb-cmake-sanitized/lldb-build/lldb-test-traces -S nm -u CXXFLAGS -u CFLAGS --codesign-identity lldb_codesign --server /Users/buildslave/jenkins/workspace/lldb-cmake-sanitized/lldb-build/./bin/debugserver --arch x86_64 --build-dir /Users/buildslave/jenkins/workspace/lldb-cmake-sanitized/lldb-build/lldb-test-build.noindex -s=/Users/buildslave/jenkins/workspace/lldb-cmake-sanitized/test/logs -t --env TERM=vt100 --env LLVM_LIBS_DIR=/Users/buildslave/jenkins/workspace/lldb-cmake-sanitized/lldb-build/./lib --inferior-env ASAN_OPTIONS=detect_stack_use_after_return=1 --inferior-env DYLD_INSERT_LIBRARIES=/Users/buildslave/jenkins/workspace/lldb-cmake-sanitized/host-compiler/lib/clang/11.0.0/lib/darwin/libclang_rt.asan_osx_dynamic.dylib --build-dir /Users/buildslave/jenkins/workspace/lldb-cmake-sanitized/lldb-build/lldb-test-build.noindex --lldb-module-cache-dir /Users/buildslave/jenkins/workspace/lldb-cmake-sanitized/lldb-build/lldb-test-build.noindex/module-cache-lldb/lldb-api --clang-module-cache-dir /Users/buildslave/jenkins/workspace/lldb-cmake-sanitized/lldb-build/lldb-test-build.noindex/module-cache-clang/lldb-api --executable /Users/buildslave/jenkins/workspace/lldb-cmake-sanitized/lldb-build/./bin/lldb --compiler /Users/buildslave/jenkins/workspace/lldb-cmake-sanitized/lldb-build/./bin/clang --dsymutil /Users/buildslave/jenkins/workspace/lldb-cmake-sanitized/lldb-build/./bin/dsymutil --filecheck /Users/buildslave/jenkins/workspace/lldb-cmake-sanitized/lldb-build/./bin/FileCheck --lldb-libs-dir /Users/buildslave/jenkins/workspace/lldb-cmake-sanitized/lldb-build/./lib /Users/buildslave/jenkins/workspace/lldb-cmake-sanitized/llvm-project/lldb/test/API/commands/expression/two-files -p TestObjCTypeQueryFromOtherCompileUnit.py -- Exit Code: -6

Hide Details

Command Output (stdout): -- lldb version 11.0.99 clang revision 01899bb4e41178af6f4cf7b32833e661fe1e3322 llvm revision 01899bb4e41178af6f4cf7b32833e661fe1e3322

Hide Details

-- Command Output (stderr): -- Assertion failed: (tokenKind == tok::kw___bridge_retain), function ParseParenExpression, file /Users/buildslave/jenkins/workspace/lldb-cmake-sanitized/llvm-project/clang/lib/Parse/ParseExpr.cpp, line 2819.

Hide Details

--

Hide Details

******************** PASS: lldb-unit :: Utility/./UtilityTests/UserIDResolver.GetGroupName (1408 of 2031) PASS: lldb-unit :: Expression/./ExpressionTests/ClangHostTest.ComputeClangResourceDirectory (1409 of 2031) PASS: lldb-api :: commands/frame/diagnose/dereference-this/TestDiagnoseDereferenceThis.py (1410 of 2031) PASS: lldb-shell :: SymbolFile/DWARF/DW_OP_piece-struct.s (1411 of 2031) PASS: lldb-api :: functionalities/type_lookup/TestTypeLookup.py (1412 of 2031) PASS: lldb-shell :: ObjectFile/MachO/lc_version_min.yaml (1413 of 2031) PASS: lldb-api :: functionalities/signal/handle-abrt/TestHandleAbort.py (1414 of 2031) PASS: lldb-unit :: Utility/./UtilityTests/TimerTest.CategoryTimes2 (1415 of 2031) PASS: lldb-unit :: Host/./HostTests/NativeProcessProtocolTest.SetBreakpointFailWrite (1416 of 2031) PASS: lldb-shell :: Breakpoint/debug_rnglist_basic.test (1417 of 2031) PASS: lldb-unit :: Utility/./UtilityTests/RangeTest.ContainsAddr (1418 of 2031) PASS: lldb-api :: functionalities/thread/concurrent_events/TestConcurrentDelayedCrashWithBreakpointSignal.py (1419 of 2031) PASS: lldb-unit :: Utility/./UtilityTests/RangeTest.Slide (1420 of 2031) PASS: lldb-unit :: Utility/./UtilityTests/RangeDataVector.FindEntryThatContains_Overlap (1421 of 2031) UNSUPPORTED: lldb-shell :: SymbolFile/PDB/udt-layout.test (1422 of 2031) UNSUPPORTED: lldb-api :: benchmarks/libcxxmap/TestBenchmarkLibcxxMap.py (1423 of 2031) PASS: lldb-unit :: Utility/./UtilityTests/StringLexerTest.NextIf (1424 of 2031) PASS: lldb-unit :: Utility/./UtilityTests/ProcessInfoTest.Constructor (1425 of 2031) PASS: lldb-shell :: ObjectFile/ELF/duplicate-section.yaml (1426 of 2031) PASS: lldb-unit :: Utility/./UtilityTests/AnsiTerminal.Twice (1427 of 2031) PASS: lldb-shell :: Reproducer/TestRelativePath.test (1428 of 2031) PASS: lldb-unit :: Utility/./UtilityTests/Flags.AnyClear (1429 of 2031) PASS: lldb-api :: python_api/objc_type/TestObjCType.py (1430 of 2031) PASS: lldb-unit :: Utility/./UtilityTests/FileSpecTest.Match (1431 of 2031) PASS: lldb-unit :: DataFormatter/./LLDBFormatterTests/FormatManagerTests.CompatibleLangs (1432 of 2031) PASS: lldb-unit :: Utility/./UtilityTests/ScalarTest.GetBytes (1433 of 2031) PASS: lldb-unit :: Utility/./UtilityTests/StreamTest.PutULEB128 (1434 of 2031) PASS: lldb-api :: lang/cpp/enum_types/TestCPP11EnumTypes.py (1435 of 2031) PASS: lldb-api :: lang/cpp/class_types/TestClassTypes.py (1436 of 2031) UNSUPPORTED: lldb-api :: lang/objc/foundation/TestFoundationDisassembly.py (1437 of 2031) PASS: lldb-unit :: Utility/./UtilityTests/DataExtractorTest.GetCStrUnterminated (1438 of 2031) UNSUPPORTED: lldb-api :: python_api/disassemble-raw-data/TestDisassemble_VST1_64.py (1439 of 2031) PASS: lldb-shell :: Process/UnsupportedLanguage.test (1440 of 2031) UNSUPPORTED: lldb-api :: functionalities/darwin_log/filter/exact_match/message/TestDarwinLogFilterMatchMessage.py (1441 of 2031) PASS: lldb-shell :: Breakpoint/implicit_const_form_support.test (1442 of 2031) PASS: lldb-unit :: Utility/./UtilityTests/BinaryStreamTest.PutSLEB128EightBytes (1443 of 2031) PASS: lldb-api :: functionalities/data-formatter/array_typedef/TestArrayTypedef.py (1444 of 2031) PASS: lldb-api :: macosx/find-dsym/bundle-with-dot-in-filename/TestBundleWithDotInFilename.py (1445 of 2031) UNSUPPORTED: lldb-api :: functionalities/data-formatter/data-formatter-stl/libstdcpp/vbool/TestDataFormatterStdVBool.py (1446 of 2031) PASS: lldb-unit :: Process/gdb-remote/./ProcessGdbRemoteTests/GDBRemoteCommunicationClientTest.ReadRegister (1447 of 2031) PASS: lldb-api :: source-manager/TestSourceManager.py (1448 of 2031) PASS: lldb-api :: tools/lldb-server/TestGdbRemoteAttach.py (1449 of 2031) PASS: lldb-unit :: Language/Highlighting/./HighlighterTests/HighlighterTest.DefaultHighlighterWithCursor (1450 of 2031) PASS: lldb-api :: lang/cpp/diamond/TestDiamond.py (1451 of 2031) PASS: lldb-api :: lang/cpp/breakpoint-commands/TestCPPBreakpointCommands.py (1452 of 2031) PASS: lldb-unit :: Process/gdb-remote/./ProcessGdbRemoteTests/GDBRemoteCommunicationClientTest.SendGetMetaDataPacket (1453 of 2031) PASS: lldb-unit :: Utility/./UtilityTests/StringExtractorTest.GetHexBytesAvail_OddPair (1454 of 2031) FAIL: lldb-api :: lang/objc/conflicting-definition/TestConflictingDefinition.py (1455 of 2031) ******************** TEST 'lldb-api :: lang/objc/conflicting-definition/TestConflictingDefinition.py' FAILED ******************** Script: -- /Users/buildslave/jenkins/workspace/lldb-cmake-sanitized/lldb-build/lldb-test-build.noindex/copied-system-python /Users/buildslave/jenkins/workspace/lldb-cmake-sanitized/llvm-project/lldb/test/API/dotest.py --arch x86_64 -s /Users/buildslave/jenkins/workspace/lldb-cmake-sanitized/lldb-build/lldb-test-traces -S nm -u CXXFLAGS -u CFLAGS --codesign-identity lldb_codesign --server /Users/buildslave/jenkins/workspace/lldb-cmake-sanitized/lldb-build/./bin/debugserver --arch x86_64 --build-dir /Users/buildslave/jenkins/workspace/lldb-cmake-sanitized/lldb-build/lldb-test-build.noindex -s=/Users/buildslave/jenkins/workspace/lldb-cmake-sanitized/test/logs -t --env TERM=vt100 --env LLVM_LIBS_DIR=/Users/buildslave/jenkins/workspace/lldb-cmake-sanitized/lldb-build/./lib --inferior-env ASAN_OPTIONS=detect_stack_use_after_return=1 --inferior-env DYLD_INSERT_LIBRARIES=/Users/buildslave/jenkins/workspace/lldb-cmake-sanitized/host-compiler/lib/clang/11.0.0/lib/darwin/libclang_rt.asan_osx_dynamic.dylib --build-dir /Users/buildslave/jenkins/workspace/lldb-cmake-sanitized/lldb-build/lldb-test-build.noindex --lldb-module-cache-dir /Users/buildslave/jenkins/workspace/lldb-cmake-sanitized/lldb-build/lldb-test-build.noindex/module-cache-lldb/lldb-api --clang-module-cache-dir /Users/buildslave/jenkins/workspace/lldb-cmake-sanitized/lldb-build/lldb-test-build.noindex/module-cache-clang/lldb-api --executable /Users/buildslave/jenkins/workspace/lldb-cmake-sanitized/lldb-build/./bin/lldb --compiler /Users/buildslave/jenkins/workspace/lldb-cmake-sanitized/lldb-build/./bin/clang --dsymutil /Users/buildslave/jenkins/workspace/lldb-cmake-sanitized/lldb-build/./bin/dsymutil --filecheck /Users/buildslave/jenkins/workspace/lldb-cmake-sanitized/lldb-build/./bin/FileCheck --lldb-libs-dir /Users/buildslave/jenkins/workspace/lldb-cmake-sanitized/lldb-build/./lib /Users/buildslave/jenkins/workspace/lldb-cmake-sanitized/llvm-project/lldb/test/API/lang/objc/conflicting-definition -p TestConflictingDefinition.py -- Exit Code: -6

Hide Details

Command Output (stdout): -- lldb version 11.0.99 clang revision 01899bb4e41178af6f4cf7b32833e661fe1e3322 llvm revision 01899bb4e41178af6f4cf7b32833e661fe1e3322

Hide Details

-- Command Output (stderr): -- Assertion failed: (tokenKind == tok::kw___bridge_retain), function ParseParenExpression, file /Users/buildslave/jenkins/workspace/lldb-cmake-sanitized/llvm-project/clang/lib/Parse/ParseExpr.cpp, line 2819.

Hide Details

--

Hide Details

******************** PASS: lldb-unit :: Utility/./UtilityTests/SerializationRountripTest.SerializeDeserializeObjectReference (1456 of 2031) PASS: lldb-api :: functionalities/pre_run_dylibs/TestPreRunDylibs.py (1457 of 2031) UNSUPPORTED: lldb-api :: functionalities/darwin_log/source/debug/TestDarwinLogSourceDebug.py (1458 of 2031) PASS: lldb-api :: functionalities/postmortem/wow64_minidump/TestWow64MiniDump.py (1459 of 2031) PASS: lldb-unit :: Language/Highlighting/./HighlighterTests/HighlighterTest.ClangCursorOutOfBounds (1460 of 2031) PASS: lldb-shell :: SymbolFile/Breakpad/symtab.test (1461 of 2031) PASS: lldb-api :: commands/breakpoint/set/func-regex/TestBreakpointRegexError.py (1462 of 2031) PASS: lldb-unit :: SymbolFile/NativePDB/./SymbolFileNativePDBTests/PDBFPOProgramToDWARFExpressionTests.UnresolvedRegisterAssignmentReference (1463 of 2031) PASS: lldb-shell :: SymbolFile/DWARF/find-method-local-struct.cpp (1464 of 2031) PASS: lldb-unit :: Language/Highlighting/./HighlighterTests/HighlighterTest.ClangOperators (1465 of 2031) PASS: lldb-unit :: Utility/./UtilityTests/StreamTest.SetIndentLevel (1466 of 2031) PASS: lldb-unit :: Utility/./UtilityTests/LogChannelTest.List (1467 of 2031) PASS: lldb-unit :: Utility/./UtilityTests/BinaryStreamTest.PutULEB128SixBytes (1468 of 2031) PASS: lldb-unit :: Utility/./UtilityTests/StringListTest.AppendStringStdString (1469 of 2031) PASS: lldb-api :: functionalities/memory/find/TestMemoryFind.py (1470 of 2031) PASS: lldb-unit :: Utility/./UtilityTests/CompletionRequest.Constructor (1471 of 2031) PASS: lldb-unit :: Symbol/./SymbolTests/TestTypeSystemClang.TestGetBasicTypeFromEnum (1472 of 2031) PASS: lldb-unit :: Host/./HostTests/SocketTest.UDPConnect (1473 of 2031) PASS: lldb-unit :: Utility/./UtilityTests/SubsystemRAIITest.SubsystemWithErrorSuccess (1474 of 2031) PASS: lldb-unit :: Symbol/./SymbolTests/TestTypeSystemClang.TestRecordHasFields (1475 of 2031) FAIL: lldb-api :: lang/objc/modules/TestObjCModules.py (1476 of 2031) ******************** TEST 'lldb-api :: lang/objc/modules/TestObjCModules.py' FAILED ******************** Script: -- /Users/buildslave/jenkins/workspace/lldb-cmake-sanitized/lldb-build/lldb-test-build.noindex/copied-system-python /Users/buildslave/jenkins/workspace/lldb-cmake-sanitized/llvm-project/lldb/test/API/dotest.py --arch x86_64 -s /Users/buildslave/jenkins/workspace/lldb-cmake-sanitized/lldb-build/lldb-test-traces -S nm -u CXXFLAGS -u CFLAGS --codesign-identity lldb_codesign --server /Users/buildslave/jenkins/workspace/lldb-cmake-sanitized/lldb-build/./bin/debugserver --arch x86_64 --build-dir /Users/buildslave/jenkins/workspace/lldb-cmake-sanitized/lldb-build/lldb-test-build.noindex -s=/Users/buildslave/jenkins/workspace/lldb-cmake-sanitized/test/logs -t --env TERM=vt100 --env LLVM_LIBS_DIR=/Users/buildslave/jenkins/workspace/lldb-cmake-sanitized/lldb-build/./lib --inferior-env ASAN_OPTIONS=detect_stack_use_after_return=1 --inferior-env DYLD_INSERT_LIBRARIES=/Users/buildslave/jenkins/workspace/lldb-cmake-sanitized/host-compiler/lib/clang/11.0.0/lib/darwin/libclang_rt.asan_osx_dynamic.dylib --build-dir /Users/buildslave/jenkins/workspace/lldb-cmake-sanitized/lldb-build/lldb-test-build.noindex --lldb-module-cache-dir /Users/buildslave/jenkins/workspace/lldb-cmake-sanitized/lldb-build/lldb-test-build.noindex/module-cache-lldb/lldb-api --clang-module-cache-dir /Users/buildslave/jenkins/workspace/lldb-cmake-sanitized/lldb-build/lldb-test-build.noindex/module-cache-clang/lldb-api --executable /Users/buildslave/jenkins/workspace/lldb-cmake-sanitized/lldb-build/./bin/lldb --compiler /Users/buildslave/jenkins/workspace/lldb-cmake-sanitized/lldb-build/./bin/clang --dsymutil /Users/buildslave/jenkins/workspace/lldb-cmake-sanitized/lldb-build/./bin/dsymutil --filecheck /Users/buildslave/jenkins/workspace/lldb-cmake-sanitized/lldb-build/./bin/FileCheck --lldb-libs-dir /Users/buildslave/jenkins/workspace/lldb-cmake-sanitized/lldb-build/./lib /Users/buildslave/jenkins/workspace/lldb-cmake-sanitized/llvm-project/lldb/test/API/lang/objc/modules -p TestObjCModules.py -- Exit Code: -6

Hide Details

Command Output (stdout): -- lldb version 11.0.99 clang revision 01899bb4e41178af6f4cf7b32833e661fe1e3322 llvm revision 01899bb4e41178af6f4cf7b32833e661fe1e3322

Hide Details

-- Command Output (stderr): -- Assertion failed: (tokenKind == tok::kw___bridge_retain), function ParseParenExpression, file /Users/buildslave/jenkins/workspace/lldb-cmake-sanitized/llvm-project/clang/lib/Parse/ParseExpr.cpp, line 2819.

Hide Details

--

Hide Details

******************** UNSUPPORTED: lldb-api :: functionalities/thread/break_after_join/TestBreakAfterJoin.py (1477 of 2031) PASS: lldb-unit :: Utility/./UtilityTests/ScalarTest.ComparisonFloat (1478 of 2031) PASS: lldb-shell :: ObjectFile/ELF/section-permissions.yaml (1479 of 2031) PASS: lldb-unit :: Utility/./UtilityTests/StreamTeeTest.AppendStream (1480 of 2031) PASS: lldb-api :: functionalities/breakpoint/consecutive_breakpoints/TestConsecutiveBreakpoints.py (1481 of 2031) PASS: lldb-api :: functionalities/breakpoint/breakpoint_by_line_and_column/TestBreakpointByLineAndColumn.py (1482 of 2031) PASS: lldb-shell :: ObjectFile/ELF/section-types.yaml (1483 of 2031) PASS: lldb-unit :: Utility/./UtilityTests/BinaryStreamTest.PutSLEB128SevenBytes (1484 of 2031) UNSUPPORTED: lldb-api :: tools/lldb-server/signal-filtering/TestGdbRemote_QPassSignals.py (1485 of 2031) PASS: lldb-unit :: Utility/./UtilityTests/StringListTest.AppendStringCString (1486 of 2031) PASS: lldb-unit :: UnwindAssembly/x86/./UnwindAssemblyx86Tests/Testx86AssemblyInspectionEngine.TestPushR13 (1487 of 2031) PASS: lldb-api :: lang/cpp/llvm-style/TestLLVMStyle.py (1488 of 2031) PASS: lldb-unit :: Symbol/./SymbolTests/PostfixExpression.ParseFPOProgram (1489 of 2031) PASS: lldb-api :: functionalities/data-formatter/data-formatter-stl/libcxx/unordered/TestDataFormatterUnordered.py (1490 of 2031) PASS: lldb-unit :: Utility/./UtilityTests/StringExtractorTest.GetHexBytesAvail (1491 of 2031) PASS: lldb-api :: commands/expression/import-std-module/weak_ptr-dbg-info-content/TestDbgInfoContentWeakPtrFromStdModule.py (1492 of 2031) PASS: lldb-api :: commands/watchpoints/multiple_threads/TestWatchpointMultipleThreads.py (1493 of 2031) PASS: lldb-shell :: SymbolFile/DWARF/debug_rnglists-dwo.s (1494 of 2031) PASS: lldb-shell :: ObjectFile/ELF/aarch64-relocations.yaml (1495 of 2031) PASS: lldb-unit :: Core/./LLDBCoreTests/SourceFileCache.FindSourceFileNotFound (1496 of 2031) PASS: lldb-unit :: Symbol/./SymbolTests/SymbolsTest.TerminateLocateExecutableSymbolFileForUnknownExecutableAndUnknownSymbolFile (1497 of 2031) PASS: lldb-unit :: UnwindAssembly/x86/./UnwindAssemblyx86Tests/Testx86AssemblyInspectionEngine.TestPopEDI (1498 of 2031) UNSUPPORTED: lldb-api :: functionalities/thread/concurrent_events/TestConcurrentManySignals.py (1499 of 2031) PASS: lldb-shell :: ObjectFile/ELF/gnu-debuglink.yaml (1500 of 2031) PASS: lldb-unit :: UnwindAssembly/x86/./UnwindAssemblyx86Tests/Testx86AssemblyInspectionEngine.TestPushEAX (1501 of 2031) PASS: lldb-api :: types/TestRecursiveTypes.py (1502 of 2031) PASS: lldb-api :: commands/expression/call-function/TestCallUserDefinedFunction.py (1503 of 2031) PASS: lldb-unit :: ObjectFile/Breakpad/./ObjectFileBreakpadTests/StackWinRecord.parse (1504 of 2031) PASS: lldb-api :: functionalities/postmortem/elf-core/gcore/TestGCore.py (1505 of 2031) PASS: lldb-unit :: Process/minidump/./LLDBMinidumpTests/RegisterContextMinidump.ConvertMinidumpContext_x86_32 (1506 of 2031) PASS: lldb-api :: commands/expression/test/TestExprs.py (1507 of 2031) PASS: lldb-unit :: Utility/./UtilityTests/BinaryStreamTest.PutSLEB128SixBytes (1508 of 2031) PASS: lldb-unit :: Utility/./UtilityTests/ArchSpecTest.OperatorBool (1509 of 2031) PASS: lldb-unit :: Process/gdb-remote/./ProcessGdbRemoteTests/GDBRemoteClientBaseTest.SendContinueAndAsyncPacket (1510 of 2031) PASS: lldb-unit :: Core/./LLDBCoreTests/RichManglingContextTest.FromCxxMethodName (1511 of 2031) PASS: lldb-api :: commands/expression/import-std-module/unique_ptr/TestUniquePtrFromStdModule.py (1512 of 2031) PASS: lldb-api :: commands/expression/vector_of_enums/TestVectorOfEnums.py (1513 of 2031) PASS: lldb-unit :: Interpreter/./InterpreterTests/CompletionTest.FileCompletionAbsolute (1514 of 2031) PASS: lldb-unit :: Utility/./UtilityTests/StringExtractorTest.GetHexBytes_Underflow (1515 of 2031) PASS: lldb-api :: lang/cpp/typedef/TestCppTypedef.py (1516 of 2031) PASS: lldb-unit :: Utility/./UtilityTests/RangeTest.DoesIntersect (1517 of 2031) PASS: lldb-api :: lang/cpp/extern_c/TestExternCSymbols.py (1518 of 2031) PASS: lldb-unit :: Utility/./UtilityTests/UriParserTest.MinimalPort (1519 of 2031) PASS: lldb-api :: commands/expression/static-initializers/TestStaticInitializers.py (1520 of 2031) PASS: lldb-api :: linux/builtin_trap/TestBuiltinTrap.py (1521 of 2031) PASS: lldb-api :: functionalities/data-formatter/data-formatter-stl/libcxx/optional/TestDataFormatterLibcxxOptional.py (1522 of 2031) PASS: lldb-shell :: ObjectFile/Breakpad/discontiguous-sections.test (1523 of 2031) UNSUPPORTED: lldb-api :: functionalities/data-formatter/data-formatter-stl/libstdcpp/iterator/TestDataFormatterStdIterator.py (1524 of 2031) PASS: lldb-unit :: Language/Highlighting/./HighlighterTests/HighlighterTest.ClangIdentifiers (1525 of 2031) PASS: lldb-unit :: Utility/./UtilityTests/StreamTest.PutRawBytesToMixedEndian (1526 of 2031) PASS: lldb-shell :: SymbolFile/DWARF/split-dwarf-multiple-cu.ll (1527 of 2031) PASS: lldb-unit :: ScriptInterpreter/Python/./ScriptInterpreterPythonTests/PythonDataObjectsTest.TestPythonDictionaryValueEquality (1528 of 2031) UNSUPPORTED: lldb-api :: lang/cpp/static_members/TestCPPStaticMembers.py (1529 of 2031) PASS: lldb-unit :: UnwindAssembly/x86/./UnwindAssemblyx86Tests/Testx86AssemblyInspectionEngine.TestPopRBPWithREX (1530 of 2031) PASS: lldb-unit :: Symbol/./SymbolTests/TestTypeSystemClang.TestGetTypeClassDeclType (1531 of 2031) UNSUPPORTED: lldb-shell :: Register/x86-64-xmm16-write.test (1532 of 2031) PASS: lldb-api :: lang/cpp/breakpoint_in_member_func_w_non_primitive_params/TestBreakpointInMemberFuncWNonPrimitiveParams.py (1533 of 2031) PASS: lldb-unit :: Utility/./UtilityTests/StringListTest.ShiftMove (1534 of 2031) PASS: lldb-unit :: API/./APITests/SBCommandInterpreterTest.SingleWordCommand (1535 of 2031) UNSUPPORTED: lldb-api :: functionalities/process_save_core/TestProcessSaveCore.py (1536 of 2031) UNSUPPORTED: lldb-api :: linux/add-symbols/TestTargetSymbolsAddCommand.py (1537 of 2031) PASS: lldb-api :: python_api/value/TestValueAPI.py (1538 of 2031) PASS: lldb-shell :: Settings/TestFrameFormatColor.test (1539 of 2031) PASS: lldb-api :: commands/watchpoints/watchpoint_commands/TestWatchpointCommands.py (1540 of 2031) PASS: lldb-unit :: Editline/./EditlineTests/EditlineTestFixture.EditlineReceivesSingleLineText (1541 of 2031) PASS: lldb-unit :: Utility/./UtilityTests/BinaryStreamTest.PutULEB128OneByte (1542 of 2031) PASS: lldb-unit :: Utility/./UtilityTests/FileSpecTest.Yaml (1543 of 2031) PASS: lldb-unit :: Host/./HostTests/SocketTest.TCPGetAddress (1544 of 2031) PASS: lldb-unit :: Utility/./UtilityTests/LogTest.Unregister (1545 of 2031) PASS: lldb-unit :: Process/minidump/./LLDBMinidumpTests/MinidumpParserTest.GetMiscInfoWindows (1546 of 2031) PASS: lldb-shell :: ObjectFile/PECOFF/sections-names.yaml (1547 of 2031) PASS: lldb-api :: functionalities/tail_call_frames/thread_step_out_message/TestArtificialFrameStepOutMessage.py (1548 of 2031) PASS: lldb-api :: functionalities/object-file/TestImageListMultiArchitecture.py (1549 of 2031) PASS: lldb-api :: functionalities/target-new-solib-notifications/TestModuleLoadedNotifys.py (1550 of 2031) PASS: lldb-shell :: ObjectFile/ELF/netbsd-core-amd64.test (1551 of 2031) PASS: lldb-unit :: ScriptInterpreter/Python/./ScriptInterpreterPythonTests/PythonDataObjectsTest.TestObjectAttributes (1552 of 2031) PASS: lldb-shell :: Breakpoint/debug_rnglist_offset_pair.test (1553 of 2031) PASS: lldb-api :: commands/expression/call-function/TestCallStdStringFunction.py (1554 of 2031) PASS: lldb-unit :: Utility/./UtilityTests/StreamTest.AddressSize (1555 of 2031) PASS: lldb-unit :: Utility/./UtilityTests/BinaryStreamTest.PutULEB128One (1556 of 2031) PASS: lldb-shell :: Reproducer/Functionalities/TestDataFormatter.test (1557 of 2031) PASS: lldb-api :: functionalities/data-formatter/language_category_updates/TestDataFormatterLanguageCategoryUpdates.py (1558 of 2031) PASS: lldb-unit :: Utility/./UtilityTests/ConstStringTest.NullAndEmptyStates (1559 of 2031) PASS: lldb-unit :: Utility/./UtilityTests/DataExtractorTest.UncommonAddressSize (1560 of 2031) PASS: lldb-unit :: UnwindAssembly/x86/./UnwindAssemblyx86Tests/Testx86AssemblyInspectionEngine.TestPopR12 (1561 of 2031) UNSUPPORTED: lldb-shell :: ScriptInterpreter/Lua/nested_sessions.test (1562 of 2031) PASS: lldb-unit :: Utility/./UtilityTests/StringExtractorTest.GetHexU8_Exact_NoEof (1563 of 2031) PASS: lldb-unit :: Utility/./UtilityTests/OptionsWithRawTest.WhitespaceInput (1564 of 2031) PASS: lldb-unit :: Core/./LLDBCoreTests/MangledTest.ResultForBlockInvocation (1565 of 2031) PASS: lldb-unit :: debugserver/./debugserverTests/RNBSocket.LoopBackConnectIPv6 (1566 of 2031) PASS: lldb-unit :: Language/CPlusPlus/./LanguageCPlusPlusTests/CPlusPlusLanguage.CPlusPlusNameParser (1567 of 2031) PASS: lldb-shell :: Heap/heap-cstr.test (1568 of 2031) PASS: lldb-unit :: Utility/./UtilityTests/StringExtractorTest.GetHexU8_Exact (1569 of 2031) PASS: lldb-api :: lang/cpp/thread_local/TestThreadLocal.py (1570 of 2031) PASS: lldb-api :: commands/expression/import-std-module/forward_list-dbg-info-content/TestDbgInfoContentForwardListFromStdModule.py (1571 of 2031) PASS: lldb-shell :: SymbolFile/Breakpad/unwind-via-raSearch.test (1572 of 2031) UNSUPPORTED: lldb-shell :: SymbolFile/target-symbols-add-unwind.test (1573 of 2031) PASS: lldb-unit :: Utility/./UtilityTests/StreamTeeTest.Assignment (1574 of 2031) PASS: lldb-unit :: Utility/./UtilityTests/ConstStringTest.FromMidOfBufferStringRef (1575 of 2031) PASS: lldb-api :: functionalities/param_entry_vals/basic_entry_values/TestBasicEntryValues.py (1576 of 2031) PASS: lldb-unit :: Utility/./UtilityTests/StateTest.Formatv (1577 of 2031) PASS: lldb-unit :: ScriptInterpreter/Python/./ScriptInterpreterPythonTests/PythonDataObjectsTest.TestModuleNameResolutionNoDot (1578 of 2031) PASS: lldb-api :: commands/expression/import-std-module/shared_ptr/TestSharedPtrFromStdModule.py (1579 of 2031) PASS: lldb-api :: commands/expression/import-std-module/unique_ptr-dbg-info-content/TestUniquePtrDbgInfoContent.py (1580 of 2031) PASS: lldb-unit :: Process/gdb-remote/./ProcessGdbRemoteTests/GDBRemoteCommunicationClientTest.GetMemoryRegionInfoInvalidResponse (1581 of 2031) PASS: lldb-unit :: Utility/./UtilityTests/ArgsTest.GetArgumentArrayRef (1582 of 2031) PASS: lldb-unit :: Expression/./ExpressionTests/DiagnosticManagerTest.GetStringMultiline (1583 of 2031) PASS: lldb-unit :: Utility/./UtilityTests/CompletionRequest.TryCompleteCurrentArgBad (1584 of 2031) PASS: lldb-unit :: Utility/./UtilityTests/BinaryStreamTest.PutULEB128EightBytes (1585 of 2031) PASS: lldb-api :: lang/cpp/chained-calls/TestCppChainedCalls.py (1586 of 2031) PASS: lldb-unit :: Utility/./UtilityTests/ListenerTest.GetEventWait (1587 of 2031) FAIL: lldb-api :: lang/objc/blocks/TestObjCIvarsInBlocks.py (1588 of 2031) ******************** TEST 'lldb-api :: lang/objc/blocks/TestObjCIvarsInBlocks.py' FAILED ******************** Script: -- /Users/buildslave/jenkins/workspace/lldb-cmake-sanitized/lldb-build/lldb-test-build.noindex/copied-system-python /Users/buildslave/jenkins/workspace/lldb-cmake-sanitized/llvm-project/lldb/test/API/dotest.py --arch x86_64 -s /Users/buildslave/jenkins/workspace/lldb-cmake-sanitized/lldb-build/lldb-test-traces -S nm -u CXXFLAGS -u CFLAGS --codesign-identity lldb_codesign --server /Users/buildslave/jenkins/workspace/lldb-cmake-sanitized/lldb-build/./bin/debugserver --arch x86_64 --build-dir /Users/buildslave/jenkins/workspace/lldb-cmake-sanitized/lldb-build/lldb-test-build.noindex -s=/Users/buildslave/jenkins/workspace/lldb-cmake-sanitized/test/logs -t --env TERM=vt100 --env LLVM_LIBS_DIR=/Users/buildslave/jenkins/workspace/lldb-cmake-sanitized/lldb-build/./lib --inferior-env ASAN_OPTIONS=detect_stack_use_after_return=1 --inferior-env DYLD_INSERT_LIBRARIES=/Users/buildslave/jenkins/workspace/lldb-cmake-sanitized/host-compiler/lib/clang/11.0.0/lib/darwin/libclang_rt.asan_osx_dynamic.dylib --build-dir /Users/buildslave/jenkins/workspace/lldb-cmake-sanitized/lldb-build/lldb-test-build.noindex --lldb-module-cache-dir /Users/buildslave/jenkins/workspace/lldb-cmake-sanitized/lldb-build/lldb-test-build.noindex/module-cache-lldb/lldb-api --clang-module-cache-dir /Users/buildslave/jenkins/workspace/lldb-cmake-sanitized/lldb-build/lldb-test-build.noindex/module-cache-clang/lldb-api --executable /Users/buildslave/jenkins/workspace/lldb-cmake-sanitized/lldb-build/./bin/lldb --compiler /Users/buildslave/jenkins/workspace/lldb-cmake-sanitized/lldb-build/./bin/clang --dsymutil /Users/buildslave/jenkins/workspace/lldb-cmake-sanitized/lldb-build/./bin/dsymutil --filecheck /Users/buildslave/jenkins/workspace/lldb-cmake-sanitized/lldb-build/./bin/FileCheck --lldb-libs-dir /Users/buildslave/jenkins/workspace/lldb-cmake-sanitized/lldb-build/./lib /Users/buildslave/jenkins/workspace/lldb-cmake-sanitized/llvm-project/lldb/test/API/lang/objc/blocks -p TestObjCIvarsInBlocks.py -- Exit Code: -6

Hide Details

Command Output (stdout): -- lldb version 11.0.99 clang revision 01899bb4e41178af6f4cf7b32833e661fe1e3322 llvm revision 01899bb4e41178af6f4cf7b32833e661fe1e3322

Hide Details

-- Command Output (stderr): -- Assertion failed: (tokenKind == tok::kw___bridge_retain), function ParseParenExpression, file /Users/buildslave/jenkins/workspace/lldb-cmake-sanitized/llvm-project/clang/lib/Parse/ParseExpr.cpp, line 2819.

Hide Details

--

Hide Details

******************** PASS: lldb-unit :: SymbolFile/DWARF/./SymbolFileDWARFTests/SymbolFileDWARFTests.ParseArangesNonzeroSegmentSize (1589 of 2031) PASS: lldb-unit :: ObjectFile/Breakpad/./ObjectFileBreakpadTests/FuncRecord.parse (1590 of 2031) PASS: lldb-unit :: Symbol/./SymbolTests/TestTypeSystemClang.TestIsClangType (1591 of 2031) PASS: lldb-unit :: Utility/./UtilityTests/StringExtractorTest.DecodeHexU8_Exact (1592 of 2031) PASS: lldb-unit :: Utility/./UtilityTests/XcodeSDKTest.MergeTest (1593 of 2031) PASS: lldb-unit :: Interpreter/./InterpreterTests/OptionArgParserTest.toChar (1594 of 2031) PASS: lldb-api :: lang/objc/real-definition/TestRealDefinition.py (1595 of 2031) PASS: lldb-api :: functionalities/data-formatter/data-formatter-skip-summary/TestDataFormatterSkipSummary.py (1596 of 2031) PASS: lldb-unit :: Utility/./UtilityTests/BinaryStreamTest.PutSLEB128FiveBytes (1597 of 2031) PASS: lldb-api :: lang/objc/objc-foundation-dictionary-empty/TestNSDictionary0.py (1598 of 2031) UNSUPPORTED: lldb-api :: linux/mix-dwo-and-regular-objects/TestMixedDwarfBinary.py (1599 of 2031) PASS: lldb-api :: commands/expression/anonymous-struct/TestCallUserAnonTypedef.py (1600 of 2031) PASS: lldb-api :: functionalities/breakpoint/breakpoint_ignore_count/TestBreakpointIgnoreCount.py (1601 of 2031) UNSUPPORTED: lldb-api :: functionalities/data-formatter/data-formatter-stl/libstdcpp/list/TestDataFormatterStdList.py (1602 of 2031) PASS: lldb-unit :: Utility/./UtilityTests/SerializationRountripTest.SerializeDeserializePodPointers (1603 of 2031) PASS: lldb-unit :: ScriptInterpreter/Python/./ScriptInterpreterPythonTests/PythonDataObjectsTest.TestGlobalNameResolutionWithDot (1604 of 2031) PASS: lldb-api :: commands/expression/import-std-module/vector/TestVectorFromStdModule.py (1605 of 2031) PASS: lldb-unit :: ScriptInterpreter/Python/./ScriptInterpreterPythonTests/PythonDataObjectsTest.TestPythonListManipulation (1606 of 2031) PASS: lldb-api :: python_api/sblaunchinfo/TestSBLaunchInfo.py (1607 of 2031) PASS: lldb-api :: tools/lldb-server/TestGdbRemoteSingleStep.py (1608 of 2031) UNSUPPORTED: lldb-api :: functionalities/darwin_log/basic/TestDarwinLogBasic.py (1609 of 2031) PASS: lldb-unit :: Target/./TargetTests/PathMappingListTest.AbsoluteTests (1610 of 2031) PASS: lldb-unit :: Interpreter/./InterpreterTests/CompletionTest.DirCompletionAbsolute (1611 of 2031) PASS: lldb-unit :: Utility/./UtilityTests/VMRange.CollectionContains (1612 of 2031) PASS: lldb-shell :: SymbolFile/symbol-binding.test (1613 of 2031) PASS: lldb-unit :: Utility/./UtilityTests/StringListTest.DefaultConstructor (1614 of 2031) PASS: lldb-api :: functionalities/gdb_remote_client/TestIOSSimulator.py (1615 of 2031) PASS: lldb-api :: functionalities/gdb_remote_client/TestTargetXMLArch.py (1616 of 2031) PASS: lldb-api :: commands/expression/test/TestExprs2.py (1617 of 2031) PASS: lldb-api :: functionalities/inferior-changed/TestInferiorChanged.py (1618 of 2031) PASS: lldb-api :: lang/c/step-target/TestStepTarget.py (1619 of 2031) UNSUPPORTED: lldb-api :: functionalities/thread/thread_specific_break_plus_condition/TestThreadSpecificBpPlusCondition.py (1620 of 2031) PASS: lldb-unit :: Process/gdb-remote/./ProcessGdbRemoteTests/GDBRemoteCommunicationServerTest.SendErrorResponse_Status (1621 of 2031) PASS: lldb-unit :: Utility/./UtilityTests/LogChannelTest.Enable (1622 of 2031) PASS: lldb-api :: functionalities/thread/concurrent_events/TestConcurrentTwoWatchpointThreads.py (1623 of 2031) PASS: lldb-api :: python_api/formatters/TestFormattersSBAPI.py (1624 of 2031) PASS: lldb-api :: python_api/default-constructor/TestDefaultConstructorForAPIObjects.py (1625 of 2031) PASS: lldb-unit :: Utility/./UtilityTests/EnvironmentTest.EnvpConstruction (1626 of 2031) PASS: lldb-api :: commands/watchpoints/watchpoint_commands/condition/TestWatchpointConditionCmd.py (1627 of 2031) PASS: lldb-api :: functionalities/thread/step_out/TestThreadStepOut.py (1628 of 2031) PASS: lldb-unit :: Utility/./UtilityTests/FileSpecTest.CopyByAppendingPathComponent (1629 of 2031) PASS: lldb-unit :: Utility/./UtilityTests/UUIDTest.StringConverion (1630 of 2031) PASS: lldb-unit :: Utility/./UtilityTests/StringListTest.CopyListSingle (1631 of 2031) PASS: lldb-unit :: Host/./HostTests/SocketAddressTest.GetAddressInfo (1632 of 2031) PASS: lldb-shell :: SymbolFile/Breakpad/stack-cfi-parsing.test (1633 of 2031) PASS: lldb-unit :: UnwindAssembly/x86/./UnwindAssemblyx86Tests/Testx86AssemblyInspectionEngine.TestMovRSPtoRBP (1634 of 2031) PASS: lldb-unit :: Utility/./UtilityTests/StreamTest.Indent (1635 of 2031) PASS: lldb-unit :: Interpreter/./InterpreterTests/OptionArgParserTest.toScriptLanguage (1636 of 2031) PASS: lldb-unit :: Utility/./UtilityTests/StringExtractorTest.GetHexBytes_OddPair2 (1637 of 2031) PASS: lldb-unit :: Utility/./UtilityTests/UriParserTest.SchemeHostSeparator3 (1638 of 2031) PASS: lldb-unit :: Utility/./UtilityTests/StringListTest.CopyList (1639 of 2031) PASS: lldb-unit :: Utility/./UtilityTests/StreamTest.PutMaxHex64ByteOrderLittle (1640 of 2031) PASS: lldb-unit :: Utility/./UtilityTests/StringExtractorTest.GetNameColonValueNoColon (1641 of 2031) PASS: lldb-api :: commands/platform/basic/TestPlatformPython.py (1642 of 2031) PASS: lldb-unit :: Symbol/./SymbolTests/TestTypeSystemClang.TestGetTypeClassNested (1643 of 2031) PASS: lldb-api :: commands/expression/import-std-module/stack/TestStackFromStdModule.py (1644 of 2031) PASS: lldb-api :: commands/command/invalid-args/TestInvalidArgsCommand.py (1645 of 2031) UNSUPPORTED: lldb-api :: commands/expression/completion-crash-invalid-iterator/TestInvalidIteratorCompletionCrash.py (1646 of 2031) PASS: lldb-unit :: UnwindAssembly/x86/./UnwindAssemblyx86Tests/Testx86AssemblyInspectionEngine.TestPushRBX (1647 of 2031) PASS: lldb-unit :: Target/./TargetTests/PathMappingListTest.RemapRoot (1648 of 2031) PASS: lldb-api :: functionalities/gdb_remote_client/TestqOffsets.py (1649 of 2031) PASS: lldb-api :: commands/watchpoints/hello_watchpoint/TestMyFirstWatchpoint.py (1650 of 2031) PASS: lldb-api :: functionalities/thread/concurrent_events/TestConcurrentSignalWatch.py (1651 of 2031) PASS: lldb-unit :: Utility/./UtilityTests/DataExtractorTest.GetBitfield (1652 of 2031) PASS: lldb-api :: commands/statistics/basic/TestStats.py (1653 of 2031) PASS: lldb-api :: lang/c/tls_globals/TestTlsGlobals.py (1654 of 2031) PASS: lldb-unit :: Process/gdb-remote/./ProcessGdbRemoteTests/GDBRemoteCommunicationClientTest.SendSignalsToIgnore (1655 of 2031) PASS: lldb-unit :: Utility/./UtilityTests/StreamTeeTest.Write (1656 of 2031) PASS: lldb-unit :: Utility/./UtilityTests/StreamTest.PutRawBytesToLittleEndian (1657 of 2031) PASS: lldb-api :: functionalities/tail_call_frames/disambiguate_tail_call_seq/TestDisambiguateTailCallSeq.py (1658 of 2031) PASS: lldb-shell :: Settings/TestSettingsSet.test (1659 of 2031) PASS: lldb-unit :: Host/./HostTests/HostInfoTest.GetHostname (1660 of 2031) PASS: lldb-api :: functionalities/dynamic_value_child_count/TestDynamicValueChildCount.py (1661 of 2031) PASS: lldb-unit :: Utility/./UtilityTests/ArchSpecTest.YAML (1662 of 2031) PASS: lldb-unit :: Utility/./UtilityTests/Flags.AnySet (1663 of 2031) UNSUPPORTED: lldb-shell :: ScriptInterpreter/Lua/bindings.test (1664 of 2031) PASS: lldb-shell :: Driver/TestProcessAttach.test (1665 of 2031) UNSUPPORTED: lldb-api :: functionalities/tty/TestTerminal.py (1666 of 2031) PASS: lldb-unit :: Utility/./UtilityTests/StreamTest.PutChar (1667 of 2031) PASS: lldb-unit :: Core/./LLDBCoreTests/MangledTest.ResultForValidName (1668 of 2031) PASS: lldb-api :: macosx/duplicate-archive-members/TestDuplicateMembers.py (1669 of 2031) PASS: lldb-shell :: Minidump/disassemble-no-module.yaml (1670 of 2031) PASS: lldb-api :: tools/lldb-server/register-reading/TestGdbRemoteGPacket.py (1671 of 2031) UNSUPPORTED: lldb-api :: tools/lldb-server/thread-name/TestGdbRemoteThreadName.py (1672 of 2031) PASS: lldb-api :: functionalities/breakpoint/breakpoint_language/TestBreakpointLanguage.py (1673 of 2031) PASS: lldb-shell :: SymbolFile/Breakpad/symtab-macho.test (1674 of 2031) PASS: lldb-api :: lang/objc/modules-auto-import/TestModulesAutoImport.py (1675 of 2031) FAIL: lldb-api :: lang/objc/objc-new-syntax/TestObjCNewSyntaxLiteral.py (1676 of 2031) ******************** TEST 'lldb-api :: lang/objc/objc-new-syntax/TestObjCNewSyntaxLiteral.py' FAILED ******************** Script: -- /Users/buildslave/jenkins/workspace/lldb-cmake-sanitized/lldb-build/lldb-test-build.noindex/copied-system-python /Users/buildslave/jenkins/workspace/lldb-cmake-sanitized/llvm-project/lldb/test/API/dotest.py --arch x86_64 -s /Users/buildslave/jenkins/workspace/lldb-cmake-sanitized/lldb-build/lldb-test-traces -S nm -u CXXFLAGS -u CFLAGS --codesign-identity lldb_codesign --server /Users/buildslave/jenkins/workspace/lldb-cmake-sanitized/lldb-build/./bin/debugserver --arch x86_64 --build-dir /Users/buildslave/jenkins/workspace/lldb-cmake-sanitized/lldb-build/lldb-test-build.noindex -s=/Users/buildslave/jenkins/workspace/lldb-cmake-sanitized/test/logs -t --env TERM=vt100 --env LLVM_LIBS_DIR=/Users/buildslave/jenkins/workspace/lldb-cmake-sanitized/lldb-build/./lib --inferior-env ASAN_OPTIONS=detect_stack_use_after_return=1 --inferior-env DYLD_INSERT_LIBRARIES=/Users/buildslave/jenkins/workspace/lldb-cmake-sanitized/host-compiler/lib/clang/11.0.0/lib/darwin/libclang_rt.asan_osx_dynamic.dylib --build-dir /Users/buildslave/jenkins/workspace/lldb-cmake-sanitized/lldb-build/lldb-test-build.noindex --lldb-module-cache-dir /Users/buildslave/jenkins/workspace/lldb-cmake-sanitized/lldb-build/lldb-test-build.noindex/module-cache-lldb/lldb-api --clang-module-cache-dir /Users/buildslave/jenkins/workspace/lldb-cmake-sanitized/lldb-build/lldb-test-build.noindex/module-cache-clang/lldb-api --executable /Users/buildslave/jenkins/workspace/lldb-cmake-sanitized/lldb-build/./bin/lldb --compiler /Users/buildslave/jenkins/workspace/lldb-cmake-sanitized/lldb-build/./bin/clang --dsymutil /Users/buildslave/jenkins/workspace/lldb-cmake-sanitized/lldb-build/./bin/dsymutil --filecheck /Users/buildslave/jenkins/workspace/lldb-cmake-sanitized/lldb-build/./bin/FileCheck --lldb-libs-dir /Users/buildslave/jenkins/workspace/lldb-cmake-sanitized/lldb-build/./lib /Users/buildslave/jenkins/workspace/lldb-cmake-sanitized/llvm-project/lldb/test/API/lang/objc/objc-new-syntax -p TestObjCNewSyntaxLiteral.py -- Exit Code: -6

Hide Details

Command Output (stdout): -- lldb version 11.0.99 clang revision 01899bb4e41178af6f4cf7b32833e661fe1e3322 llvm revision 01899bb4e41178af6f4cf7b32833e661fe1e3322

Hide Details

-- Command Output (stderr): -- Assertion failed: (tokenKind == tok::kw___bridge_retain), function ParseParenExpression, file /Users/buildslave/jenkins/workspace/lldb-cmake-sanitized/llvm-project/clang/lib/Parse/ParseExpr.cpp, line 2819.

Hide Details

--

Hide Details

******************** PASS: lldb-unit :: Utility/./UtilityTests/ProcessInstanceInfo.DumpTable_invalidUID (1677 of 2031) PASS: lldb-unit :: Process/minidump/./LLDBMinidumpTests/MinidumpParserTest.GetMemoryRegionInfoFromMemoryList (1678 of 2031) PASS: lldb-api :: commands/quit/TestQuit.py (1679 of 2031) PASS: lldb-api :: functionalities/memory-region/TestMemoryRegion.py (1680 of 2031) PASS: lldb-api :: lang/cpp/limit-debug-info/TestWithLimitDebugInfo.py (1681 of 2031) UNSUPPORTED: lldb-api :: commands/expression/multiline-navigation/TestMultilineNavigation.py (1682 of 2031) FAIL: lldb-api :: lang/objc/unicode-string/TestUnicodeString.py (1683 of 2031) ******************** TEST 'lldb-api :: lang/objc/unicode-string/TestUnicodeString.py' FAILED ******************** Script: -- /Users/buildslave/jenkins/workspace/lldb-cmake-sanitized/lldb-build/lldb-test-build.noindex/copied-system-python /Users/buildslave/jenkins/workspace/lldb-cmake-sanitized/llvm-project/lldb/test/API/dotest.py --arch x86_64 -s /Users/buildslave/jenkins/workspace/lldb-cmake-sanitized/lldb-build/lldb-test-traces -S nm -u CXXFLAGS -u CFLAGS --codesign-identity lldb_codesign --server /Users/buildslave/jenkins/workspace/lldb-cmake-sanitized/lldb-build/./bin/debugserver --arch x86_64 --build-dir /Users/buildslave/jenkins/workspace/lldb-cmake-sanitized/lldb-build/lldb-test-build.noindex -s=/Users/buildslave/jenkins/workspace/lldb-cmake-sanitized/test/logs -t --env TERM=vt100 --env LLVM_LIBS_DIR=/Users/buildslave/jenkins/workspace/lldb-cmake-sanitized/lldb-build/./lib --inferior-env ASAN_OPTIONS=detect_stack_use_after_return=1 --inferior-env DYLD_INSERT_LIBRARIES=/Users/buildslave/jenkins/workspace/lldb-cmake-sanitized/host-compiler/lib/clang/11.0.0/lib/darwin/libclang_rt.asan_osx_dynamic.dylib --build-dir /Users/buildslave/jenkins/workspace/lldb-cmake-sanitized/lldb-build/lldb-test-build.noindex --lldb-module-cache-dir /Users/buildslave/jenkins/workspace/lldb-cmake-sanitized/lldb-build/lldb-test-build.noindex/module-cache-lldb/lldb-api --clang-module-cache-dir /Users/buildslave/jenkins/workspace/lldb-cmake-sanitized/lldb-build/lldb-test-build.noindex/module-cache-clang/lldb-api --executable /Users/buildslave/jenkins/workspace/lldb-cmake-sanitized/lldb-build/./bin/lldb --compiler /Users/buildslave/jenkins/workspace/lldb-cmake-sanitized/lldb-build/./bin/clang --dsymutil /Users/buildslave/jenkins/workspace/lldb-cmake-sanitized/lldb-build/./bin/dsymutil --filecheck /Users/buildslave/jenkins/workspace/lldb-cmake-sanitized/lldb-build/./bin/FileCheck --lldb-libs-dir /Users/buildslave/jenkins/workspace/lldb-cmake-sanitized/lldb-build/./lib /Users/buildslave/jenkins/workspace/lldb-cmake-sanitized/llvm-project/lldb/test/API/lang/objc/unicode-string -p TestUnicodeString.py -- Exit Code: -6

Hide Details

Command Output (stdout): -- lldb version 11.0.99 clang revision 01899bb4e41178af6f4cf7b32833e661fe1e3322 llvm revision 01899bb4e41178af6f4cf7b32833e661fe1e3322

Hide Details

-- Command Output (stderr): -- Assertion failed: (tokenKind == tok::kw___bridge_retain), function ParseParenExpression, file /Users/buildslave/jenkins/workspace/lldb-cmake-sanitized/llvm-project/clang/lib/Parse/ParseExpr.cpp, line 2819.

Hide Details

--

Hide Details

******************** UNSUPPORTED: lldb-api :: tools/lldb-server/TestGdbRemoteAuxvSupport.py (1684 of 2031) PASS: lldb-api :: functionalities/load_unload/TestLoadUnload.py (1685 of 2031) PASS: lldb-api :: functionalities/breakpoint/breakpoint_ids/TestBreakpointIDs.py (1686 of 2031) PASS: lldb-unit :: ScriptInterpreter/Python/./ScriptInterpreterPythonTests/PythonDataObjectsTest.TestPythonByteArray (1687 of 2031) PASS: lldb-unit :: ScriptInterpreter/Python/./ScriptInterpreterPythonTests/PythonDataObjectsTest.TestPythonStringToStr (1688 of 2031) PASS: lldb-api :: functionalities/deleted-executable/TestDeletedExecutable.py (1689 of 2031) UNSUPPORTED: lldb-api :: iohandler/unicode/TestUnicode.py (1690 of 2031) PASS: lldb-unit :: UnwindAssembly/x86/./UnwindAssemblyx86Tests/Testx86AssemblyInspectionEngine.TestPushEDX (1691 of 2031) PASS: lldb-shell :: Driver/TestCommands.test (1692 of 2031) UNSUPPORTED: lldb-shell :: Register/aarch64-fp-read.test (1693 of 2031) PASS: lldb-unit :: Symbol/./SymbolTests/TestClangASTImporter.CanImportInvalidType (1694 of 2031) FAIL: lldb-api :: lang/objc/foundation/TestObjCMethodsNSError.py (1695 of 2031) ******************** TEST 'lldb-api :: lang/objc/foundation/TestObjCMethodsNSError.py' FAILED ******************** Script: -- /Users/buildslave/jenkins/workspace/lldb-cmake-sanitized/lldb-build/lldb-test-build.noindex/copied-system-python /Users/buildslave/jenkins/workspace/lldb-cmake-sanitized/llvm-project/lldb/test/API/dotest.py --arch x86_64 -s /Users/buildslave/jenkins/workspace/lldb-cmake-sanitized/lldb-build/lldb-test-traces -S nm -u CXXFLAGS -u CFLAGS --codesign-identity lldb_codesign --server /Users/buildslave/jenkins/workspace/lldb-cmake-sanitized/lldb-build/./bin/debugserver --arch x86_64 --build-dir /Users/buildslave/jenkins/workspace/lldb-cmake-sanitized/lldb-build/lldb-test-build.noindex -s=/Users/buildslave/jenkins/workspace/lldb-cmake-sanitized/test/logs -t --env TERM=vt100 --env LLVM_LIBS_DIR=/Users/buildslave/jenkins/workspace/lldb-cmake-sanitized/lldb-build/./lib --inferior-env ASAN_OPTIONS=detect_stack_use_after_return=1 --inferior-env DYLD_INSERT_LIBRARIES=/Users/buildslave/jenkins/workspace/lldb-cmake-sanitized/host-compiler/lib/clang/11.0.0/lib/darwin/libclang_rt.asan_osx_dynamic.dylib --build-dir /Users/buildslave/jenkins/workspace/lldb-cmake-sanitized/lldb-build/lldb-test-build.noindex --lldb-module-cache-dir /Users/buildslave/jenkins/workspace/lldb-cmake-sanitized/lldb-build/lldb-test-build.noindex/module-cache-lldb/lldb-api --clang-module-cache-dir /Users/buildslave/jenkins/workspace/lldb-cmake-sanitized/lldb-build/lldb-test-build.noindex/module-cache-clang/lldb-api --executable /Users/buildslave/jenkins/workspace/lldb-cmake-sanitized/lldb-build/./bin/lldb --compiler /Users/buildslave/jenkins/workspace/lldb-cmake-sanitized/lldb-build/./bin/clang --dsymutil /Users/buildslave/jenkins/workspace/lldb-cmake-sanitized/lldb-build/./bin/dsymutil --filecheck /Users/buildslave/jenkins/workspace/lldb-cmake-sanitized/lldb-build/./bin/FileCheck --lldb-libs-dir /Users/buildslave/jenkins/workspace/lldb-cmake-sanitized/lldb-build/./lib /Users/buildslave/jenkins/workspace/lldb-cmake-sanitized/llvm-project/lldb/test/API/lang/objc/foundation -p TestObjCMethodsNSError.py -- Exit Code: -6

Hide Details

Command Output (stdout): -- lldb version 11.0.99 clang revision 01899bb4e41178af6f4cf7b32833e661fe1e3322 llvm revision 01899bb4e41178af6f4cf7b32833e661fe1e3322

Hide Details

-- Command Output (stderr): -- Assertion failed: (tokenKind == tok::kw___bridge_retain), function ParseParenExpression, file /Users/buildslave/jenkins/workspace/lldb-cmake-sanitized/llvm-project/clang/lib/Parse/ParseExpr.cpp, line 2819.

Hide Details

--

Hide Details

******************** PASS: lldb-shell :: SymbolFile/NativePDB/disassembly.cpp (1696 of 2031) PASS: lldb-unit :: Utility/./UtilityTests/BroadcasterTest.EventTypeHasListeners (1697 of 2031) PASS: lldb-unit :: Utility/./UtilityTests/RangeTest.ContainsRange (1698 of 2031) PASS: lldb-unit :: Process/gdb-remote/./ProcessGdbRemoteTests/GDBRemoteCommunicationClientTest.SaveRestoreRegistersNoSuffix (1699 of 2031) PASS: lldb-api :: functionalities/thread/concurrent_events/TestConcurrentDelaySignalWatch.py (1700 of 2031) PASS: lldb-unit :: Host/./HostTests/MainLoopTest.Signal (1701 of 2031) PASS: lldb-api :: lang/objc/foundation/TestSymbolTable.py (1702 of 2031) PASS: lldb-api :: commands/gui/invalid-args/TestInvalidArgsGui.py (1703 of 2031) PASS: lldb-api :: lang/objc/objc-ivar-stripped/TestObjCIvarStripped.py (1704 of 2031) PASS: lldb-shell :: Driver/TestTarget.test (1705 of 2031) UNSUPPORTED: lldb-api :: functionalities/exec/TestExec.py (1706 of 2031) PASS: lldb-shell :: Reproducer/TestDSYM.test (1707 of 2031) PASS: lldb-unit :: Symbol/./SymbolTests/Type.CompilerContextPattern (1708 of 2031) PASS: lldb-unit :: Platform/./LLDBPlatformTests/PlatformDarwinTest.FindComponentInPath (1709 of 2031) PASS: lldb-api :: functionalities/breakpoint/breakpoint_command/TestBreakpointCommandsFromPython.py (1710 of 2031) PASS: lldb-unit :: Utility/./UtilityTests/StringListTest.InsertStringAtIndexEnd (1711 of 2031) PASS: lldb-api :: lang/c/unions/TestUnionMembers.py (1712 of 2031) PASS: lldb-unit :: Process/gdb-remote/./ProcessGdbRemoteTests/GDBRemoteCommunicationServerTest.SendErrorResponse_UnimplementedError (1713 of 2031) PASS: lldb-unit :: Process/gdb-remote/./ProcessGdbRemoteTests/GDBRemoteCommunicationClientTest.GetModulesInfoInvalidResponse (1714 of 2031) PASS: lldb-shell :: ObjectFile/PECOFF/sections.yaml (1715 of 2031) FAIL: lldb-api :: lang/objc/modules-non-objc-target/TestObjCModulesNonObjCTarget.py (1716 of 2031) ******************** TEST 'lldb-api :: lang/objc/modules-non-objc-target/TestObjCModulesNonObjCTarget.py' FAILED ******************** Script: -- /Users/buildslave/jenkins/workspace/lldb-cmake-sanitized/lldb-build/lldb-test-build.noindex/copied-system-python /Users/buildslave/jenkins/workspace/lldb-cmake-sanitized/llvm-project/lldb/test/API/dotest.py --arch x86_64 -s /Users/buildslave/jenkins/workspace/lldb-cmake-sanitized/lldb-build/lldb-test-traces -S nm -u CXXFLAGS -u CFLAGS --codesign-identity lldb_codesign --server /Users/buildslave/jenkins/workspace/lldb-cmake-sanitized/lldb-build/./bin/debugserver --arch x86_64 --build-dir /Users/buildslave/jenkins/workspace/lldb-cmake-sanitized/lldb-build/lldb-test-build.noindex -s=/Users/buildslave/jenkins/workspace/lldb-cmake-sanitized/test/logs -t --env TERM=vt100 --env LLVM_LIBS_DIR=/Users/buildslave/jenkins/workspace/lldb-cmake-sanitized/lldb-build/./lib --inferior-env ASAN_OPTIONS=detect_stack_use_after_return=1 --inferior-env DYLD_INSERT_LIBRARIES=/Users/buildslave/jenkins/workspace/lldb-cmake-sanitized/host-compiler/lib/clang/11.0.0/lib/darwin/libclang_rt.asan_osx_dynamic.dylib --build-dir /Users/buildslave/jenkins/workspace/lldb-cmake-sanitized/lldb-build/lldb-test-build.noindex --lldb-module-cache-dir /Users/buildslave/jenkins/workspace/lldb-cmake-sanitized/lldb-build/lldb-test-build.noindex/module-cache-lldb/lldb-api --clang-module-cache-dir /Users/buildslave/jenkins/workspace/lldb-cmake-sanitized/lldb-build/lldb-test-build.noindex/module-cache-clang/lldb-api --executable /Users/buildslave/jenkins/workspace/lldb-cmake-sanitized/lldb-build/./bin/lldb --compiler /Users/buildslave/jenkins/workspace/lldb-cmake-sanitized/lldb-build/./bin/clang --dsymutil /Users/buildslave/jenkins/workspace/lldb-cmake-sanitized/lldb-build/./bin/dsymutil --filecheck /Users/buildslave/jenkins/workspace/lldb-cmake-sanitized/lldb-build/./bin/FileCheck --lldb-libs-dir /Users/buildslave/jenkins/workspace/lldb-cmake-sanitized/lldb-build/./lib /Users/buildslave/jenkins/workspace/lldb-cmake-sanitized/llvm-project/lldb/test/API/lang/objc/modules-non-objc-target -p TestObjCModulesNonObjCTarget.py -- Exit Code: -6

Hide Details

Command Output (stdout): -- lldb version 11.0.99 clang revision 01899bb4e41178af6f4cf7b32833e661fe1e3322 llvm revision 01899bb4e41178af6f4cf7b32833e661fe1e3322

Hide Details

-- Command Output (stderr): -- Assertion failed: (tokenKind == tok::kw___bridge_retain), function ParseParenExpression, file /Users/buildslave/jenkins/workspace/lldb-cmake-sanitized/llvm-project/clang/lib/Parse/ParseExpr.cpp, line 2819.

Hide Details

--

Hide Details

******************** PASS: lldb-unit :: ScriptInterpreter/Python/./ScriptInterpreterPythonTests/PythonDataObjectsTest.TestPythonString (1717 of 2031) PASS: lldb-unit :: debugserver/./debugserverTests/RNBSocket.LoopBackConnectIPv4 (1718 of 2031) PASS: lldb-api :: python_api/symbol-context/TestSymbolContext.py (1719 of 2031) PASS: lldb-api :: tools/lldb-server/inferior-crash/TestGdbRemoteAbort.py (1720 of 2031) PASS: lldb-shell :: SymbolFile/DWARF/debug-types-signature-loop.s (1721 of 2031) PASS: lldb-unit :: Utility/./UtilityTests/StringListTest.JoinThree (1722 of 2031) PASS: lldb-unit :: SymbolFile/DWARF/./SymbolFileDWARFTests/SymbolFileDWARFTests.TestAbbrevNullAttrValidForm (1723 of 2031) PASS: lldb-unit :: Utility/./UtilityTests/StreamTest.AddressRangeEmptyRange (1724 of 2031) UNSUPPORTED: lldb-api :: functionalities/tsan/basic/TestTsanBasic.py (1725 of 2031) PASS: lldb-unit :: Host/./HostTests/ConnectionFileDescriptorTest.TCPGetURIv6 (1726 of 2031) PASS: lldb-unit :: UnwindAssembly/x86/./UnwindAssemblyx86Tests/Testx86AssemblyInspectionEngine.TestPopR13 (1727 of 2031) PASS: lldb-api :: commands/target/dump-symtab-demangle/TestDumpSymtabDemangle.py (1728 of 2031) PASS: lldb-api :: functionalities/data-formatter/synthcapping/TestSyntheticCapping.py (1729 of 2031) PASS: lldb-unit :: Utility/./UtilityTests/SerializationRountripTest.SerializeDeserializeObjectPointer (1730 of 2031) PASS: lldb-unit :: Utility/./UtilityTests/StringExtractorTest.InitMisc (1731 of 2031) PASS: lldb-api :: lang/cpp/namespace/TestNamespaceLookup.py (1732 of 2031) PASS: lldb-unit :: Utility/./UtilityTests/Flags.Reset (1733 of 2031) PASS: lldb-api :: python_api/sbdata/TestSBData.py (1734 of 2031) PASS: lldb-api :: lang/cpp/nested-class-other-compilation-unit/TestNestedClassWithParentInAnotherCU.py (1735 of 2031) PASS: lldb-unit :: Process/gdb-remote/./ProcessGdbRemoteTests/GDBRemoteClientBaseTest.SendContinueAndLateInterrupt (1736 of 2031) PASS: lldb-api :: functionalities/unwind/noreturn/module-end/TestNoReturnModuleEnd.py (1737 of 2031) PASS: lldb-unit :: Utility/./UtilityTests/FileSpecTest.IsRelative (1738 of 2031) PASS: lldb-api :: functionalities/history/TestHistoryRecall.py (1739 of 2031) PASS: lldb-api :: functionalities/var_path/TestVarPath.py (1740 of 2031) PASS: lldb-api :: lang/cpp/auto/TestCPPAuto.py (1741 of 2031) PASS: lldb-shell :: ObjectFile/PECOFF/basic-info.yaml (1742 of 2031) PASS: lldb-unit :: Utility/./UtilityTests/NameMatchesTest.StartsWith (1743 of 2031) PASS: lldb-api :: functionalities/tail_call_frames/disambiguate_call_site/TestDisambiguateCallSite.py (1744 of 2031) PASS: lldb-api :: functionalities/data-formatter/data-formatter-objc/nsstring/TestDataFormatterNSString.py (1745 of 2031) PASS: lldb-shell :: SymbolFile/NativePDB/ast-methods.cpp (1746 of 2031) PASS: lldb-unit :: Host/./HostTests/NativeProcessProtocolTest.SetBreakpointFailRead (1747 of 2031) PASS: lldb-api :: functionalities/data-formatter/data-formatter-stl/libcxx/function/TestLibCxxFunction.py (1748 of 2031) UNSUPPORTED: lldb-api :: tools/lldb-vscode/completions/TestVSCode_completions.py (1749 of 2031) PASS: lldb-api :: functionalities/testid/TestTestId.py (1750 of 2031) PASS: lldb-unit :: Utility/./UtilityTests/StringExtractorTest.GetHexBytesAvail_OddPair2 (1751 of 2031) PASS: lldb-unit :: Signals/./SignalsTests/UnixSignalsTest.GetFilteredSignals (1752 of 2031) UNSUPPORTED: lldb-api :: commands/gui/basic/TestGuiBasic.py (1753 of 2031) PASS: lldb-api :: functionalities/data-formatter/data-formatter-named-summaries/TestDataFormatterNamedSummaries.py (1754 of 2031) PASS: lldb-api :: functionalities/step_scripted/TestStepScripted.py (1755 of 2031) PASS: lldb-unit :: Utility/./UtilityTests/StringExtractorTest.DecodeHexU8_Underflow (1756 of 2031) PASS: lldb-unit :: Utility/./UtilityTests/ArgsTest.TestQuotedTrailingBackslash (1757 of 2031) PASS: lldb-api :: functionalities/data-formatter/data-formatter-stl/libcxx/atomic/TestLibCxxAtomic.py (1758 of 2031) PASS: lldb-unit :: Utility/./UtilityTests/AnsiTerminal.WhiteSpace (1759 of 2031) PASS: lldb-api :: functionalities/optimized_code/TestNoASanExceptionAfterEvalOP_piece.py (1760 of 2031) PASS: lldb-api :: python_api/thread/TestThreadAPI.py (1761 of 2031) PASS: lldb-unit :: Language/Highlighting/./HighlighterTests/HighlighterTest.ClangEmptyInput (1762 of 2031) PASS: lldb-api :: python_api/interpreter/TestCommandInterpreterAPI.py (1763 of 2031) PASS: lldb-unit :: Utility/./UtilityTests/VMRange.Ordering (1764 of 2031) PASS: lldb-unit :: Core/./LLDBCoreTests/StreamCallbackTest.Callback (1765 of 2031) UNSUPPORTED: lldb-shell :: Register/aarch64-gp-read.test (1766 of 2031) PASS: lldb-unit :: Utility/./UtilityTests/StreamTeeTest.GetStreamAtIndexOutOfBounds (1767 of 2031) PASS: lldb-unit :: Utility/./UtilityTests/ArgsTest.ReplaceArgumentAtIndexLonger (1768 of 2031) PASS: lldb-api :: lang/cpp/gmodules-templates/TestGModules.py (1769 of 2031) PASS: lldb-api :: commands/expression/invalid-args/TestInvalidArgsExpression.py (1770 of 2031) PASS: lldb-unit :: UnwindAssembly/x86/./UnwindAssemblyx86Tests/Testx86AssemblyInspectionEngine.TestPushESI (1771 of 2031) PASS: lldb-api :: commands/command/script/TestCommandScript.py (1772 of 2031) PASS: lldb-unit :: Language/Highlighting/./HighlighterTests/HighlighterTest.ClangStringLiterals (1773 of 2031) PASS: lldb-api :: functionalities/data-formatter/frameformat_smallstruct/TestFrameFormatSmallStruct.py (1774 of 2031) PASS: lldb-api :: commands/command/history/TestCommandHistory.py (1775 of 2031) PASS: lldb-unit :: Symbol/./SymbolTests/TestTypeSystemClang.TestConvertAccessTypeToAccessSpecifier (1776 of 2031) PASS: lldb-unit :: Core/./LLDBCoreTests/MangledTest.NameIndexes_FindFunctionSymbols (1777 of 2031) PASS: lldb-unit :: Utility/./UtilityTests/ArgsTest.EscapeLLDBCommandArgument (1778 of 2031) PASS: lldb-api :: functionalities/gdb_remote_client/TestNestedRegDefinitions.py (1779 of 2031) PASS: lldb-unit :: Host/./HostTests/FileActionTest.Open (1780 of 2031) PASS: lldb-api :: lang/cpp/scope/TestCppScope.py (1781 of 2031) PASS: lldb-api :: commands/expression/codegen-crash-typedefdecl-not-in_declcontext/TestCodegenCrashTypedefDeclNotInDeclContext.py (1782 of 2031) XFAIL: lldb-shell :: Unwind/prefer-debug-over-eh-frame.test (1783 of 2031) PASS: lldb-unit :: Utility/./UtilityTests/ArgsTest.TestTrailingBackslash (1784 of 2031) PASS: lldb-shell :: SymbolFile/NativePDB/nested-types.cpp (1785 of 2031) PASS: lldb-unit :: Utility/./UtilityTests/RegularExpression.Invalid (1786 of 2031) PASS: lldb-unit :: Process/gdb-remote/./ProcessGdbRemoteTests/GDBRemoteCommunicationClientTest.GetQOffsets (1787 of 2031) PASS: lldb-unit :: Expression/./ExpressionTests/DiagnosticManagerTest.GetStringNoDiags (1788 of 2031) UNSUPPORTED: lldb-api :: android/platform/TestDefaultCacheLineSize.py (1789 of 2031) PASS: lldb-shell :: SymbolFile/DWARF/debug_loclists-dwo.s (1790 of 2031) PASS: lldb-shell :: Recognizer/assert.test (1791 of 2031) UNSUPPORTED: lldb-api :: functionalities/breakpoint/breakpoint_in_delayslot/TestAvoidBreakpointInDelaySlot.py (1792 of 2031) PASS: lldb-shell :: SymbolFile/DWARF/debug-types-address-ranges.s (1793 of 2031) PASS: lldb-unit :: Utility/./UtilityTests/UriParserTest.BracketedHostname (1794 of 2031) PASS: lldb-shell :: ObjectFile/wasm/embedded-debug-sections.yaml (1795 of 2031) UNSUPPORTED: lldb-api :: commands/target/auto-install-main-executable/TestAutoInstallMainExecutable.py (1796 of 2031) FAIL: lldb-api :: lang/objc/objc-optimized/TestObjcOptimized.py (1797 of 2031) ******************** TEST 'lldb-api :: lang/objc/objc-optimized/TestObjcOptimized.py' FAILED ******************** Script: -- /Users/buildslave/jenkins/workspace/lldb-cmake-sanitized/lldb-build/lldb-test-build.noindex/copied-system-python /Users/buildslave/jenkins/workspace/lldb-cmake-sanitized/llvm-project/lldb/test/API/dotest.py --arch x86_64 -s /Users/buildslave/jenkins/workspace/lldb-cmake-sanitized/lldb-build/lldb-test-traces -S nm -u CXXFLAGS -u CFLAGS --codesign-identity lldb_codesign --server /Users/buildslave/jenkins/workspace/lldb-cmake-sanitized/lldb-build/./bin/debugserver --arch x86_64 --build-dir /Users/buildslave/jenkins/workspace/lldb-cmake-sanitized/lldb-build/lldb-test-build.noindex -s=/Users/buildslave/jenkins/workspace/lldb-cmake-sanitized/test/logs -t --env TERM=vt100 --env LLVM_LIBS_DIR=/Users/buildslave/jenkins/workspace/lldb-cmake-sanitized/lldb-build/./lib --inferior-env ASAN_OPTIONS=detect_stack_use_after_return=1 --inferior-env DYLD_INSERT_LIBRARIES=/Users/buildslave/jenkins/workspace/lldb-cmake-sanitized/host-compiler/lib/clang/11.0.0/lib/darwin/libclang_rt.asan_osx_dynamic.dylib --build-dir /Users/buildslave/jenkins/workspace/lldb-cmake-sanitized/lldb-build/lldb-test-build.noindex --lldb-module-cache-dir /Users/buildslave/jenkins/workspace/lldb-cmake-sanitized/lldb-build/lldb-test-build.noindex/module-cache-lldb/lldb-api --clang-module-cache-dir /Users/buildslave/jenkins/workspace/lldb-cmake-sanitized/lldb-build/lldb-test-build.noindex/module-cache-clang/lldb-api --executable /Users/buildslave/jenkins/workspace/lldb-cmake-sanitized/lldb-build/./bin/lldb --compiler /Users/buildslave/jenkins/workspace/lldb-cmake-sanitized/lldb-build/./bin/clang --dsymutil /Users/buildslave/jenkins/workspace/lldb-cmake-sanitized/lldb-build/./bin/dsymutil --filecheck /Users/buildslave/jenkins/workspace/lldb-cmake-sanitized/lldb-build/./bin/FileCheck --lldb-libs-dir /Users/buildslave/jenkins/workspace/lldb-cmake-sanitized/lldb-build/./lib /Users/buildslave/jenkins/workspace/lldb-cmake-sanitized/llvm-project/lldb/test/API/lang/objc/objc-optimized -p TestObjcOptimized.py -- Exit Code: -6

Hide Details

Command Output (stdout): -- lldb version 11.0.99 clang revision 01899bb4e41178af6f4cf7b32833e661fe1e3322 llvm revision 01899bb4e41178af6f4cf7b32833e661fe1e3322 a.out was compiled with optimization - stepping may behave oddly; variables may not be available. a.out was compiled with optimization - stepping may behave oddly; variables may not be available. a.out was compiled with optimization - stepping may behave oddly; variables may not be available.

Hide Details

-- Command Output (stderr): -- Assertion failed: (tokenKind == tok::kw___bridge_retain), function ParseParenExpression, file /Users/buildslave/jenkins/workspace/lldb-cmake-sanitized/llvm-project/clang/lib/Parse/ParseExpr.cpp, line 2819.

Hide Details

--

Hide Details

******************** PASS: lldb-unit :: Utility/./UtilityTests/UriParserTest.MinimalPath (1798 of 2031) PASS: lldb-api :: lang/objc/objc-checker/TestObjCCheckers.py (1799 of 2031) PASS: lldb-api :: functionalities/postmortem/elf-core/thread_crash/TestLinuxCoreThreads.py (1800 of 2031) PASS: lldb-api :: functionalities/thread/concurrent_events/TestConcurrentSignalNWatchNBreak.py (1801 of 2031) PASS: lldb-api :: lang/cpp/wchar_t/TestCxxWCharT.py (1802 of 2031) PASS: lldb-unit :: Utility/./UtilityTests/BinaryStreamTest.PutSLEB128ThreeBytes (1803 of 2031) PASS: lldb-unit :: Symbol/./SymbolTests/TestTypeSystemClang.TestUnifyAccessSpecifiers (1804 of 2031) PASS: lldb-api :: lang/objcxx/class-name-clash/TestNameClash.py (1805 of 2031) PASS: lldb-unit :: Utility/./UtilityTests/ArgsTest.AppendArguments (1806 of 2031) PASS: lldb-unit :: Host/./HostTests/File.GetStreamFromDescriptor (1807 of 2031) PASS: lldb-unit :: Utility/./UtilityTests/RangeDataVector.FindEntryThatContains (1808 of 2031) PASS: lldb-api :: commands/expression/timeout/TestCallWithTimeout.py (1809 of 2031) PASS: lldb-unit :: Utility/./UtilityTests/TimeoutTest.Format (1810 of 2031) PASS: lldb-unit :: Utility/./UtilityTests/ArgsTest.TestArgv (1811 of 2031) PASS: lldb-shell :: SymbolFile/DWARF/DW_AT_low_pc-addrx.s (1812 of 2031) PASS: lldb-unit :: Utility/./UtilityTests/StringExtractorTest.GetU32LittleEndian (1813 of 2031) PASS: lldb-api :: commands/expression/top-level/TestTopLevelExprs.py (1814 of 2031) PASS: lldb-unit :: ScriptInterpreter/Python/./ScriptInterpreterPythonTests/PythonDataObjectsTest.TestPythonIntegerToStr (1815 of 2031) PASS: lldb-shell :: Reproducer/Functionalities/TestExpressionEvaluation.test (1816 of 2031) PASS: lldb-unit :: Utility/./UtilityTests/StringLexerTest.Peek (1817 of 2031) PASS: lldb-unit :: Language/Highlighting/./HighlighterTests/HighlighterTest.ClangCursorPosEndOfLine (1818 of 2031) PASS: lldb-api :: lang/cpp/accelerator-table/TestCPPAccelerator.py (1819 of 2031) PASS: lldb-api :: functionalities/breakpoint/inlined_breakpoints/TestInlinedBreakpoints.py (1820 of 2031) PASS: lldb-api :: commands/expression/cast_int_to_anonymous_enum/TestCastIntToAnonymousEnum.py (1821 of 2031) PASS: lldb-api :: commands/frame/diagnose/dereference-function-return/TestDiagnoseDereferenceFunctionReturn.py (1822 of 2031) UNSUPPORTED: lldb-api :: tools/intel-features/intel-pt/test/TestIntelPTSimpleBinary.py (1823 of 2031) UNSUPPORTED: lldb-shell :: Register/arm-fp-read.test (1824 of 2031) PASS: lldb-api :: functionalities/inline-stepping/TestInlineStepping.py (1825 of 2031) PASS: lldb-api :: python_api/value/empty_class/TestValueAPIEmptyClass.py (1826 of 2031) UNSUPPORTED: lldb-api :: functionalities/ptr_refs/TestPtrRefs.py (1827 of 2031) PASS: lldb-api :: commands/log/invalid-args/TestInvalidArgsLog.py (1828 of 2031) PASS: lldb-unit :: Utility/./UtilityTests/LogChannelEnabledTest.LogVerboseThread (1829 of 2031) PASS: lldb-unit :: Expression/./ExpressionTests/ClangExpressionDeclMapTest.TestPersistentDeclLookup (1830 of 2031) PASS: lldb-api :: tools/lldb-vscode/breakpoint/TestVSCode_setFunctionBreakpoints.py (1831 of 2031) PASS: lldb-api :: functionalities/data-formatter/data-formatter-stl/libcxx/list/loop/TestDataFormatterLibcxxListLoop.py (1832 of 2031) PASS: lldb-unit :: ScriptInterpreter/Python/./ScriptInterpreterPythonTests/PythonDataObjectsTest.TestResetting (1833 of 2031) XFAIL: lldb-shell :: Register/x86-mm-xmm-write.test (1834 of 2031) PASS: lldb-api :: tools/lldb-vscode/variables/TestVSCode_variables.py (1835 of 2031) PASS: lldb-unit :: Utility/./UtilityTests/OptionsWithRawTest.ArgsButNoLeadingDash (1836 of 2031) PASS: lldb-shell :: ObjectFile/ELF/PT_TLS-overlap-PT_LOAD.yaml (1837 of 2031) PASS: lldb-unit :: Utility/./UtilityTests/StringListTest.AppendStringMove (1838 of 2031) PASS: lldb-api :: commands/watchpoints/watchpoint_on_vectors/TestValueOfVectorVariable.py (1839 of 2031) PASS: lldb-api :: lang/cpp/dynamic-value/TestDynamicValue.py (1840 of 2031) PASS: lldb-api :: tools/lldb-server/TestLldbGdbServer.py (1841 of 2031) PASS: lldb-unit :: Expression/./ExpressionTests/CppModuleConfigurationTest.AmbiguousCLib (1842 of 2031) PASS: lldb-api :: commands/expression/options/TestExprOptions.py (1843 of 2031) PASS: lldb-api :: functionalities/data-formatter/data-formatter-cpp/TestDataFormatterCpp.py (1844 of 2031) PASS: lldb-unit :: Symbol/./SymbolTests/TestTypeSystemClang.TemplateArguments (1845 of 2031) PASS: lldb-shell :: SymbolFile/DWARF/debug-types-dwarf5.s (1846 of 2031) PASS: lldb-api :: functionalities/breakpoint/source_regexp/TestSourceRegexBreakpoints.py (1847 of 2031) PASS: lldb-api :: lang/cpp/unique-types/TestUniqueTypes.py (1848 of 2031) PASS: lldb-unit :: Utility/./UtilityTests/StringListTest.ForRangeEmpty (1849 of 2031) PASS: lldb-unit :: Symbol/./SymbolTests/TestTypeSystemClang.TestOwningModule (1850 of 2031) PASS: lldb-api :: lang/cpp/namespace/TestNamespace.py (1851 of 2031) PASS: lldb-unit :: Editline/./EditlineTests/EditlineTestFixture.EditlineReceivesMultiLineText (1852 of 2031) PASS: lldb-unit :: Expression/./ExpressionTests/DWARFExpression.DW_OP_stack_value (1853 of 2031) PASS: lldb-shell :: Settings/TestModuleCacheSanity.test (1854 of 2031) PASS: lldb-api :: lang/cpp/function-qualifiers/TestCppFunctionQualifiers.py (1855 of 2031) PASS: lldb-unit :: Process/gdb-remote/./ProcessGdbRemoteTests/GDBRemoteClientBaseTest.InterruptNoResponse (1856 of 2031) PASS: lldb-unit :: UnwindAssembly/x86/./UnwindAssemblyx86Tests/Testx86AssemblyInspectionEngine.TestPushEDI (1857 of 2031) PASS: lldb-unit :: Utility/./UtilityTests/AnsiTerminal.Empty (1858 of 2031) PASS: lldb-unit :: Language/Highlighting/./HighlighterTests/HighlighterTest.FallbackHighlighter (1859 of 2031) PASS: lldb-api :: functionalities/process_crash_info/TestProcessCrashInfo.py (1860 of 2031) PASS: lldb-unit :: Expression/./ExpressionTests/DiagnosticManagerTest.GetStringMultipleDiags (1861 of 2031) PASS: lldb-unit :: Core/./LLDBCoreTests/MangledTest.EmptyForInvalidName (1862 of 2031) PASS: lldb-api :: lang/c/strings/TestCStrings.py (1863 of 2031) PASS: lldb-unit :: Utility/./UtilityTests/StringExtractorTest.GetU32BigEndian (1864 of 2031) PASS: lldb-api :: functionalities/data-formatter/setvaluefromcstring/TestSetValueFromCString.py (1865 of 2031) PASS: lldb-api :: lang/c/modules/TestCModules.py (1866 of 2031) PASS: lldb-unit :: Utility/./UtilityTests/RecordReplayTest.InstrumentedBar (1867 of 2031) PASS: lldb-unit :: Utility/./UtilityTests/UriParserTest.SchemeHostSeparator (1868 of 2031) PASS: lldb-unit :: Utility/./UtilityTests/VMRange.IsValid (1869 of 2031) PASS: lldb-unit :: Utility/./UtilityTests/StringExtractorTest.GetU64LittleEndian (1870 of 2031) UNSUPPORTED: lldb-shell :: ObjectFile/ELF/minidebuginfo-set-and-hit-breakpoint.test (1871 of 2031) PASS: lldb-unit :: Host/./HostTests/SocketTest.DecodeHostAndPort (1872 of 2031) PASS: lldb-unit :: Utility/./UtilityTests/AnsiTerminal.Unknown (1873 of 2031) PASS: lldb-api :: functionalities/breakpoint/cpp/TestCPPBreakpointLocations.py (1874 of 2031) PASS: lldb-api :: commands/frame/diagnose/bad-reference/TestBadReference.py (1875 of 2031) PASS: lldb-unit :: Utility/./UtilityTests/LogChannelTest.EnableOptions (1876 of 2031) PASS: lldb-unit :: Utility/./UtilityTests/StringListTest.InsertStringAtIndexOutOfBounds (1877 of 2031) PASS: lldb-api :: sample_test/TestSampleTest.py (1878 of 2031) PASS: lldb-api :: functionalities/breakpoint/step_over_breakpoint/TestStepOverBreakpoint.py (1879 of 2031) PASS: lldb-unit :: Core/./LLDBCoreTests/RichManglingContextTest.SwitchProvider (1880 of 2031) PASS: lldb-api :: lang/cpp/multiple-inheritance/TestCppMultipleInheritance.py (1881 of 2031) PASS: lldb-api :: commands/reproducer/invalid-args/TestInvalidArgsReproducer.py (1882 of 2031) PASS: lldb-api :: functionalities/dead-strip/TestDeadStrip.py (1883 of 2031) FAIL: lldb-api :: functionalities/set-data/TestSetData.py (1884 of 2031) ******************** TEST 'lldb-api :: functionalities/set-data/TestSetData.py' FAILED ******************** Script: -- /Users/buildslave/jenkins/workspace/lldb-cmake-sanitized/lldb-build/lldb-test-build.noindex/copied-system-python /Users/buildslave/jenkins/workspace/lldb-cmake-sanitized/llvm-project/lldb/test/API/dotest.py --arch x86_64 -s /Users/buildslave/jenkins/workspace/lldb-cmake-sanitized/lldb-build/lldb-test-traces -S nm -u CXXFLAGS -u CFLAGS --codesign-identity lldb_codesign --server /Users/buildslave/jenkins/workspace/lldb-cmake-sanitized/lldb-build/./bin/debugserver --arch x86_64 --build-dir /Users/buildslave/jenkins/workspace/lldb-cmake-sanitized/lldb-build/lldb-test-build.noindex -s=/Users/buildslave/jenkins/workspace/lldb-cmake-sanitized/test/logs -t --env TERM=vt100 --env LLVM_LIBS_DIR=/Users/buildslave/jenkins/workspace/lldb-cmake-sanitized/lldb-build/./lib --inferior-env ASAN_OPTIONS=detect_stack_use_after_return=1 --inferior-env DYLD_INSERT_LIBRARIES=/Users/buildslave/jenkins/workspace/lldb-cmake-sanitized/host-compiler/lib/clang/11.0.0/lib/darwin/libclang_rt.asan_osx_dynamic.dylib --build-dir /Users/buildslave/jenkins/workspace/lldb-cmake-sanitized/lldb-build/lldb-test-build.noindex --lldb-module-cache-dir /Users/buildslave/jenkins/workspace/lldb-cmake-sanitized/lldb-build/lldb-test-build.noindex/module-cache-lldb/lldb-api --clang-module-cache-dir /Users/buildslave/jenkins/workspace/lldb-cmake-sanitized/lldb-build/lldb-test-build.noindex/module-cache-clang/lldb-api --executable /Users/buildslave/jenkins/workspace/lldb-cmake-sanitized/lldb-build/./bin/lldb --compiler /Users/buildslave/jenkins/workspace/lldb-cmake-sanitized/lldb-build/./bin/clang --dsymutil /Users/buildslave/jenkins/workspace/lldb-cmake-sanitized/lldb-build/./bin/dsymutil --filecheck /Users/buildslave/jenkins/workspace/lldb-cmake-sanitized/lldb-build/./bin/FileCheck --lldb-libs-dir /Users/buildslave/jenkins/workspace/lldb-cmake-sanitized/lldb-build/./lib /Users/buildslave/jenkins/workspace/lldb-cmake-sanitized/llvm-project/lldb/test/API/functionalities/set-data -p TestSetData.py -- Exit Code: -6

Hide Details

Command Output (stdout): -- lldb version 11.0.99 clang revision 01899bb4e41178af6f4cf7b32833e661fe1e3322 llvm revision 01899bb4e41178af6f4cf7b32833e661fe1e3322

Hide Details

-- Command Output (stderr): -- Assertion failed: (tokenKind == tok::kw___bridge_retain), function ParseParenExpression, file /Users/buildslave/jenkins/workspace/lldb-cmake-sanitized/llvm-project/clang/lib/Parse/ParseExpr.cpp, line 2819.

Hide Details

--

Hide Details

******************** PASS: lldb-unit :: Process/minidump/./LLDBMinidumpTests/MinidumpParserTest.InvalidMinidump (1885 of 2031) PASS: lldb-shell :: Commands/command-thread-select.test (1886 of 2031) PASS: lldb-unit :: Utility/./UtilityTests/StreamTest.QuotedCString (1887 of 2031) PASS: lldb-unit :: Process/minidump/./LLDBMinidumpTests/MinidumpParserTest.FindMemoryRange (1888 of 2031) PASS: lldb-unit :: debugserver/./debugserverTests/RNBSocket.LoopBackListenIPv4 (1889 of 2031) PASS: lldb-api :: functionalities/inferior-crashing/TestInferiorCrashing.py (1890 of 2031) PASS: lldb-unit :: Utility/./UtilityTests/RangeTest.ContainsEndInclusive (1891 of 2031) UNSUPPORTED: lldb-shell :: Breakpoint/ppc64-localentry.test (1892 of 2031) UNSUPPORTED: lldb-shell :: ScriptInterpreter/Lua/lua.test (1893 of 2031) PASS: lldb-api :: commands/target/create-no-such-arch/TestNoSuchArch.py (1894 of 2031) PASS: lldb-unit :: Host/./HostTests/NativeProcessProtocolTest.SetBreakpoint (1895 of 2031) PASS: lldb-unit :: ScriptInterpreter/Python/./ScriptInterpreterPythonTests/PythonDataObjectsTest.TestScript (1896 of 2031) PASS: lldb-unit :: Utility/./UtilityTests/LogTest.LLDB_LOG_nullptr (1897 of 2031) PASS: lldb-shell :: Settings/TestStopCommandSourceOnError.test (1898 of 2031) PASS: lldb-shell :: Reproducer/TestReuseDirectory.test (1899 of 2031) PASS: lldb-unit :: Host/./HostTests/MainLoopTest.TerminatesImmediately (1900 of 2031) PASS: lldb-api :: python_api/hello_world/TestHelloWorld.py (1901 of 2031) UNSUPPORTED: lldb-shell :: Register/x86-64-xmm16-read.test (1902 of 2031) PASS: lldb-api :: lang/cpp/unicode-literals/TestUnicodeLiterals.py (1903 of 2031) PASS: lldb-unit :: Utility/./UtilityTests/RangeTest.NotEqualInvalid (1904 of 2031) PASS: lldb-shell :: SymbolFile/DWARF/find-basic-type.cpp (1905 of 2031) PASS: lldb-unit :: Host/./HostTests/ConnectionFileDescriptorTest.TCPGetURIv4 (1906 of 2031) PASS: lldb-unit :: Utility/./UtilityTests/StreamTest.PutHex32ByteOrderBig (1907 of 2031) PASS: lldb-shell :: Minidump/dump-all.test (1908 of 2031) PASS: lldb-api :: tools/lldb-vscode/console/TestVSCode_console.py (1909 of 2031) PASS: lldb-unit :: ObjectFile/Breakpad/./ObjectFileBreakpadTests/LineRecord.parse (1910 of 2031) PASS: lldb-unit :: UnwindAssembly/x86/./UnwindAssemblyx86Tests/Testx86AssemblyInspectionEngine.TestSpillRegToStackViaMOVi386 (1911 of 2031) PASS: lldb-api :: macosx/nslog/TestDarwinNSLogOutput.py (1912 of 2031) PASS: lldb-api :: lang/cpp/class-template-parameter-pack/TestClassTemplateParameterPack.py (1913 of 2031) PASS: lldb-unit :: Utility/./UtilityTests/StreamTest.PutRawBytesToBigEndian (1914 of 2031) PASS: lldb-shell :: ObjectFile/Breakpad/uuid-matching-mac.test (1915 of 2031) PASS: lldb-shell :: SymbolFile/NativePDB/ast-types.cpp (1916 of 2031) PASS: lldb-api :: macosx/function-starts/TestFunctionStarts.py (1917 of 2031) PASS: lldb-unit :: Symbol/./SymbolTests/DWARFCallFrameInfoTest.Basic_eh (1918 of 2031) PASS: lldb-unit :: Host/./HostTests/FileSystemTest.EmptyTest (1919 of 2031) PASS: lldb-api :: functionalities/breakpoint/dummy_target_breakpoints/TestBreakpointsWithNoTargets.py (1920 of 2031) PASS: lldb-api :: functionalities/inferior-crashing/TestInferiorCrashingStep.py (1921 of 2031) PASS: lldb-api :: functionalities/data-formatter/data-formatter-objc/TestDataFormatterObjCNSBundle.py (1922 of 2031) FAIL: lldb-api :: commands/expression/context-object-objc/TestContextObjectObjc.py (1923 of 2031) ******************** TEST 'lldb-api :: commands/expression/context-object-objc/TestContextObjectObjc.py' FAILED ******************** Script: -- /Users/buildslave/jenkins/workspace/lldb-cmake-sanitized/lldb-build/lldb-test-build.noindex/copied-system-python /Users/buildslave/jenkins/workspace/lldb-cmake-sanitized/llvm-project/lldb/test/API/dotest.py --arch x86_64 -s /Users/buildslave/jenkins/workspace/lldb-cmake-sanitized/lldb-build/lldb-test-traces -S nm -u CXXFLAGS -u CFLAGS --codesign-identity lldb_codesign --server /Users/buildslave/jenkins/workspace/lldb-cmake-sanitized/lldb-build/./bin/debugserver --arch x86_64 --build-dir /Users/buildslave/jenkins/workspace/lldb-cmake-sanitized/lldb-build/lldb-test-build.noindex -s=/Users/buildslave/jenkins/workspace/lldb-cmake-sanitized/test/logs -t --env TERM=vt100 --env LLVM_LIBS_DIR=/Users/buildslave/jenkins/workspace/lldb-cmake-sanitized/lldb-build/./lib --inferior-env ASAN_OPTIONS=detect_stack_use_after_return=1 --inferior-env DYLD_INSERT_LIBRARIES=/Users/buildslave/jenkins/workspace/lldb-cmake-sanitized/host-compiler/lib/clang/11.0.0/lib/darwin/libclang_rt.asan_osx_dynamic.dylib --build-dir /Users/buildslave/jenkins/workspace/lldb-cmake-sanitized/lldb-build/lldb-test-build.noindex --lldb-module-cache-dir /Users/buildslave/jenkins/workspace/lldb-cmake-sanitized/lldb-build/lldb-test-build.noindex/module-cache-lldb/lldb-api --clang-module-cache-dir /Users/buildslave/jenkins/workspace/lldb-cmake-sanitized/lldb-build/lldb-test-build.noindex/module-cache-clang/lldb-api --executable /Users/buildslave/jenkins/workspace/lldb-cmake-sanitized/lldb-build/./bin/lldb --compiler /Users/buildslave/jenkins/workspace/lldb-cmake-sanitized/lldb-build/./bin/clang --dsymutil /Users/buildslave/jenkins/workspace/lldb-cmake-sanitized/lldb-build/./bin/dsymutil --filecheck /Users/buildslave/jenkins/workspace/lldb-cmake-sanitized/lldb-build/./bin/FileCheck --lldb-libs-dir /Users/buildslave/jenkins/workspace/lldb-cmake-sanitized/lldb-build/./lib /Users/buildslave/jenkins/workspace/lldb-cmake-sanitized/llvm-project/lldb/test/API/commands/expression/context-object-objc -p TestContextObjectObjc.py -- Exit Code: -6

Hide Details

Command Output (stdout): -- lldb version 11.0.99 clang revision 01899bb4e41178af6f4cf7b32833e661fe1e3322 llvm revision 01899bb4e41178af6f4cf7b32833e661fe1e3322

Hide Details

-- Command Output (stderr): -- Assertion failed: (tokenKind == tok::kw___bridge_retain), function ParseParenExpression, file /Users/buildslave/jenkins/workspace/lldb-cmake-sanitized/llvm-project/clang/lib/Parse/ParseExpr.cpp, line 2819.

Hide Details

--

Hide Details

******************** PASS: lldb-unit :: Utility/./UtilityTests/RangeTest.ContainsRangeStartingFromZero (1924 of 2031) PASS: lldb-unit :: ObjectFile/PECOFF/./ObjectFilePECOFFTests/PECallFrameInfoTest.Frame_reg_eh (1925 of 2031) PASS: lldb-unit :: Symbol/./SymbolTests/TestTypeSystemClang.TestDisplayName (1926 of 2031) PASS: lldb-api :: tools/lldb-vscode/attach/TestVSCode_attach.py (1927 of 2031) PASS: lldb-api :: functionalities/postmortem/minidump-new/TestMiniDumpUUID.py (1928 of 2031) PASS: lldb-api :: commands/expression/function_template_specialization_temp_args/TestFunctionTemplateSpecializationTempArgs.py (1929 of 2031) PASS: lldb-unit :: Utility/./UtilityTests/UriParserTest.BracketedHostnamePort (1930 of 2031) PASS: lldb-shell :: SymbolFile/NativePDB/break-by-line.cpp (1931 of 2031) FAIL: lldb-api :: lang/objc/objc-super/TestObjCSuper.py (1932 of 2031) ******************** TEST 'lldb-api :: lang/objc/objc-super/TestObjCSuper.py' FAILED ******************** Script: -- /Users/buildslave/jenkins/workspace/lldb-cmake-sanitized/lldb-build/lldb-test-build.noindex/copied-system-python /Users/buildslave/jenkins/workspace/lldb-cmake-sanitized/llvm-project/lldb/test/API/dotest.py --arch x86_64 -s /Users/buildslave/jenkins/workspace/lldb-cmake-sanitized/lldb-build/lldb-test-traces -S nm -u CXXFLAGS -u CFLAGS --codesign-identity lldb_codesign --server /Users/buildslave/jenkins/workspace/lldb-cmake-sanitized/lldb-build/./bin/debugserver --arch x86_64 --build-dir /Users/buildslave/jenkins/workspace/lldb-cmake-sanitized/lldb-build/lldb-test-build.noindex -s=/Users/buildslave/jenkins/workspace/lldb-cmake-sanitized/test/logs -t --env TERM=vt100 --env LLVM_LIBS_DIR=/Users/buildslave/jenkins/workspace/lldb-cmake-sanitized/lldb-build/./lib --inferior-env ASAN_OPTIONS=detect_stack_use_after_return=1 --inferior-env DYLD_INSERT_LIBRARIES=/Users/buildslave/jenkins/workspace/lldb-cmake-sanitized/host-compiler/lib/clang/11.0.0/lib/darwin/libclang_rt.asan_osx_dynamic.dylib --build-dir /Users/buildslave/jenkins/workspace/lldb-cmake-sanitized/lldb-build/lldb-test-build.noindex --lldb-module-cache-dir /Users/buildslave/jenkins/workspace/lldb-cmake-sanitized/lldb-build/lldb-test-build.noindex/module-cache-lldb/lldb-api --clang-module-cache-dir /Users/buildslave/jenkins/workspace/lldb-cmake-sanitized/lldb-build/lldb-test-build.noindex/module-cache-clang/lldb-api --executable /Users/buildslave/jenkins/workspace/lldb-cmake-sanitized/lldb-build/./bin/lldb --compiler /Users/buildslave/jenkins/workspace/lldb-cmake-sanitized/lldb-build/./bin/clang --dsymutil /Users/buildslave/jenkins/workspace/lldb-cmake-sanitized/lldb-build/./bin/dsymutil --filecheck /Users/buildslave/jenkins/workspace/lldb-cmake-sanitized/lldb-build/./bin/FileCheck --lldb-libs-dir /Users/buildslave/jenkins/workspace/lldb-cmake-sanitized/lldb-build/./lib /Users/buildslave/jenkins/workspace/lldb-cmake-sanitized/llvm-project/lldb/test/API/lang/objc/objc-super -p TestObjCSuper.py -- Exit Code: -6

Hide Details

Command Output (stdout): -- lldb version 11.0.99 clang revision 01899bb4e41178af6f4cf7b32833e661fe1e3322 llvm revision 01899bb4e41178af6f4cf7b32833e661fe1e3322

Hide Details

-- Command Output (stderr): -- Assertion failed: (tokenKind == tok::kw___bridge_retain), function ParseParenExpression, file /Users/buildslave/jenkins/workspace/lldb-cmake-sanitized/llvm-project/clang/lib/Parse/ParseExpr.cpp, line 2819.

Hide Details

--

Hide Details

******************** PASS: lldb-unit :: Utility/./UtilityTests/StringExtractorTest.GetHexU8_Extra (1933 of 2031) PASS: lldb-api :: functionalities/data-formatter/format-propagation/TestFormatPropagation.py (1934 of 2031) PASS: lldb-unit :: Utility/./UtilityTests/PassiveReplayTest.InstrumentedBarRef (1935 of 2031) PASS: lldb-unit :: Process/minidump/./LLDBMinidumpTests/RegisterContextMinidump.CheckRegisterContextMinidump_ARM (1936 of 2031) PASS: lldb-api :: python_api/value/change_values/TestChangeValueAPI.py (1937 of 2031) PASS: lldb-shell :: Quit/TestQuitExitCode30.test (1938 of 2031) PASS: lldb-unit :: Utility/./UtilityTests/StatusTest.ErrorConversion (1939 of 2031) PASS: lldb-shell :: SymbolFile/DWARF/apple-index-is-used.cpp (1940 of 2031) PASS: lldb-unit :: UnwindAssembly/x86/./UnwindAssemblyx86Tests/Testx86AssemblyInspectionEngine.TestSpillRegToStackViaMOVx86_64 (1941 of 2031) PASS: lldb-shell :: SymbolFile/DWARF/dir-separator-no-comp-dir-relative-name.s (1942 of 2031) PASS: lldb-api :: tools/lldb-server/commandline/TestStubReverseConnect.py (1943 of 2031) UNSUPPORTED: lldb-shell :: SymbolFile/PDB/ast-restore.test (1944 of 2031) PASS: lldb-shell :: Host/TestCustomShell.test (1945 of 2031) PASS: lldb-shell :: SymbolFile/DWARF/DW_AT_loclists_base.s (1946 of 2031) PASS: lldb-shell :: Quit/TestQuitExitCodeNonInt.test (1947 of 2031) PASS: lldb-unit :: Utility/./UtilityTests/StringListTest.Join (1948 of 2031) PASS: lldb-unit :: Utility/./UtilityTests/BroadcasterTest.BroadcastEvent (1949 of 2031) UNSUPPORTED: lldb-shell :: Process/Windows/exception_access_violation.cpp (1950 of 2031) PASS: lldb-api :: commands/expression/import-std-module/weak_ptr/TestWeakPtrFromStdModule.py (1951 of 2031) PASS: lldb-shell :: SymbolFile/DWARF/dwarf5-atomic.s (1952 of 2031) PASS: lldb-api :: macosx/indirect_symbol/TestIndirectSymbols.py (1953 of 2031) PASS: lldb-unit :: Process/minidump/./LLDBMinidumpTests/MinidumpParserTest.GetThreadContext_x86_32 (1954 of 2031) PASS: lldb-unit :: Utility/./UtilityTests/UriParserTest.BracketedHostnameWithPortIPv4 (1955 of 2031) PASS: lldb-api :: python_api/sbenvironment/TestSBEnvironment.py (1956 of 2031) PASS: lldb-shell :: Commands/command-target-modules-dump-sections.yaml (1957 of 2031) PASS: lldb-api :: python_api/watchpoint/watchlocation/TestSetWatchlocation.py (1958 of 2031) PASS: lldb-api :: functionalities/data-formatter/refpointer-recursion/TestDataFormatterRefPtrRecursion.py (1959 of 2031) PASS: lldb-api :: types/TestDoubleTypesExpr.py (1960 of 2031) PASS: lldb-unit :: Host/./HostTests/FileSystemTest.Resolve (1961 of 2031) PASS: lldb-api :: commands/expression/completion-in-lambda-and-unnamed-class/TestCompletionInLambdaAndUnnamedClass.py (1962 of 2031) PASS: lldb-unit :: Symbol/./SymbolTests/TestClangASTImporter.CopyDeclTagDecl (1963 of 2031) PASS: lldb-shell :: ExecControl/StopHook/stop-hook.test (1964 of 2031) PASS: lldb-unit :: Utility/./UtilityTests/RegularExpression.Valid (1965 of 2031) PASS: lldb-unit :: Utility/./UtilityTests/XcodeSDKTest.SDKSupportsModules (1966 of 2031) PASS: lldb-unit :: Utility/./UtilityTests/UUIDTest.Validity (1967 of 2031) PASS: lldb-api :: api/multithreaded/TestMultithreaded.py (1968 of 2031) PASS: lldb-shell :: SymbolFile/DWARF/debug_loc.s (1969 of 2031) FAIL: lldb-api :: lang/objc/foundation/TestRuntimeTypes.py (1970 of 2031) ******************** TEST 'lldb-api :: lang/objc/foundation/TestRuntimeTypes.py' FAILED ******************** Script: -- /Users/buildslave/jenkins/workspace/lldb-cmake-sanitized/lldb-build/lldb-test-build.noindex/copied-system-python /Users/buildslave/jenkins/workspace/lldb-cmake-sanitized/llvm-project/lldb/test/API/dotest.py --arch x86_64 -s /Users/buildslave/jenkins/workspace/lldb-cmake-sanitized/lldb-build/lldb-test-traces -S nm -u CXXFLAGS -u CFLAGS --codesign-identity lldb_codesign --server /Users/buildslave/jenkins/workspace/lldb-cmake-sanitized/lldb-build/./bin/debugserver --arch x86_64 --build-dir /Users/buildslave/jenkins/workspace/lldb-cmake-sanitized/lldb-build/lldb-test-build.noindex -s=/Users/buildslave/jenkins/workspace/lldb-cmake-sanitized/test/logs -t --env TERM=vt100 --env LLVM_LIBS_DIR=/Users/buildslave/jenkins/workspace/lldb-cmake-sanitized/lldb-build/./lib --inferior-env ASAN_OPTIONS=detect_stack_use_after_return=1 --inferior-env DYLD_INSERT_LIBRARIES=/Users/buildslave/jenkins/workspace/lldb-cmake-sanitized/host-compiler/lib/clang/11.0.0/lib/darwin/libclang_rt.asan_osx_dynamic.dylib --build-dir /Users/buildslave/jenkins/workspace/lldb-cmake-sanitized/lldb-build/lldb-test-build.noindex --lldb-module-cache-dir /Users/buildslave/jenkins/workspace/lldb-cmake-sanitized/lldb-build/lldb-test-build.noindex/module-cache-lldb/lldb-api --clang-module-cache-dir /Users/buildslave/jenkins/workspace/lldb-cmake-sanitized/lldb-build/lldb-test-build.noindex/module-cache-clang/lldb-api --executable /Users/buildslave/jenkins/workspace/lldb-cmake-sanitized/lldb-build/./bin/lldb --compiler /Users/buildslave/jenkins/workspace/lldb-cmake-sanitized/lldb-build/./bin/clang --dsymutil /Users/buildslave/jenkins/workspace/lldb-cmake-sanitized/lldb-build/./bin/dsymutil --filecheck /Users/buildslave/jenkins/workspace/lldb-cmake-sanitized/lldb-build/./bin/FileCheck --lldb-libs-dir /Users/buildslave/jenkins/workspace/lldb-cmake-sanitized/lldb-build/./lib /Users/buildslave/jenkins/workspace/lldb-cmake-sanitized/llvm-project/lldb/test/API/lang/objc/foundation -p TestRuntimeTypes.py -- Exit Code: -6

Hide Details

Command Output (stdout): -- lldb version 11.0.99 clang revision 01899bb4e41178af6f4cf7b32833e661fe1e3322 llvm revision 01899bb4e41178af6f4cf7b32833e661fe1e3322

Hide Details

-- Command Output (stderr): -- Assertion failed: (tokenKind == tok::kw___bridge_retain), function ParseParenExpression, file /Users/buildslave/jenkins/workspace/lldb-cmake-sanitized/llvm-project/clang/lib/Parse/ParseExpr.cpp, line 2819.

Hide Details

--

Hide Details

******************** UNSUPPORTED: lldb-shell :: Watchpoint/netbsd-nouserdbregs.test (1971 of 2031) PASS: lldb-unit :: Host/./HostTests/Host.WaitStatusFormat (1972 of 2031) PASS: lldb-unit :: Expression/./ExpressionTests/CppModuleConfigurationTest.LibCppV2 (1973 of 2031) PASS: lldb-unit :: Host/./HostTests/SocketAddressTest.Set (1974 of 2031) PASS: lldb-unit :: Utility/./UtilityTests/SerializationRountripTest.SerializeDeserializePod (1975 of 2031) PASS: lldb-unit :: Utility/./UtilityTests/OptionsWithRawTest.WhitespaceSuffix (1976 of 2031) PASS: lldb-api :: functionalities/lazy-loading/TestLazyLoading.py (1977 of 2031) PASS: lldb-api :: functionalities/inferior-crashing/recursive-inferior/TestRecursiveInferior.py (1978 of 2031) PASS: lldb-api :: functionalities/breakpoint/auto_continue/TestBreakpointAutoContinue.py (1979 of 2031) PASS: lldb-shell :: ObjectFile/Breakpad/breakpad-identification.test (1980 of 2031) PASS: lldb-api :: lang/cpp/bitfields/TestCppBitfields.py (1981 of 2031) UNSUPPORTED: lldb-shell :: ScriptInterpreter/Lua/breakpoint_callback.test (1982 of 2031) PASS: lldb-api :: functionalities/tail_call_frames/disambiguate_paths_to_common_sink/TestDisambiguatePathsToCommonSink.py (1983 of 2031) PASS: lldb-unit :: ObjectFile/Breakpad/./ObjectFileBreakpadTests/StackCFIRecord.parse (1984 of 2031) PASS: lldb-api :: functionalities/gdb_remote_client/TestRestartBug.py (1985 of 2031) PASS: lldb-api :: lang/objc/modules-cache/TestClangModulesCache.py (1986 of 2031) PASS: lldb-api :: functionalities/breakpoint/breakpoint_hit_count/TestBreakpointHitCount.py (1987 of 2031) PASS: lldb-unit :: ObjectFile/Breakpad/./ObjectFileBreakpadTests/Record.classify (1988 of 2031) PASS: lldb-api :: commands/expression/import-std-module/sysroot/TestStdModuleSysroot.py (1989 of 2031) PASS: lldb-api :: commands/frame/diagnose/virtual-method-call/TestDiagnoseDereferenceVirtualMethodCall.py (1990 of 2031) PASS: lldb-unit :: Utility/./UtilityTests/NameMatchesTest.Equals (1991 of 2031) PASS: lldb-api :: lang/objc/modules-app-update/TestClangModulesAppUpdate.py (1992 of 2031) PASS: lldb-api :: commands/platform/process/list/TestProcessList.py (1993 of 2031) PASS: lldb-unit :: Utility/./UtilityTests/StringListTest.SetSize (1994 of 2031) PASS: lldb-unit :: ObjectFile/Breakpad/./ObjectFileBreakpadTests/ModuleRecord.parse (1995 of 2031) PASS: lldb-shell :: SymbolFile/DWARF/win-i386-line-table.s (1996 of 2031) PASS: lldb-unit :: Utility/./UtilityTests/OptionsWithRawTest.SingleWordSuffix (1997 of 2031) PASS: lldb-api :: tools/lldb-vscode/launch/TestVSCode_launch.py (1998 of 2031) UNSUPPORTED: lldb-api :: arm/breakpoint-it/TestBreakpointIt.py (1999 of 2031) PASS: lldb-unit :: Symbol/./SymbolTests/TestTypeSystemClang.TestGetEnumIntegerTypeBasicTypes (2000 of 2031) PASS: lldb-unit :: Utility/./UtilityTests/BinaryStreamTest.PutSLEB128NineBytes (2001 of 2031) PASS: lldb-unit :: Host/./HostTests/NativeProcessProtocolTest.SetBreakpointFailVerify (2002 of 2031) PASS: lldb-unit :: Utility/./UtilityTests/VASprintfTest.NoBufferResize (2003 of 2031) UNSUPPORTED: lldb-api :: functionalities/unwind/ehframe/TestEhFrameUnwind.py (2004 of 2031) PASS: lldb-api :: commands/expression/argument_passing_restrictions/TestArgumentPassingRestrictions.py (2005 of 2031) PASS: lldb-api :: commands/watchpoints/watchpoint_commands/command/TestWatchpointCommandLLDB.py (2006 of 2031) PASS: lldb-api :: functionalities/gdb_remote_client/TestNoWatchpointSupportInfo.py (2007 of 2031) PASS: lldb-unit :: Utility/./UtilityTests/LogChannelTest.Disable (2008 of 2031) PASS: lldb-unit :: SymbolFile/DWARF/./SymbolFileDWARFTests/SymbolFileDWARFTests.TestAbbrevOutOfOrder (2009 of 2031) PASS: lldb-unit :: Host/./HostTests/SocketTest.TCPListen0GetPort (2010 of 2031) PASS: lldb-api :: functionalities/unwind/zeroth_frame/TestZerothFrame.py (2011 of 2031) PASS: lldb-api :: commands/watchpoints/watchpoint_disable/TestWatchpointDisable.py (2012 of 2031) UNSUPPORTED: lldb-api :: functionalities/longjmp/TestLongjmp.py (2013 of 2031) PASS: lldb-api :: functionalities/thread/concurrent_events/TestConcurrentTwoWatchpointsOneBreakpoint.py (2014 of 2031) PASS: lldb-api :: python_api/value/linked_list/TestValueAPILinkedList.py (2015 of 2031) PASS: lldb-api :: functionalities/thread/concurrent_events/TestConcurrentBreakpointOneDelayBreakpointThreads.py (2016 of 2031) PASS: lldb-unit :: UnwindAssembly/x86/./UnwindAssemblyx86Tests/Testx86AssemblyInspectionEngine.TestPopEBP (2017 of 2031) PASS: lldb-unit :: Utility/./UtilityTests/DataExtractorTest.GetCStrAtEnd (2018 of 2031) PASS: lldb-api :: tools/lldb-server/TestGdbRemoteExpeditedRegisters.py (2019 of 2031) PASS: lldb-shell :: Minidump/no-process-id.yaml (2020 of 2031) PASS: lldb-api :: functionalities/gdb_remote_client/TestThreadSelectionBug.py (2021 of 2031) PASS: lldb-unit :: Utility/./UtilityTests/TimerTest.CategoryTimes (2022 of 2031) PASS: lldb-api :: commands/expression/import-std-module/vector-dbg-info-content/TestDbgInfoContentVectorFromStdModule.py (2023 of 2031) PASS: lldb-unit :: Utility/./UtilityTests/ArgsTest.TestSingleArg (2024 of 2031) PASS: lldb-api :: functionalities/memory/read/TestMemoryRead.py (2025 of 2031) PASS: lldb-api :: python_api/disassemble-raw-data/TestDisassembleRawData.py (2026 of 2031) PASS: lldb-api :: functionalities/data-formatter/data-formatter-enum-format/TestDataFormatterEnumFormat.py (2027 of 2031) PASS: lldb-unit :: Utility/./UtilityTests/StringExtractorTest.GetNameColonValueContainsColon (2028 of 2031) FAIL: lldb-api :: functionalities/data-formatter/data-formatter-objc/TestDataFormatterObjCNSError.py (2029 of 2031) ******************** TEST 'lldb-api :: functionalities/data-formatter/data-formatter-objc/TestDataFormatterObjCNSError.py' FAILED ******************** Script: -- /Users/buildslave/jenkins/workspace/lldb-cmake-sanitized/lldb-build/lldb-test-build.noindex/copied-system-python /Users/buildslave/jenkins/workspace/lldb-cmake-sanitized/llvm-project/lldb/test/API/dotest.py --arch x86_64 -s /Users/buildslave/jenkins/workspace/lldb-cmake-sanitized/lldb-build/lldb-test-traces -S nm -u CXXFLAGS -u CFLAGS --codesign-identity lldb_codesign --server /Users/buildslave/jenkins/workspace/lldb-cmake-sanitized/lldb-build/./bin/debugserver --arch x86_64 --build-dir /Users/buildslave/jenkins/workspace/lldb-cmake-sanitized/lldb-build/lldb-test-build.noindex -s=/Users/buildslave/jenkins/workspace/lldb-cmake-sanitized/test/logs -t --env TERM=vt100 --env LLVM_LIBS_DIR=/Users/buildslave/jenkins/workspace/lldb-cmake-sanitized/lldb-build/./lib --inferior-env ASAN_OPTIONS=detect_stack_use_after_return=1 --inferior-env DYLD_INSERT_LIBRARIES=/Users/buildslave/jenkins/workspace/lldb-cmake-sanitized/host-compiler/lib/clang/11.0.0/lib/darwin/libclang_rt.asan_osx_dynamic.dylib --build-dir /Users/buildslave/jenkins/workspace/lldb-cmake-sanitized/lldb-build/lldb-test-build.noindex --lldb-module-cache-dir /Users/buildslave/jenkins/workspace/lldb-cmake-sanitized/lldb-build/lldb-test-build.noindex/module-cache-lldb/lldb-api --clang-module-cache-dir /Users/buildslave/jenkins/workspace/lldb-cmake-sanitized/lldb-build/lldb-test-build.noindex/module-cache-clang/lldb-api --executable /Users/buildslave/jenkins/workspace/lldb-cmake-sanitized/lldb-build/./bin/lldb --compiler /Users/buildslave/jenkins/workspace/lldb-cmake-sanitized/lldb-build/./bin/clang --dsymutil /Users/buildslave/jenkins/workspace/lldb-cmake-sanitized/lldb-build/./bin/dsymutil --filecheck /Users/buildslave/jenkins/workspace/lldb-cmake-sanitized/lldb-build/./bin/FileCheck --lldb-libs-dir /Users/buildslave/jenkins/workspace/lldb-cmake-sanitized/lldb-build/./lib /Users/buildslave/jenkins/workspace/lldb-cmake-sanitized/llvm-project/lldb/test/API/functionalities/data-formatter/data-formatter-objc -p TestDataFormatterObjCNSError.py -- Exit Code: -6

Hide Details

Command Output (stdout): -- lldb version 11.0.99 clang revision 01899bb4e41178af6f4cf7b32833e661fe1e3322 llvm revision 01899bb4e41178af6f4cf7b32833e661fe1e3322

Hide Details

-- Command Output (stderr): -- Assertion failed: (tokenKind == tok::kw___bridge_retain), function ParseParenExpression, file /Users/buildslave/jenkins/workspace/lldb-cmake-sanitized/llvm-project/clang/lib/Parse/ParseExpr.cpp, line 2819.

Hide Details

--

Hide Details

******************** PASS: lldb-api :: functionalities/data-formatter/data-formatter-caching/TestDataFormatterCaching.py (2030 of 2031) PASS: lldb-api :: types/TestLongTypes.py (2031 of 2031) Slowest Tests: -------------------------------------------------------------------------- 353.32s: lldb-api :: tools/lldb-server/TestLldbGdbServer.py 264.55s: lldb-api :: lang/cpp/enum_types/TestCPP11EnumTypes.py 255.30s: lldb-api :: api/multithreaded/TestMultithreaded.py 245.61s: lldb-api :: tools/lldb-server/TestGdbRemoteThreadsInStopReply.py 153.04s: lldb-api :: lang/objc/exceptions/TestObjCExceptions.py 150.50s: lldb-api :: lang/cpp/namespace/TestNamespaceLookup.py 141.97s: lldb-api :: types/TestLongTypesExpr.py 139.80s: lldb-api :: lang/objc/real-definition/TestRealDefinition.py 119.75s: lldb-api :: tools/lldb-server/TestGdbRemote_qThreadStopInfo.py 109.92s: lldb-api :: lang/objc/foundation/TestObjCMethods.py 98.96s: lldb-api :: lang/objc/forward-decl/TestForwardDecl.py 95.32s: lldb-api :: python_api/exprpath_synthetic/TestExprPathSynthetic.py 94.54s: lldb-api :: lang/objcxx/objcxx-ivar-vector/TestIvarVector.py 91.71s: lldb-api :: functionalities/gdb_remote_client/TestWasm.py 89.62s: lldb-api :: commands/settings/TestSettings.py 85.10s: lldb-api :: functionalities/data-formatter/compactvectors/TestCompactVectors.py 81.46s: lldb-api :: api/check_public_api_headers/TestPublicAPIHeaders.py 81.08s: lldb-api :: python_api/lldbutil/iter/TestLLDBIterator.py 75.15s: lldb-api :: commands/register/register/register_command/TestRegisters.py 75.07s: lldb-api :: commands/expression/import-std-module/stack/TestStackFromStdModule.py

Hide Details

Tests Times: -------------------------------------------------------------------------- [ Range ] :: [ Percentage ] :: [ Count ] -------------------------------------------------------------------------- [340s,360s) :: [ ] :: [ 1/2031] [320s,340s) :: [ ] :: [ 0/2031] [300s,320s) :: [ ] :: [ 0/2031] [280s,300s) :: [ ] :: [ 0/2031] [260s,280s) :: [ ] :: [ 2/2031] [240s,260s) :: [ ] :: [ 1/2031] [220s,240s) :: [ ] :: [ 0/2031] [200s,220s) :: [ ] :: [ 0/2031] [180s,200s) :: [ ] :: [ 0/2031] [160s,180s) :: [ ] :: [ 0/2031] [140s,160s) :: [ ] :: [ 4/2031] [120s,140s) :: [ ] :: [ 1/2031] [100s,120s) :: [ ] :: [ 2/2031] [ 80s,100s) :: [ ] :: [ 7/2031] [ 60s, 80s) :: [ ] :: [ 23/2031] [ 40s, 60s) :: [* ] :: [ 79/2031] [ 20s, 40s) :: [** ] :: [ 128/2031] [ 0s, 20s) :: [*********************************** ] :: [1783/2031] -------------------------------------------------------------------------- ******************** Failing Tests (53): lldb-api :: lang/objc/objc-struct-return/TestObjCStructReturn.py lldb-api :: lang/objc/forward-decl/TestForwardDecl.py lldb-api :: lang/objc/objc-runtime-ivars/TestRuntimeIvars.py lldb-api :: lang/objc/variadic_methods/TestVariadicMethods.py lldb-api :: lang/objcxx/objcxx-ivar-vector/TestIvarVector.py lldb-api :: python_api/exprpath_synthetic/TestExprPathSynthetic.py lldb-api :: lang/objc/objc-struct-argument/TestObjCStructArgument.py lldb-api :: lang/objc/objc-ivar-protocols/TestIvarProtocols.py lldb-api :: commands/expression/po_verbosity/TestPoVerbosity.py lldb-api :: lang/objc/objc-static-method/TestObjCStaticMethod.py lldb-api :: functionalities/data-formatter/data-formatter-objc/nsindexpath/TestDataFormatterNSIndexPath.py lldb-api :: lang/objc/orderedset/TestOrderedSet.py lldb-api :: lang/objc/radar-9691614/TestObjCMethodReturningBOOL.py lldb-api :: functionalities/data-formatter/data-formatter-objc/TestDataFormatterObjCExpr.py lldb-api :: functionalities/data-formatter/poarray/TestPrintObjectArray.py lldb-api :: lang/objc/bitfield_ivars/TestBitfieldIvars.py lldb-api :: lang/objc/objc-new-syntax/TestObjCNewSyntaxDictionary.py lldb-api :: lang/objc/objc_direct-methods/TestObjCDirectMethods.py lldb-api :: lang/objc/foundation/TestObjCMethodsNSArray.py lldb-api :: lang/objc/objc-property/TestObjCProperty.py lldb-api :: functionalities/data-formatter/data-formatter-objc/TestDataFormatterObjCNSContainer.py lldb-api :: lang/objc/print-obj/TestPrintObj.py lldb-api :: lang/objc/foundation/TestConstStrings.py lldb-api :: commands/expression/call-throws/TestCallThatThrows.py lldb-api :: commands/expression/persist_objc_pointeetype/TestPersistObjCPointeeType.py lldb-api :: lang/objc/objc-new-syntax/TestObjCNewSyntaxArray.py lldb-api :: commands/expression/namespace_local_var_same_name_obj_c/TestNamespaceLocalVarSameNameObjC.py lldb-api :: lang/objc/self/TestObjCSelf.py lldb-api :: commands/expression/import_builtin_fileid/TestImportBuiltinFileID.py lldb-api :: lang/objc/objc-class-method/TestObjCClassMethod.py lldb-api :: commands/expression/diagnostics/TestExprDiagnostics.py lldb-api :: functionalities/data-formatter/data-formatter-objc/TestDataFormatterObjCCF.py lldb-api :: lang/objc/foundation/TestObjCMethodsString.py lldb-api :: lang/objc/hidden-ivars/TestHiddenIvars.py lldb-api :: lang/objc/rdar-11355592/TestRdar11355592.py lldb-api :: functionalities/data-formatter/synthupdate/TestSyntheticFilterRecompute.py lldb-api :: lang/objcxx/cxx-bridged-po/TestObjCXXBridgedPO.py lldb-api :: lang/objc/foundation/TestObjCMethods.py lldb-api :: lang/objc/objc++/TestObjCXX.py lldb-api :: commands/expression/two-files/TestObjCTypeQueryFromOtherCompileUnit.py lldb-api :: lang/objc/conflicting-definition/TestConflictingDefinition.py lldb-api :: lang/objc/modules/TestObjCModules.py lldb-api :: lang/objc/blocks/TestObjCIvarsInBlocks.py lldb-api :: lang/objc/objc-new-syntax/TestObjCNewSyntaxLiteral.py lldb-api :: lang/objc/unicode-string/TestUnicodeString.py lldb-api :: lang/objc/foundation/TestObjCMethodsNSError.py lldb-api :: lang/objc/modules-non-objc-target/TestObjCModulesNonObjCTarget.py lldb-api :: lang/objc/objc-optimized/TestObjcOptimized.py lldb-api :: functionalities/set-data/TestSetData.py lldb-api :: commands/expression/context-object-objc/TestContextObjectObjc.py lldb-api :: lang/objc/objc-super/TestObjCSuper.py lldb-api :: lang/objc/foundation/TestRuntimeTypes.py lldb-api :: functionalities/data-formatter/data-formatter-objc/TestDataFormatterObjCNSError.py

Hide Details

Hide Details

Testing Time: 4198.77s Unsupported Tests : 170 Expected Passes : 1802 Expected Failures : 6 Unexpected Failures: 53 FAILED: tools/lldb/test/CMakeFiles/check-lldb-lit cd /Users/buildslave/jenkins/workspace/lldb-cmake-sanitized/lldb-build/tools/lldb/test && /usr/local/Frameworks/Python.framework/Versions/3.7/bin/python3.7 /Users/buildslave/jenkins/workspace/lldb-cmake-sanitized/lldb-build/./bin/llvm-lit -v --time-tests --shuffle --xunit-xml-output=/Users/buildslave/jenkins/workspace/lldb-cmake-sanitized/test/results.xml -v -j 4 --timeout 1200 /Users/buildslave/jenkins/workspace/lldb-cmake-sanitized/lldb-build/tools/lldb/test ninja: build stopped: subcommand failed. Command failed: Command '['/usr/bin/env', 'TERM=vt100', '/usr/local/bin/ninja', '-v', 'check-lldb']' returned non-zero exit status 1. Command: ['/usr/bin/env', 'TERM=vt100', '/usr/local/bin/ninja', '-v', 'check-lldb'] [Pipeline] } [Pipeline] // timeout [Pipeline] } [Pipeline] // stage [Pipeline] stage [Pipeline] { (Declarative: Post Actions) [Pipeline] scanForIssues [Clang (LLVM based)] Sleeping for 5 seconds due to JENKINS-32191... [Clang (LLVM based)] Parsing console log (workspace: '/Users/buildslave/jenkins/workspace/lldb-cmake-sanitized') [Clang (LLVM based)] Successfully parsed console log [Clang (LLVM based)] -> found 2 issues (skipped 0 duplicates) [Clang (LLVM based)] Post processing issues on 'green-dragon-23' with source code encoding 'UTF-8' [Clang (LLVM based)] Creating SCM blamer to obtain author and commit information for affected files [Clang (LLVM based)] Creating SCM miner to obtain statistics for affected repository files [Clang (LLVM based)] Resolving file names for all issues in source directory '/Users/buildslave/jenkins/workspace/lldb-cmake-sanitized' [Clang (LLVM based)] -> resolved paths in source directory (1 found, 0 not found) [Clang (LLVM based)] Resolving module names from module definitions (build.xml, pom.xml, or Manifest.mf files) [Clang (LLVM based)] -> resolved module names for 2 issues [Clang (LLVM based)] Resolving package names (or namespaces) by parsing the affected files [Clang (LLVM based)] -> resolved package names of 1 affected files [Clang (LLVM based)] No filter has been set, publishing all 2 issues [Clang (LLVM based)] Creating fingerprints for all affected code blocks to track issues over different builds [Clang (LLVM based)] -> created fingerprints for 2 issues (skipped 0 issues) [Clang (LLVM based)] Copying affected files to Jenkins' build folder '/Users/Shared/Jenkins/Home/jobs/lldb-cmake-sanitized/builds/1506/files-with-issues' [Clang (LLVM based)] -> 1 copied, 0 not in workspace, 0 not-found, 0 with I/O error [Pipeline] junit Recording test results [Pipeline] } [Pipeline] // stage [Pipeline] } [Pipeline] // withEnv [Pipeline] } [Pipeline] // node [Pipeline] End of Pipeline ERROR: script returned exit code 1 Finished: FAILURE