FailedConsole Output

Skipping 982 KB.. Full Log
gisters/mpx_bound_violation/TestBoundViolation.py (613 of 2046)
PASS: lldb-unit :: Process/gdb-remote/./ProcessGdbRemoteTests/GDBRemoteClientBaseTest.InterruptNoResponse (614 of 2046)
PASS: lldb-unit :: ScriptInterpreter/Python/./ScriptInterpreterPythonTests/PythonDataObjectsTest.TestPythonFile (615 of 2046)
PASS: lldb-shell :: SymbolFile/NativePDB/function-types-builtins.cpp (616 of 2046)
PASS: lldb-api :: functionalities/thread/concurrent_events/TestConcurrentWatchpointDelayWatchpointOneBreakpoint.py (617 of 2046)
PASS: lldb-unit :: Utility/./UtilityTests/XcodeSDKTest.ParseTest (618 of 2046)
PASS: lldb-api :: commands/frame/diagnose/inheritance/TestDiagnoseInheritance.py (619 of 2046)
PASS: lldb-api :: commands/expression/char/TestExprsChar.py (620 of 2046)
PASS: lldb-unit :: Utility/./UtilityTests/UriParserTest.SchemeHostSeparator2 (621 of 2046)
PASS: lldb-unit :: Utility/./UtilityTests/GeneratorTest.Get (622 of 2046)
PASS: lldb-unit :: Symbol/./SymbolTests/TestClangASTImporter.CopyDeclTagDecl (623 of 2046)
PASS: lldb-api :: tools/lldb-vscode/breakpoint/TestVSCode_setFunctionBreakpoints.py (624 of 2046)
PASS: lldb-unit :: Language/Highlighting/./HighlighterTests/HighlighterTest.DefaultHighlighterWithCursorOutOfBounds (625 of 2046)
UNSUPPORTED: lldb-shell :: ExecControl/StopHook/stop-hook-threads.test (626 of 2046)
PASS: lldb-unit :: Utility/./UtilityTests/UUIDTest.SetFromStringRef (627 of 2046)
PASS: lldb-shell :: ObjectFile/ELF/aarch64-relocations.yaml (628 of 2046)
PASS: lldb-unit :: Host/./HostTests/FileActionTest.Open (629 of 2046)
PASS: lldb-unit :: Utility/./UtilityTests/RangeTest.SizeTypes (630 of 2046)
PASS: lldb-shell :: Register/x86-64-read.test (631 of 2046)
PASS: lldb-unit :: Utility/./UtilityTests/OptionsWithRawTest.SingleWhitespaceInput (632 of 2046)
PASS: lldb-api :: tools/lldb-server/inferior-crash/TestGdbRemoteAbort.py (633 of 2046)
PASS: lldb-api :: functionalities/postmortem/netbsd-core/TestNetBSDCore.py (634 of 2046)
PASS: lldb-api :: functionalities/thread/concurrent_events/TestConcurrentCrashWithWatchpoint.py (635 of 2046)
PASS: lldb-unit :: Utility/./UtilityTests/ArgsTest.ReplaceArgumentAtIndexOutOfRange (636 of 2046)
UNSUPPORTED: lldb-api :: commands/register/register/intel_xtended_registers/TestMPXRegisters.py (637 of 2046)
PASS: lldb-unit :: Utility/./UtilityTests/RangeDataVector.CustomSort (638 of 2046)
PASS: lldb-api :: functionalities/tail_call_frames/cross_dso/TestCrossDSOTailCalls.py (639 of 2046)
PASS: lldb-unit :: Symbol/./SymbolTests/TestTypeSystemClang.TestDisplayName (640 of 2046)
PASS: lldb-unit :: UnwindAssembly/x86/./UnwindAssemblyx86Tests/Testx86AssemblyInspectionEngine.TestPushECX (641 of 2046)
PASS: lldb-unit :: Target/./TargetTests/ModuleCacheTest.GetAndPutStrangeHostname (642 of 2046)
PASS: lldb-shell :: Driver/LocalLLDBInit.test (643 of 2046)
PASS: lldb-api :: macosx/version_zero/TestGetVersionZeroVersion.py (644 of 2046)
PASS: lldb-unit :: Utility/./UtilityTests/PassiveReplayTest.InstrumentedBarPtr (645 of 2046)
PASS: lldb-unit :: Utility/./UtilityTests/StringLexerTest.NextIf (646 of 2046)
PASS: lldb-api :: lang/cpp/enum_types/TestCPP11EnumTypes.py (647 of 2046)
PASS: lldb-api :: lang/objc/modules-app-update/TestClangModulesAppUpdate.py (648 of 2046)
PASS: lldb-unit :: ScriptInterpreter/Python/./ScriptInterpreterPythonTests/PythonDataObjectsTest.TestPythonInteger (649 of 2046)
PASS: lldb-api :: functionalities/data-formatter/typedef_array/TestTypedefArray.py (650 of 2046)
PASS: lldb-unit :: Utility/./UtilityTests/AnsiTerminal.KnownPrefix (651 of 2046)
PASS: lldb-shell :: SymbolFile/Breakpad/line-table-discontinuous-file-ids.test (652 of 2046)
PASS: lldb-unit :: Process/minidump/./LLDBMinidumpTests/MinidumpParserTest.GetMemoryRegionInfoFromMemory64List (653 of 2046)
PASS: lldb-api :: functionalities/backticks/TestBackticksWithoutATarget.py (654 of 2046)
PASS: lldb-unit :: Interpreter/./InterpreterTests/CompletionTest.FileCompletionAbsolute (655 of 2046)
PASS: lldb-api :: lang/objc/modules-hash-mismatch/TestClangModulesHashMismatch.py (656 of 2046)
PASS: lldb-api :: functionalities/data-formatter/summary-string-onfail/Test-rdar-9974002.py (657 of 2046)
PASS: lldb-shell :: Reproducer/Functionalities/TestDataFormatter.test (658 of 2046)
PASS: lldb-api :: commands/frame/diagnose/array/TestArray.py (659 of 2046)
PASS: lldb-api :: commands/expression/class_template_specialization_empty_pack/TestClassTemplateSpecializationParametersHandling.py (660 of 2046)
PASS: lldb-api :: python_api/type/TestTypeList.py (661 of 2046)
PASS: lldb-shell :: SymbolFile/DWARF/dir-separator-windows.s (662 of 2046)
PASS: lldb-api :: functionalities/breakpoint/auto_continue/TestBreakpointAutoContinue.py (663 of 2046)
PASS: lldb-api :: tools/lldb-vscode/console/TestVSCode_console.py (664 of 2046)
PASS: lldb-unit :: ScriptInterpreter/Python/./ScriptInterpreterPythonTests/PythonDataObjectsTest.TestExtractingUInt64ThroughStructuredData (665 of 2046)
PASS: lldb-unit :: Utility/./UtilityTests/StreamTest.PutBytesAsRawHex8ToLittleEndian (666 of 2046)
PASS: lldb-unit :: Symbol/./SymbolTests/Type.CompilerContextPattern (667 of 2046)
PASS: lldb-unit :: Language/Highlighting/./HighlighterTests/HighlighterTest.ClangUnterminatedString (668 of 2046)
PASS: lldb-api :: functionalities/step_scripted/TestStepScripted.py (669 of 2046)
PASS: lldb-shell :: Driver/TestFile.test (670 of 2046)
PASS: lldb-unit :: ScriptInterpreter/Python/./ScriptInterpreterPythonTests/PythonDataObjectsTest.TestCallable (671 of 2046)
PASS: lldb-api :: functionalities/data-formatter/data-formatter-synthtype/TestDataFormatterSynthType.py (672 of 2046)
PASS: lldb-unit :: Utility/./UtilityTests/StreamTeeTest.SetStreamAtIndexOutOfBounds (673 of 2046)
UNSUPPORTED: lldb-api :: tools/lldb-vscode/completions/TestVSCode_completions.py (674 of 2046)
PASS: lldb-unit :: Utility/./UtilityTests/ConstStringTest.MangledCounterpart (675 of 2046)
PASS: lldb-shell :: Reproducer/TestMultipleTargets.test (676 of 2046)
UNSUPPORTED: lldb-shell :: Register/x86-64-xmm16-write.test (677 of 2046)
PASS: lldb-unit :: Utility/./UtilityTests/ArgsTest.TestMultipleArgs (678 of 2046)
PASS: lldb-unit :: UnwindAssembly/x86/./UnwindAssemblyx86Tests/Testx86AssemblyInspectionEngine.TestSimple64bitFrameFunction (679 of 2046)
PASS: lldb-unit :: Target/./TargetTests/ModuleCacheTest.GetAndPut (680 of 2046)
PASS: lldb-api :: lang/cpp/dynamic-value-same-basename/TestDynamicValueSameBase.py (681 of 2046)
PASS: lldb-unit :: Utility/./UtilityTests/ArgsTest.TestAppendArg (682 of 2046)
PASS: lldb-api :: functionalities/thread/backtrace_limit/TestBacktraceLimit.py (683 of 2046)
PASS: lldb-unit :: UnwindAssembly/x86/./UnwindAssemblyx86Tests/Testx86AssemblyInspectionEngine.TestPushESI (684 of 2046)
PASS: lldb-api :: commands/expression/call-function/TestCallUserDefinedFunction.py (685 of 2046)
PASS: lldb-api :: lang/objc/objc-new-syntax/TestObjCNewSyntaxDictionary.py (686 of 2046)
PASS: lldb-unit :: Process/gdb-remote/./ProcessGdbRemoteTests/GDBRemoteCommunicationClientTest.SendGetDataPacket (687 of 2046)
UNSUPPORTED: lldb-shell :: SymbolFile/PDB/variables.test (688 of 2046)
PASS: lldb-unit :: ScriptInterpreter/Lua/./ScriptInterpreterLuaTests/ScriptInterpreterTest.ExecuteOneLine (689 of 2046)
UNSUPPORTED: lldb-shell :: SymbolFile/PDB/calling-conventions.test (690 of 2046)
PASS: lldb-unit :: Utility/./UtilityTests/OptionsWithRawTest.QuotedSuffix (691 of 2046)
PASS: lldb-unit :: Utility/./UtilityTests/OptionsWithRawTest.WhitespaceInput (692 of 2046)
PASS: lldb-api :: tools/lldb-server/TestGdbRemoteAttach.py (693 of 2046)
PASS: lldb-shell :: SymbolFile/DWARF/debug-types-line-tables.s (694 of 2046)
PASS: lldb-api :: functionalities/ubsan/user-expression/TestUbsanUserExpression.py (695 of 2046)
PASS: lldb-unit :: Utility/./UtilityTests/StringListTest.ShiftMove (696 of 2046)
PASS: lldb-api :: commands/expression/import-std-module/shared_ptr-dbg-info-content/TestSharedPtrDbgInfoContentFromStdModule.py (697 of 2046)
PASS: lldb-unit :: ScriptInterpreter/Python/./ScriptInterpreterPythonTests/PythonDataObjectsTest.TestRun (698 of 2046)
PASS: lldb-api :: functionalities/data-formatter/data-formatter-synthval/TestDataFormatterSynthVal.py (699 of 2046)
PASS: lldb-unit :: UnwindAssembly/x86/./UnwindAssemblyx86Tests/Testx86AssemblyInspectionEngine.Test32BitOnlyInstruction (700 of 2046)
PASS: lldb-unit :: Host/./HostTests/SocketTest.UDPConnect (701 of 2046)
UNSUPPORTED: lldb-api :: functionalities/longjmp/TestLongjmp.py (702 of 2046)
PASS: lldb-api :: types/TestDoubleTypesExpr.py (703 of 2046)
PASS: lldb-api :: commands/settings/use_source_cache/TestUseSourceCache.py (704 of 2046)
PASS: lldb-shell :: ObjectFile/PECOFF/invalid-export-table.yaml (705 of 2046)
PASS: lldb-unit :: Utility/./UtilityTests/StringListTest.RemoveBlankLines (706 of 2046)
PASS: lldb-unit :: Utility/./UtilityTests/RangeTest.Clear (707 of 2046)
PASS: lldb-api :: functionalities/gdb_remote_client/TestThreadSelectionBug.py (708 of 2046)
PASS: lldb-unit :: Core/./LLDBCoreTests/StreamCallbackTest.Callback (709 of 2046)
UNSUPPORTED: lldb-api :: benchmarks/expression/TestRepeatedExprs.py (710 of 2046)
UNSUPPORTED: lldb-shell :: Register/arm-fp-read.test (711 of 2046)
PASS: lldb-shell :: Breakpoint/single-file-split-dwarf.test (712 of 2046)
PASS: lldb-api :: functionalities/data-formatter/data-formatter-stl/libcxx/set/TestDataFormatterLibcxxSet.py (713 of 2046)
XFAIL: lldb-shell :: Register/x86-mm-xmm-write.test (714 of 2046)
PASS: lldb-shell :: Reproducer/TestReuseDirectory.test (715 of 2046)
PASS: lldb-unit :: Process/minidump/./LLDBMinidumpTests/MinidumpParserTest.MinidumpDuplicateModuleMinAddress (716 of 2046)
PASS: lldb-unit :: DataFormatter/./LLDBFormatterTests/StringPrinterTests.CxxUTF8 (717 of 2046)
PASS: lldb-api :: lang/objc/foundation/TestSymbolTable.py (718 of 2046)
PASS: lldb-shell :: Process/Optimization.test (719 of 2046)
PASS: lldb-unit :: Host/./HostTests/FileSystemTest.Exists (720 of 2046)
UNSUPPORTED: lldb-api :: functionalities/data-formatter/data-formatter-stl/libstdcpp/vbool/TestDataFormatterStdVBool.py (721 of 2046)
PASS: lldb-shell :: SymbolFile/DWARF/dwarf5_locations.s (722 of 2046)
PASS: lldb-api :: commands/reproducer/invalid-args/TestInvalidArgsReproducer.py (723 of 2046)
PASS: lldb-unit :: Utility/./UtilityTests/BinaryStreamTest.PutSLEB128SevenBytes (724 of 2046)
PASS: lldb-unit :: Utility/./UtilityTests/StringExtractorTest.DecodeHexU8_Extra (725 of 2046)
PASS: lldb-unit :: Host/./HostTests/ConnectionFileDescriptorTest.TCPGetURIv6 (726 of 2046)
PASS: lldb-unit :: UnwindAssembly/x86/./UnwindAssemblyx86Tests/Testx86AssemblyInspectionEngine.TestSubRSP (727 of 2046)
PASS: lldb-unit :: Utility/./UtilityTests/StringExtractorTest.GetHexU8_Exact (728 of 2046)
PASS: lldb-api :: commands/command/delete/TestCommandDelete.py (729 of 2046)
PASS: lldb-unit :: Target/./TargetTests/ExecutionContextTest.GetByteOrderProcess (730 of 2046)
PASS: lldb-api :: lang/objc/objc-baseclass-sbtype/TestObjCBaseClassSBType.py (731 of 2046)
PASS: lldb-shell :: Breakpoint/debug_rnglistx_rlex.test (732 of 2046)
PASS: lldb-api :: lang/objc/foundation/TestRuntimeTypes.py (733 of 2046)
PASS: lldb-shell :: SymbolFile/Breakpad/unwind-via-stack-win.test (734 of 2046)
PASS: lldb-api :: commands/expression/persistent_types/TestPersistentTypes.py (735 of 2046)
PASS: lldb-api :: tools/lldb-vscode/breakpoint/TestVSCode_setBreakpoints.py (736 of 2046)
UNSUPPORTED: lldb-api :: functionalities/darwin_log/filter/exact_match/subsystem/TestDarwinLogFilterMatchSubsystem.py (737 of 2046)
PASS: lldb-unit :: Utility/./UtilityTests/CompletionRequest.TryCompleteCurrentArgMode (738 of 2046)
PASS: lldb-api :: functionalities/process_group/TestChangeProcessGroup.py (739 of 2046)
PASS: lldb-unit :: Utility/./UtilityTests/ArgsTest.ReplaceArgumentAtIndexLonger (740 of 2046)
PASS: lldb-api :: types/TestFloatTypesExpr.py (741 of 2046)
PASS: lldb-api :: functionalities/tail_call_frames/ambiguous_tail_call_seq1/TestAmbiguousTailCallSeq1.py (742 of 2046)
PASS: lldb-api :: functionalities/thread/concurrent_events/TestConcurrentCrashWithWatchpointBreakpointSignal.py (743 of 2046)
PASS: lldb-api :: lang/cpp/bool/TestCPPBool.py (744 of 2046)
UNSUPPORTED: lldb-api :: lang/cpp/printf/TestPrintf.py (745 of 2046)
PASS: lldb-api :: commands/settings/quoting/TestQuoting.py (746 of 2046)
PASS: lldb-api :: python_api/process/TestProcessAPI.py (747 of 2046)
PASS: lldb-unit :: Utility/./UtilityTests/BinaryStreamTest.PutSLEB128FiveBytes (748 of 2046)
PASS: lldb-api :: commands/apropos/basic/TestApropos.py (749 of 2046)
UNSUPPORTED: lldb-api :: functionalities/data-formatter/data-formatter-stl/libstdcpp/list/TestDataFormatterStdList.py (750 of 2046)
PASS: lldb-unit :: Symbol/./SymbolTests/TestTypeSystemClang.TestGetTypeClassDeclType (751 of 2046)
PASS: lldb-unit :: Utility/./UtilityTests/ArgsTest.TestInsertArg (752 of 2046)
PASS: lldb-api :: lang/objc/modules-non-objc-target/TestObjCModulesNonObjCTarget.py (753 of 2046)
PASS: lldb-unit :: Utility/./UtilityTests/ScalarTest.SetValueFromCString (754 of 2046)
PASS: lldb-api :: commands/expression/namespace_local_var_same_name_obj_c/TestNamespaceLocalVarSameNameObjC.py (755 of 2046)
PASS: lldb-api :: functionalities/return-value/TestReturnValue.py (756 of 2046)
PASS: lldb-unit :: Utility/./UtilityTests/SubsystemRAIITest.SubsystemWithErrorFailure (757 of 2046)
PASS: lldb-unit :: UnwindAssembly/x86/./UnwindAssemblyx86Tests/Testx86AssemblyInspectionEngine.TestSpillRegToStackViaMOVx86_64 (758 of 2046)
PASS: lldb-unit :: Utility/./UtilityTests/LogTest.LLDB_LOG_nullptr (759 of 2046)
PASS: lldb-api :: macosx/queues/TestQueues.py (760 of 2046)
PASS: lldb-shell :: Minidump/Windows/arm-fp-unwind.test (761 of 2046)
PASS: lldb-api :: python_api/process/read-mem-cstring/TestReadMemCString.py (762 of 2046)
PASS: lldb-api :: functionalities/postmortem/minidump/TestMiniDump.py (763 of 2046)
PASS: lldb-shell :: ObjectFile/ELF/netbsd-core-amd64.test (764 of 2046)
PASS: lldb-api :: commands/target/basic/TestTargetCommand.py (765 of 2046)
UNSUPPORTED: lldb-shell :: Register/x86-64-ymm16-write.test (766 of 2046)
PASS: lldb-shell :: SymbolFile/DWARF/dwarf5-debug_line.s (767 of 2046)
PASS: lldb-api :: lang/cpp/covariant-return-types/TestCovariantReturnTypes.py (768 of 2046)
PASS: lldb-shell :: SymbolFile/DWARF/find-method-local-struct.cpp (769 of 2046)
PASS: lldb-unit :: Utility/./UtilityTests/CompletionRequest.TryCompleteCurrentArgGood (770 of 2046)
PASS: lldb-api :: functionalities/thread/concurrent_events/TestConcurrentDelayedCrashWithBreakpointSignal.py (771 of 2046)
PASS: lldb-unit :: Utility/./UtilityTests/StringLexerTest.Next (772 of 2046)
PASS: lldb-unit :: Utility/./UtilityTests/BinaryStreamTest.PutULEB128FiveBytes (773 of 2046)
PASS: lldb-unit :: Utility/./UtilityTests/OptionsWithRawTest.EmptySuffixSingleWhitespace (774 of 2046)
PASS: lldb-api :: commands/expression/call-function/TestCallBuiltinFunction.py (775 of 2046)
PASS: lldb-api :: lang/cpp/lambdas/TestLambdas.py (776 of 2046)
UNSUPPORTED: lldb-shell :: Register/aarch64-gp-read.test (777 of 2046)
UNSUPPORTED: lldb-shell :: Register/x86-zmm-read.test (778 of 2046)
PASS: lldb-unit :: SymbolFile/DWARF/./SymbolFileDWARFTests/DWARFASTParserClangTests.EnsureAllDIEsInDeclContextHaveBeenParsedParsesOnlyMatchingEntries (779 of 2046)
PASS: lldb-api :: commands/expression/formatters/TestFormatters.py (780 of 2046)
PASS: lldb-unit :: Utility/./UtilityTests/StringExtractorTest.GetNameColonValueSuccess (781 of 2046)
PASS: lldb-unit :: Utility/./UtilityTests/Flags.GetBitSize (782 of 2046)
PASS: lldb-unit :: Host/./HostTests/NativeProcessProtocolTest.SetBreakpointFailWrite (783 of 2046)
PASS: lldb-api :: functionalities/gdb_remote_client/TestGDBRemoteLoad.py (784 of 2046)
UNSUPPORTED: lldb-shell :: SymbolFile/PDB/variables-locations.test (785 of 2046)
PASS: lldb-api :: linux/builtin_trap/TestBuiltinTrap.py (786 of 2046)
PASS: lldb-shell :: SymbolFile/DWARF/DW_AT_low_pc-addrx.s (787 of 2046)
PASS: lldb-shell :: SymbolFile/DWARF/debug_rnglists.s (788 of 2046)
PASS: lldb-api :: functionalities/breakpoint/source_regexp/TestSourceRegexBreakpoints.py (789 of 2046)
PASS: lldb-shell :: ObjectFile/ELF/PT_TLS-overlap-PT_LOAD.yaml (790 of 2046)
PASS: lldb-api :: functionalities/plugins/python_os_plugin/stepping_plugin_threads/TestOSPluginStepping.py (791 of 2046)
PASS: lldb-shell :: Reproducer/TestFileRepro.test (792 of 2046)
PASS: lldb-api :: commands/register/register/register_command/TestRegisters.py (793 of 2046)
PASS: lldb-unit :: Host/./HostTests/FileSystemTest.EmptyTest (794 of 2046)
PASS: lldb-api :: tools/lldb-vscode/breakpoint/TestVSCode_setExceptionBreakpoints.py (795 of 2046)
PASS: lldb-api :: lang/c/vla/TestVLA.py (796 of 2046)
PASS: lldb-unit :: Target/./TargetTests/PathMappingListTest.RelativeTests (797 of 2046)
PASS: lldb-api :: functionalities/data-formatter/data-formatter-objc/TestDataFormatterObjNSException.py (798 of 2046)
PASS: lldb-unit :: Utility/./UtilityTests/SubsystemRAIITest.NormalSubsystem (799 of 2046)
PASS: lldb-api :: commands/expression/import-std-module/weak_ptr/TestWeakPtrFromStdModule.py (800 of 2046)
PASS: lldb-api :: functionalities/load_unload/TestLoadUnload.py (801 of 2046)
PASS: lldb-api :: commands/expression/context-object/TestContextObject.py (802 of 2046)
PASS: lldb-unit :: ScriptInterpreter/Python/./ScriptInterpreterPythonTests/PythonDataObjectsTest.TestPythonStringToStr (803 of 2046)
PASS: lldb-api :: commands/frame/select/TestFrameSelect.py (804 of 2046)
PASS: lldb-unit :: Utility/./UtilityTests/BinaryStreamTest.PutULEB128ThreeBytes (805 of 2046)
UNSUPPORTED: lldb-shell :: SymbolFile/PDB/expressions.test (806 of 2046)
PASS: lldb-unit :: Utility/./UtilityTests/FileSpecTest.IsRelative (807 of 2046)
PASS: lldb-unit :: Host/./HostTests/ProcessLaunchInfoTest.Constructor (808 of 2046)
PASS: lldb-api :: functionalities/breakpoint/inlined_breakpoints/TestInlinedBreakpoints.py (809 of 2046)
PASS: lldb-unit :: Utility/./UtilityTests/UriParserTest.BracketedHostnamePort (810 of 2046)
PASS: lldb-unit :: Utility/./UtilityTests/VMRange.IsValid (811 of 2046)
PASS: lldb-shell :: ObjectFile/ELF/basic-info.yaml (812 of 2046)
PASS: lldb-unit :: ScriptInterpreter/Python/./ScriptInterpreterPythonTests/PythonDataObjectsTest.TestExceptions (813 of 2046)
PASS: lldb-unit :: Host/./HostTests/SocketTest.TCPListen0ConnectAccept (814 of 2046)
PASS: lldb-shell :: Reproducer/TestDump.test (815 of 2046)
PASS: lldb-unit :: Utility/./UtilityTests/UriParserTest.TypicalPortPathIPv6 (816 of 2046)
PASS: lldb-api :: types/TestLongTypesExpr.py (817 of 2046)
PASS: lldb-api :: arm/emulation/TestEmulations.py (818 of 2046)
PASS: lldb-unit :: Utility/./UtilityTests/VMRange.Ordering (819 of 2046)
PASS: lldb-api :: functionalities/breakpoint/global_constructor/TestBreakpointInGlobalConstructor.py (820 of 2046)
PASS: lldb-api :: functionalities/data-formatter/data-formatter-objc/TestDataFormatterObjCNSContainer.py (821 of 2046)
PASS: lldb-shell :: SymbolFile/DWARF/compilercontext.ll (822 of 2046)
PASS: lldb-unit :: Utility/./UtilityTests/ArchSpecTest.MergeFrom (823 of 2046)
PASS: lldb-api :: functionalities/thread/thread_exit/TestThreadExit.py (824 of 2046)
PASS: lldb-unit :: Utility/./UtilityTests/StreamTeeTest.AppendStream (825 of 2046)
PASS: lldb-shell :: Reproducer/Functionalities/TestImageList.test (826 of 2046)
PASS: lldb-unit :: Utility/./UtilityTests/StringExtractorTest.GetU32LittleEndian (827 of 2046)
PASS: lldb-unit :: Process/gdb-remote/./ProcessGdbRemoteTests/GDBRemoteClientBaseTest.SendContinueDelegateInterface (828 of 2046)
UNSUPPORTED: lldb-shell :: SymbolFile/DWARF/debug-types-expressions.test (829 of 2046)
PASS: lldb-unit :: ScriptInterpreter/Python/./ScriptInterpreterPythonTests/PythonDataObjectsTest.TestModuleNameResolutionNoDot (830 of 2046)
PASS: lldb-shell :: ObjectFile/PECOFF/sections-names.yaml (831 of 2046)
PASS: lldb-unit :: Utility/./UtilityTests/StreamTest.PutHex16ByteOrderBig (832 of 2046)
PASS: lldb-unit :: Utility/./UtilityTests/BinaryStreamTest.PutULEB128FourBytes (833 of 2046)
PASS: lldb-shell :: SymbolFile/Breakpad/line-table-mixed-path-styles.test (834 of 2046)
PASS: lldb-api :: lang/c/conflicting-symbol/TestConflictingSymbol.py (835 of 2046)
PASS: lldb-api :: functionalities/thread/backtrace_all/TestBacktraceAll.py (836 of 2046)
PASS: lldb-unit :: Utility/./UtilityTests/BinaryStreamTest.PutULEB128OneByte (837 of 2046)
PASS: lldb-api :: functionalities/tail_call_frames/disambiguate_paths_to_common_sink/TestDisambiguatePathsToCommonSink.py (838 of 2046)
PASS: lldb-api :: commands/watchpoints/multiple_threads/TestWatchpointMultipleThreads.py (839 of 2046)
UNSUPPORTED: lldb-shell :: SymbolFile/PDB/udt-layout.test (840 of 2046)
PASS: lldb-api :: lang/objc/foundation/TestObjCMethods.py (841 of 2046)
PASS: lldb-unit :: Host/./HostTests/SocketTest.DomainListenConnectAccept (842 of 2046)
PASS: lldb-unit :: Utility/./UtilityTests/EnvironmentTest.EnvpConstruction (843 of 2046)
PASS: lldb-unit :: Utility/./UtilityTests/StreamTest.PutHex16ByteOrderLittle (844 of 2046)
PASS: lldb-api :: functionalities/data-formatter/data-formatter-stl/libcxx/list/TestDataFormatterLibcxxList.py (845 of 2046)
PASS: lldb-api :: commands/expression/vector_of_enums/TestVectorOfEnums.py (846 of 2046)
PASS: lldb-unit :: Utility/./UtilityTests/ArgsTest.BareSingleQuote (847 of 2046)
PASS: lldb-unit :: Core/./LLDBCoreTests/RichManglingContextTest.Basic (848 of 2046)
PASS: lldb-api :: functionalities/thread/jump/TestThreadJump.py (849 of 2046)
PASS: lldb-api :: commands/platform/basic/TestPlatformCommand.py (850 of 2046)
UNSUPPORTED: lldb-api :: lang/objc/objc-dynamic-value/TestObjCDynamicValue.py (851 of 2046)
PASS: lldb-shell :: ObjectFile/PECOFF/export-dllfunc.yaml (852 of 2046)
PASS: lldb-unit :: Utility/./UtilityTests/XcodeSDKTest.SDKSupportsModules (853 of 2046)
PASS: lldb-api :: commands/target/dump-symtab-demangle/TestDumpSymtabDemangle.py (854 of 2046)
PASS: lldb-unit :: Utility/./UtilityTests/NameMatchesTest.Equals (855 of 2046)
PASS: lldb-api :: functionalities/thread/concurrent_events/TestConcurrentManyCrash.py (856 of 2046)
PASS: lldb-api :: commands/watchpoints/watchpoint_events/TestWatchpointEvents.py (857 of 2046)
PASS: lldb-api :: tools/lldb-server/commandline/TestStubSetSID.py (858 of 2046)
PASS: lldb-unit :: Utility/./UtilityTests/StatusTest.ErrorConstructor (859 of 2046)
PASS: lldb-shell :: Settings/TestSettingsWrite.test (860 of 2046)
PASS: lldb-api :: lang/objc/blocks/TestObjCIvarsInBlocks.py (861 of 2046)
PASS: lldb-unit :: Utility/./UtilityTests/BinaryStreamTest.PutULEB128NineBytes (862 of 2046)
PASS: lldb-shell :: SymbolFile/DWARF/debug_ranges.s (863 of 2046)
PASS: lldb-shell :: Minidump/Windows/broken-unwind.test (864 of 2046)
PASS: lldb-api :: functionalities/step-avoids-no-debug/TestStepNoDebug.py (865 of 2046)
PASS: lldb-api :: functionalities/inferior-crashing/recursive-inferior/TestRecursiveInferiorStep.py (866 of 2046)
PASS: lldb-shell :: SymbolFile/Breakpad/line-table-missing-file.test (867 of 2046)
PASS: lldb-api :: tools/lldb-vscode/step/TestVSCode_step.py (868 of 2046)
PASS: lldb-shell :: Reproducer/TestVersionCheck.test (869 of 2046)
PASS: lldb-unit :: Host/./HostTests/SocketTest.DomainGetConnectURI (870 of 2046)
PASS: lldb-shell :: ObjectFile/ELF/minidebuginfo-corrupt-xz.yaml (871 of 2046)
PASS: lldb-shell :: Commands/command-breakpoint-col.test (872 of 2046)
PASS: lldb-api :: commands/command/invalid-args/TestInvalidArgsCommand.py (873 of 2046)
PASS: lldb-unit :: Utility/./UtilityTests/ArchSpecTest.Compatibility (874 of 2046)
PASS: lldb-api :: functionalities/data-formatter/data-formatter-objc/TestDataFormatterObjCNSDate.py (875 of 2046)
PASS: lldb-unit :: Utility/./UtilityTests/StreamTeeTest.DefaultConstructor (876 of 2046)
PASS: lldb-api :: commands/process/launch/TestProcessLaunch.py (877 of 2046)
PASS: lldb-api :: iohandler/unicode/TestUnicode.py (878 of 2046)
PASS: lldb-api :: commands/command/script/import/rdar-12586188/TestRdar12586188.py (879 of 2046)
PASS: lldb-unit :: Utility/./UtilityTests/StringListTest.InsertStringAtIndexStart (880 of 2046)
PASS: lldb-api :: commands/expression/persist_objc_pointeetype/TestPersistObjCPointeeType.py (881 of 2046)
PASS: lldb-api :: lang/objc/modules-compile-error/TestModulesCompileError.py (882 of 2046)
PASS: lldb-unit :: Utility/./UtilityTests/StreamTest.PutCharNull (883 of 2046)
PASS: lldb-api :: lang/cpp/char1632_t/TestChar1632T.py (884 of 2046)
PASS: lldb-unit :: Utility/./UtilityTests/VASprintfTest.BufferResize (885 of 2046)
PASS: lldb-shell :: SymbolFile/DWARF/find-basic-type.cpp (886 of 2046)
UNSUPPORTED: lldb-api :: android/platform/TestDefaultCacheLineSize.py (887 of 2046)
PASS: lldb-api :: commands/expression/anonymous-struct/TestCallUserAnonTypedef.py (888 of 2046)
PASS: lldb-api :: functionalities/thread/concurrent_events/TestConcurrentTwoWatchpointsOneDelayBreakpoint.py (889 of 2046)
PASS: lldb-unit :: Utility/./UtilityTests/PassiveReplayTest.InstrumentedBarRef (890 of 2046)
PASS: lldb-shell :: SymbolFile/DWARF/find-basic-variable.cpp (891 of 2046)
PASS: lldb-unit :: Utility/./UtilityTests/RegularExpression.Match (892 of 2046)
PASS: lldb-api :: functionalities/data-formatter/data-formatter-stl/libcxx/bitset/TestDataFormatterLibcxxBitset.py (893 of 2046)
PASS: lldb-unit :: Target/./TargetTests/ExecutionContextTest.GetByteOrder (894 of 2046)
PASS: lldb-api :: tools/lldb-server/TestGdbRemoteRegisterState.py (895 of 2046)
PASS: lldb-api :: functionalities/gdb_remote_client/TestqOffsets.py (896 of 2046)
PASS: lldb-api :: driver/batch_mode/TestBatchMode.py (897 of 2046)
PASS: lldb-shell :: ScriptInterpreter/Python/sb_address_exception.test (898 of 2046)
PASS: lldb-api :: functionalities/testid/TestTestId.py (899 of 2046)
PASS: lldb-unit :: Utility/./UtilityTests/StringLexerTest.NextIfList (900 of 2046)
PASS: lldb-unit :: Utility/./UtilityTests/OptionsWithRawTest.EmptyArgsOnlySuffix (901 of 2046)
PASS: lldb-api :: lang/objc/objc_direct-methods/TestObjCDirectMethods.py (902 of 2046)
PASS: lldb-unit :: Utility/./UtilityTests/StringExtractorTest.GetHexU8_Extra (903 of 2046)
PASS: lldb-unit :: Utility/./UtilityTests/ProcessInstanceInfo.Dump (904 of 2046)
PASS: lldb-unit :: UnwindAssembly/x86/./UnwindAssemblyx86Tests/Testx86AssemblyInspectionEngine.TestPopRBPWithREX (905 of 2046)
PASS: lldb-api :: commands/expression/import-std-module/shared_ptr/TestSharedPtrFromStdModule.py (906 of 2046)
PASS: lldb-api :: lang/objc/print-obj/TestPrintObj.py (907 of 2046)
UNSUPPORTED: lldb-shell :: SymbolFile/PDB/compilands.test (908 of 2046)
PASS: lldb-unit :: Utility/./UtilityTests/FileSpecTest.AppendPathComponent (909 of 2046)
PASS: lldb-api :: lang/cpp/extern_c/TestExternCSymbols.py (910 of 2046)
PASS: lldb-shell :: ObjectFile/ELF/compressed-sections.yaml (911 of 2046)
PASS: lldb-api :: commands/expression/import-std-module/conflicts/TestStdModuleWithConflicts.py (912 of 2046)
PASS: lldb-unit :: SymbolFile/DWARF/./SymbolFileDWARFTests/SymbolFileDWARFTests.TestAbbrevNullAttrValidForm (913 of 2046)
PASS: lldb-unit :: ScriptInterpreter/Python/./ScriptInterpreterPythonTests/PythonDataObjectsTest.TestPythonCallableCheck (914 of 2046)
PASS: lldb-api :: functionalities/thread/concurrent_events/TestConcurrentDelaySignalWatch.py (915 of 2046)
PASS: lldb-unit :: Process/minidump/./LLDBMinidumpTests/MinidumpParserTest.InvalidMinidump (916 of 2046)
PASS: lldb-unit :: Host/./HostTests/ConnectionFileDescriptorTest.TCPGetURIv4 (917 of 2046)
PASS: lldb-unit :: UnwindAssembly/x86/./UnwindAssemblyx86Tests/Testx86AssemblyInspectionEngine.TestPushRBP (918 of 2046)
PASS: lldb-unit :: Utility/./UtilityTests/StreamTest.AddressRangeInvalidRange (919 of 2046)
PASS: lldb-api :: functionalities/postmortem/wow64_minidump/TestWow64MiniDump.py (920 of 2046)
PASS: lldb-unit :: Utility/./UtilityTests/BinaryStreamTest.PutSLEB128SixBytes (921 of 2046)
PASS: lldb-api :: functionalities/thread/concurrent_events/TestConcurrentSignalBreak.py (922 of 2046)
PASS: lldb-unit :: Process/gdb-remote/./ProcessGdbRemoteTests/GDBRemoteClientBaseTest.SendContinueAndAsyncSignal (923 of 2046)
PASS: lldb-unit :: Utility/./UtilityTests/OptionsWithRawTest.EmptySuffix (924 of 2046)
PASS: lldb-unit :: Target/./TargetTests/ExecutionContextTest.GetByteOrderTarget (925 of 2046)
PASS: lldb-unit :: Expression/./ExpressionTests/DiagnosticManagerTest.AppendMessageNoDiag (926 of 2046)
PASS: lldb-api :: commands/expression/inline-namespace/TestInlineNamespace.py (927 of 2046)
PASS: lldb-unit :: Utility/./UtilityTests/UriParserTest.BadPort (928 of 2046)
PASS: lldb-unit :: Utility/./UtilityTests/StringListTest.PopBack (929 of 2046)
PASS: lldb-api :: functionalities/thread/concurrent_events/TestConcurrentTwoBreakpointsOneDelaySignal.py (930 of 2046)
PASS: lldb-unit :: Language/Highlighting/./HighlighterTests/HighlighterTest.HighlighterSelectionType (931 of 2046)
PASS: lldb-api :: commands/watchpoints/watchpoint_on_vectors/TestValueOfVectorVariable.py (932 of 2046)
PASS: lldb-shell :: Minidump/Windows/find-module.test (933 of 2046)
PASS: lldb-unit :: Utility/./UtilityTests/StringExtractorTest.GetHexU8_Underflow (934 of 2046)
PASS: lldb-unit :: UnwindAssembly/x86/./UnwindAssemblyx86Tests/Testx86AssemblyInspectionEngine.TestAddESP (935 of 2046)
UNSUPPORTED: lldb-shell :: SymbolFile/NativePDB/typedefs.cpp (936 of 2046)
PASS: lldb-unit :: Symbol/./SymbolTests/TestClangASTImporter.MetadataPropagation (937 of 2046)
PASS: lldb-shell :: SymbolFile/DWARF/find-function-regex.cpp (938 of 2046)
PASS: lldb-unit :: Symbol/./SymbolTests/TestTypeSystemClang.TestGetEnumIntegerTypeInvalid (939 of 2046)
PASS: lldb-api :: functionalities/asan/TestMemoryHistory.py (940 of 2046)
UNSUPPORTED: lldb-api :: functionalities/darwin_log/filter/regex/category/TestDarwinLogFilterRegexCategory.py (941 of 2046)
PASS: lldb-unit :: Utility/./UtilityTests/RangeTest.ContainsRange (942 of 2046)
PASS: lldb-shell :: ScriptInterpreter/Lua/convenience_variables.test (943 of 2046)
PASS: lldb-api :: functionalities/data-formatter/language_category_updates/TestDataFormatterLanguageCategoryUpdates.py (944 of 2046)
PASS: lldb-api :: commands/source/info/TestSourceInfo.py (945 of 2046)
PASS: lldb-unit :: Utility/./UtilityTests/StreamTest.PutStringAsRawHex8 (946 of 2046)
PASS: lldb-api :: lang/objc/foundation/TestObjCMethodsNSArray.py (947 of 2046)
PASS: lldb-unit :: Utility/./UtilityTests/StreamTest.PutMaxHex64ByteOrderLittle (948 of 2046)
UNSUPPORTED: lldb-shell :: SymbolFile/NativePDB/local-variables.cpp (949 of 2046)
PASS: lldb-api :: commands/breakpoint/command/list/TestBreakpointCommandList.py (950 of 2046)
PASS: lldb-unit :: Utility/./UtilityTests/ArgsTest.TestTrailingBackslash (951 of 2046)
PASS: lldb-api :: tools/lldb-server/TestGdbRemoteSingleStep.py (952 of 2046)
PASS: lldb-unit :: Utility/./UtilityTests/RangeTest.ContainsAddr (953 of 2046)
PASS: lldb-unit :: Utility/./UtilityTests/StreamTest.PutHex8 (954 of 2046)
PASS: lldb-unit :: Language/Highlighting/./HighlighterTests/HighlighterTest.Keywords (955 of 2046)
PASS: lldb-shell :: VSCode/TestOptions.test (956 of 2046)
PASS: lldb-unit :: Utility/./UtilityTests/UriParserTest.Empty (957 of 2046)
PASS: lldb-shell :: ObjectFile/Breakpad/uuid-matching-mac.test (958 of 2046)
PASS: lldb-api :: commands/expression/import-std-module/unique_ptr-dbg-info-content/TestUniquePtrDbgInfoContent.py (959 of 2046)
PASS: lldb-api :: commands/expression/test/TestExprs2.py (960 of 2046)
PASS: lldb-unit :: UnwindAssembly/x86/./UnwindAssemblyx86Tests/Testx86AssemblyInspectionEngine.TestSimplex86_64Augmented (961 of 2046)
PASS: lldb-unit :: Utility/./UtilityTests/UUIDTest.RelationalOperators (962 of 2046)
PASS: lldb-unit :: Language/Highlighting/./HighlighterTests/HighlighterTest.DefaultHighlighter (963 of 2046)
PASS: lldb-shell :: ObjectFile/Breakpad/breakpad-identification.test (964 of 2046)
PASS: lldb-unit :: UnwindAssembly/x86/./UnwindAssemblyx86Tests/Testx86AssemblyInspectionEngine.TestAddRSP (965 of 2046)
PASS: lldb-shell :: Reproducer/TestRelativePath.test (966 of 2046)
PASS: lldb-shell :: SymbolFile/DWARF/dwp-debug-types.s (967 of 2046)
PASS: lldb-unit :: Utility/./UtilityTests/BinaryStreamTest.PutSLEB128OneByte (968 of 2046)
PASS: lldb-api :: functionalities/wrong_commands/TestWrongCommands.py (969 of 2046)
PASS: lldb-api :: functionalities/gdb_remote_client/TestRegDefinitionInParts.py (970 of 2046)
PASS: lldb-api :: tools/lldb-server/TestGdbRemote_qThreadStopInfo.py (971 of 2046)
PASS: lldb-api :: commands/statistics/basic/TestStats.py (972 of 2046)
PASS: lldb-unit :: UnwindAssembly/x86/./UnwindAssemblyx86Tests/Testx86AssemblyInspectionEngine.TestPopR13 (973 of 2046)
PASS: lldb-api :: functionalities/data-formatter/data-formatter-caching/TestDataFormatterCaching.py (974 of 2046)
UNSUPPORTED: lldb-api :: tools/lldb-server/TestGdbRemote_vContThreads.py (975 of 2046)
UNSUPPORTED: lldb-api :: functionalities/signal/handle-segv/TestHandleSegv.py (976 of 2046)
PASS: lldb-shell :: Watchpoint/SetErrorCases.test (977 of 2046)
PASS: lldb-unit :: Process/gdb-remote/./ProcessGdbRemoteTests/GDBRemoteCommunicationServerTest.SendErrorResponse_ErrorNumber (978 of 2046)
PASS: lldb-unit :: Process/gdb-remote/./ProcessGdbRemoteTests/GDBRemoteCommunicationServerTest.SendErrorResponse_ErrorList (979 of 2046)
PASS: lldb-unit :: ScriptInterpreter/Python/./ScriptInterpreterPythonTests/PythonDataObjectsTest.TestGlobalNameResolutionWithDot (980 of 2046)
PASS: lldb-api :: tools/lldb-server/TestGdbRemote_vCont.py (981 of 2046)
PASS: lldb-api :: tools/lldb-server/TestGdbRemoteThreadsInStopReply.py (982 of 2046)
PASS: lldb-api :: commands/expression/regression-access-function-template-in-record/TestRegressionAccessFunctionTemplateInRecord.py (983 of 2046)
PASS: lldb-api :: lang/cpp/operator-overload/TestOperatorOverload.py (984 of 2046)
PASS: lldb-api :: lang/cpp/class_types/TestClassTypes.py (985 of 2046)
PASS: lldb-shell :: Breakpoint/implicit_const_form_support.test (986 of 2046)
PASS: lldb-unit :: DataFormatter/./LLDBFormatterTests/FormatManagerTests.CompatibleLangs (987 of 2046)
PASS: lldb-api :: functionalities/breakpoint/address_breakpoints/TestBadAddressBreakpoints.py (988 of 2046)
PASS: lldb-api :: functionalities/gdb_remote_client/TestIOSSimulator.py (989 of 2046)
PASS: lldb-api :: functionalities/gdb_remote_client/TestTargetXMLArch.py (990 of 2046)
UNSUPPORTED: lldb-shell :: Register/x86-64-gp-write.test (991 of 2046)
PASS: lldb-api :: lang/cpp/stl/TestStdCXXDisassembly.py (992 of 2046)
PASS: lldb-unit :: Core/./LLDBCoreTests/MangledTest.ResultForBlockInvocation (993 of 2046)
PASS: lldb-unit :: Utility/./UtilityTests/UriParserTest.MinimalPortPath (994 of 2046)
PASS: lldb-api :: commands/command/script/import/TestImport.py (995 of 2046)
UNSUPPORTED: lldb-api :: lang/c/typedef/Testtypedef.py (996 of 2046)
PASS: lldb-unit :: Utility/./UtilityTests/RangeTest.ContainsAddrInvalid (997 of 2046)
PASS: lldb-api :: lang/c/forward/TestForwardDeclaration.py (998 of 2046)
PASS: lldb-unit :: Process/gdb-remote/./ProcessGdbRemoteTests/GDBRemoteCommunicationClientTest.GetModulesInfo_UUID20 (999 of 2046)
PASS: lldb-shell :: SymbolFile/DWARF/DW_OP_piece-smaller-than-struct.s (1000 of 2046)
PASS: lldb-api :: python_api/frame/get-variables/TestGetVariables.py (1001 of 2046)
PASS: lldb-unit :: Utility/./UtilityTests/StringExtractorTest.InitMisc (1002 of 2046)
PASS: lldb-unit :: Symbol/./SymbolTests/TestTypeSystemClang.AddMethodToObjCObjectType (1003 of 2046)
PASS: lldb-shell :: ObjectFile/MachO/subsections.yaml (1004 of 2046)
PASS: lldb-unit :: Utility/./UtilityTests/ProcessInstanceInfo.DumpTable (1005 of 2046)
PASS: lldb-api :: functionalities/data-formatter/format-propagation/TestFormatPropagation.py (1006 of 2046)
PASS: lldb-api :: lang/c/register_variables/TestRegisterVariables.py (1007 of 2046)
PASS: lldb-api :: functionalities/gdb_remote_client/TestGDBRemoteClient.py (1008 of 2046)
PASS: lldb-api :: python_api/exprpath_synthetic/TestExprPathSynthetic.py (1009 of 2046)
PASS: lldb-api :: lang/objc/variadic_methods/TestVariadicMethods.py (1010 of 2046)
PASS: lldb-shell :: Driver/TestCore.test (1011 of 2046)
PASS: lldb-api :: tools/lldb-server/TestGdbRemoteProcessInfo.py (1012 of 2046)
PASS: lldb-api :: functionalities/tail_call_frames/disambiguate_tail_call_seq/TestDisambiguateTailCallSeq.py (1013 of 2046)
PASS: lldb-api :: functionalities/breakpoint/breakpoint_conditions/TestBreakpointConditions.py (1014 of 2046)
PASS: lldb-shell :: Breakpoint/jitbp_elf.test (1015 of 2046)
PASS: lldb-unit :: ScriptInterpreter/Python/./ScriptInterpreterPythonTests/PythonDataObjectsTest.TestPythonCallableInvoke (1016 of 2046)
PASS: lldb-api :: commands/expression/completion-in-lambda-and-unnamed-class/TestCompletionInLambdaAndUnnamedClass.py (1017 of 2046)
UNSUPPORTED: lldb-shell :: Register/x86-64-zmm-write.test (1018 of 2046)
PASS: lldb-unit :: Symbol/./SymbolTests/TestTypeSystemClang.TestFunctionTemplateInRecordConstruction (1019 of 2046)
PASS: lldb-api :: tools/lldb-server/TestGdbRemoteExitCode.py (1020 of 2046)
PASS: lldb-unit :: ScriptInterpreter/Python/./ScriptInterpreterPythonTests/PythonDataObjectsTest.TestPythonIntegerToStructuredInteger (1021 of 2046)
PASS: lldb-unit :: Expression/./ExpressionTests/CppModuleConfigurationTest.IgnoreLibStdCpp (1022 of 2046)
PASS: lldb-shell :: SymbolFile/DWARF/debug_aranges-empty-section.s (1023 of 2046)
PASS: lldb-unit :: Expression/./ExpressionTests/ClangExpressionDeclMapTest.TestPersistentDeclLookup (1024 of 2046)
PASS: lldb-unit :: UnwindAssembly/x86/./UnwindAssemblyx86Tests/Testx86AssemblyInspectionEngine.TestPushR12 (1025 of 2046)
PASS: lldb-api :: functionalities/data-formatter/data-formatter-objc/TestDataFormatterObjCExpr.py (1026 of 2046)
PASS: lldb-api :: types/TestIntegerType.py (1027 of 2046)
PASS: lldb-unit :: Utility/./UtilityTests/StringListTest.GetSize (1028 of 2046)
PASS: lldb-shell :: Settings/TestFrameFormatNoColor.test (1029 of 2046)
PASS: lldb-api :: lang/cpp/class_types/TestClassTypesDisassembly.py (1030 of 2046)
UNSUPPORTED: lldb-api :: functionalities/process_save_core/TestProcessSaveCore.py (1031 of 2046)
PASS: lldb-unit :: Utility/./UtilityTests/DataExtractorTest.GetCStrAtNullOffset (1032 of 2046)
PASS: lldb-unit :: Symbol/./SymbolTests/TestClangASTImporter.DeportDeclTagDecl (1033 of 2046)
PASS: lldb-unit :: Utility/./UtilityTests/StringListTest.LongestCommonPrefixDuplicateElement (1034 of 2046)
PASS: lldb-unit :: Process/gdb-remote/./ProcessGdbRemoteTests/GDBRemoteCommunicationClientTest.GetMemoryRegionInfoInvalidResponse (1035 of 2046)
PASS: lldb-unit :: Host/./HostTests/NativeProcessProtocolTest.ReadCStringFromMemory_CrossPageBoundary (1036 of 2046)
PASS: lldb-unit :: UnwindAssembly/x86/./UnwindAssemblyx86Tests/Testx86AssemblyInspectionEngine.TestPopRBX (1037 of 2046)
PASS: lldb-unit :: Process/gdb-remote/./ProcessGdbRemoteTests/GDBRemoteCommunicationClientTest.GetQOffsets (1038 of 2046)
UNSUPPORTED: lldb-api :: tools/lldb-server/TestGdbRemoteAuxvSupport.py (1039 of 2046)
PASS: lldb-api :: functionalities/breakpoint/breakpoint_options/TestBreakpointOptions.py (1040 of 2046)
PASS: lldb-unit :: Utility/./UtilityTests/ArchSpecTest.MergeFromMachOUnknown (1041 of 2046)
PASS: lldb-shell :: SymbolFile/NativePDB/break-by-function.cpp (1042 of 2046)
PASS: lldb-unit :: Language/CPlusPlus/./LanguageCPlusPlusTests/CPlusPlusLanguage.ExtractContextAndIdentifier (1043 of 2046)
PASS: lldb-unit :: Process/minidump/./LLDBMinidumpTests/MinidumpParserTest.GetMemory (1044 of 2046)
PASS: lldb-unit :: Host/./HostTests/FileSystemTest.GetPermissions (1045 of 2046)
PASS: lldb-unit :: Language/Highlighting/./HighlighterTests/HighlighterTest.ClangScalarLiterals (1046 of 2046)
PASS: lldb-unit :: ObjectFile/ELF/./ObjectFileELFTests/ObjectFileELFTest.GetSymtab_NoSymEntryPointArmAddressClass (1047 of 2046)
PASS: lldb-api :: commands/expression/persistent_types/TestNestedPersistentTypes.py (1048 of 2046)
PASS: lldb-unit :: Expression/./ExpressionTests/DWARFExpression.DW_OP_pick (1049 of 2046)
UNSUPPORTED: lldb-api :: commands/watchpoints/hello_watchlocation/TestWatchLocation.py (1050 of 2046)
PASS: lldb-unit :: Utility/./UtilityTests/StringListTest.SetSize (1051 of 2046)
PASS: lldb-unit :: Expression/./ExpressionTests/DiagnosticManagerTest.PutStringSeverities (1052 of 2046)
PASS: lldb-unit :: Utility/./UtilityTests/ArgsTest.ReplaceArgumentAtIndexEqual (1053 of 2046)
PASS: lldb-unit :: Utility/./UtilityTests/StreamTest.PutULEB128 (1054 of 2046)
PASS: lldb-unit :: Process/minidump/./LLDBMinidumpTests/MinidumpParserTest.FindMemoryRange (1055 of 2046)
PASS: lldb-unit :: Utility/./UtilityTests/UUIDTest.StringConverion (1056 of 2046)
PASS: lldb-api :: functionalities/data-formatter/data-formatter-disabling/TestDataFormatterDisabling.py (1057 of 2046)
PASS: lldb-unit :: Utility/./UtilityTests/FileSpecTest.GuessPathStyle (1058 of 2046)
PASS: lldb-unit :: Utility/./UtilityTests/StringExtractorTest.GetHexBytesAvail_FullString (1059 of 2046)
PASS: lldb-api :: functionalities/breakpoint/hardware_breakpoints/hardware_breakpoint_on_multiple_threads/TestHWBreakMultiThread.py (1060 of 2046)
PASS: lldb-unit :: Utility/./UtilityTests/StreamTest.PutBytesAsRawHex8ToMixedEndian (1061 of 2046)
PASS: lldb-api :: functionalities/data-formatter/varscript_formatting/TestDataFormatterVarScriptFormatting.py (1062 of 2046)
PASS: lldb-unit :: Symbol/./SymbolTests/PostfixExpression.ParseFPOProgram (1063 of 2046)
PASS: lldb-unit :: Utility/./UtilityTests/StateTest.Formatv (1064 of 2046)
PASS: lldb-unit :: Expression/./ExpressionTests/DiagnosticManagerTest.HasFixits (1065 of 2046)
PASS: lldb-unit :: Language/CPlusPlus/./LanguageCPlusPlusTests/CPlusPlusLanguage.CPlusPlusNameParser (1066 of 2046)
PASS: lldb-api :: functionalities/abbreviation/TestAbbreviations.py (1067 of 2046)
PASS: lldb-unit :: SymbolFile/NativePDB/./SymbolFileNativePDBTests/PDBFPOProgramToDWARFExpressionTests.UnsupportedRASearch (1068 of 2046)
PASS: lldb-unit :: Utility/./UtilityTests/ArgsTest.AppendArguments (1069 of 2046)
PASS: lldb-api :: functionalities/breakpoint/breakpoint_language/TestBreakpointLanguage.py (1070 of 2046)
PASS: lldb-api :: python_api/module_section/TestModuleAndSection.py (1071 of 2046)
PASS: lldb-api :: commands/quit/TestQuit.py (1072 of 2046)
PASS: lldb-unit :: debugserver/./debugserverTests/RNBSocket.AnyListen (1073 of 2046)
PASS: lldb-unit :: Utility/./UtilityTests/StringExtractorTest.GetHexU8_Underflow_NoEof (1074 of 2046)
PASS: lldb-unit :: Expression/./ExpressionTests/DWARFExpression.DW_OP_convert (1075 of 2046)
PASS: lldb-api :: commands/expression/invalid-args/TestInvalidArgsExpression.py (1076 of 2046)
PASS: lldb-unit :: Utility/./UtilityTests/StreamTest.PutNHex8 (1077 of 2046)
PASS: lldb-unit :: Process/gdb-remote/./ProcessGdbRemoteTests/GDBRemoteCommunicationClientTest.SyncThreadState (1078 of 2046)
PASS: lldb-shell :: SymbolFile/DWARF/dir-separator-no-comp-dir.s (1079 of 2046)
PASS: lldb-unit :: Utility/./UtilityTests/ArgsTest.TestOverwriteArgs (1080 of 2046)
PASS: lldb-unit :: Utility/./UtilityTests/StringListTest.LongestCommonPrefix (1081 of 2046)
PASS: lldb-api :: functionalities/gdb_remote_client/TestRecognizeBreakpoint.py (1082 of 2046)
PASS: lldb-api :: lang/objc/rdar-11355592/TestRdar11355592.py (1083 of 2046)
PASS: lldb-shell :: BuildScript/compiler-full-path.test (1084 of 2046)
PASS: lldb-shell :: ObjectFile/MachO/lc_build_version.yaml (1085 of 2046)
PASS: lldb-unit :: SymbolFile/NativePDB/./SymbolFileNativePDBTests/PDBFPOProgramToDWARFExpressionTests.UnknownOp (1086 of 2046)
PASS: lldb-unit :: Utility/./UtilityTests/SerializationRountripTest.SerializeDeserializePodPointers (1087 of 2046)
PASS: lldb-api :: lang/objc/rdar-10967107/TestRdar10967107.py (1088 of 2046)
PASS: lldb-api :: commands/watchpoints/watchpoint_commands/command/TestWatchpointCommandLLDB.py (1089 of 2046)
PASS: lldb-api :: python_api/debugger/TestDebuggerAPI.py (1090 of 2046)
PASS: lldb-unit :: Process/gdb-remote/./ProcessGdbRemoteTests/GDBRemoteCommunicationClientTest.WriteRegisterNoSuffix (1091 of 2046)
PASS: lldb-unit :: Utility/./UtilityTests/DataExtractorTest.GetMaxU64_unchecked (1092 of 2046)
PASS: lldb-api :: functionalities/reproducers/attach/TestReproducerAttach.py (1093 of 2046)
PASS: lldb-api :: iohandler/resize/TestIOHandlerResize.py (1094 of 2046)
PASS: lldb-unit :: Process/minidump/./LLDBMinidumpTests/RegisterContextMinidump.CheckRegisterContextMinidump_ARM (1095 of 2046)
PASS: lldb-unit :: Utility/./UtilityTests/RecordReplayTest.InstrumentedFoo (1096 of 2046)
PASS: lldb-unit :: Utility/./UtilityTests/StringExtractorTest.GetHexBytes_FullString (1097 of 2046)
PASS: lldb-api :: commands/add-dsym/uuid/TestAddDsymCommand.py (1098 of 2046)
UNSUPPORTED: lldb-api :: functionalities/data-formatter/data-formatter-stl/libstdcpp/iterator/TestDataFormatterStdIterator.py (1099 of 2046)
PASS: lldb-unit :: Utility/./UtilityTests/StringListTest.GetMaxStringLengthDecreasingSize (1100 of 2046)
PASS: lldb-api :: commands/frame/diagnose/dereference-argument/TestDiagnoseDereferenceArgument.py (1101 of 2046)
PASS: lldb-api :: functionalities/memory/find/TestMemoryFind.py (1102 of 2046)
PASS: lldb-api :: functionalities/thread/concurrent_events/TestConcurrentTwoWatchpointThreads.py (1103 of 2046)
PASS: lldb-api :: lang/objc/foundation/TestFoundationDisassembly.py (1104 of 2046)
PASS: lldb-api :: lang/objc/objc-foundation-dictionary-empty/TestNSDictionary0.py (1105 of 2046)
PASS: lldb-api :: functionalities/thread/concurrent_events/TestConcurrentManyWatchpoints.py (1106 of 2046)
PASS: lldb-api :: commands/expression/cast_int_to_anonymous_enum/TestCastIntToAnonymousEnum.py (1107 of 2046)
PASS: lldb-api :: tools/lldb-vscode/coreFile/TestVSCode_coreFile.py (1108 of 2046)
PASS: lldb-api :: functionalities/thread/concurrent_events/TestConcurrentCrashWithBreak.py (1109 of 2046)
PASS: lldb-unit :: SymbolFile/DWARF/./SymbolFileDWARFTests/SymbolFileDWARFTests.TestAbbrevInvalidNULLTag (1110 of 2046)
PASS: lldb-unit :: Language/Highlighting/./HighlighterTests/HighlighterTest.ClangTrailingBackslashBeforeNewline (1111 of 2046)
PASS: lldb-unit :: Expression/./ExpressionTests/CppModuleConfigurationTest.Sysroot (1112 of 2046)
PASS: lldb-api :: functionalities/recursion/TestValueObjectRecursion.py (1113 of 2046)
PASS: lldb-unit :: ScriptInterpreter/Python/./ScriptInterpreterPythonTests/PythonDataObjectsTest.TestGlobalNameResolutionNoDot (1114 of 2046)
PASS: lldb-api :: commands/expression/persistent_ptr_update/TestPersistentPtrUpdate.py (1115 of 2046)
PASS: lldb-api :: functionalities/avoids-fd-leak/TestFdLeak.py (1116 of 2046)
UNSUPPORTED: lldb-api :: commands/target/auto-install-main-executable/TestAutoInstallMainExecutable.py (1117 of 2046)
PASS: lldb-unit :: UnwindAssembly/x86/./UnwindAssemblyx86Tests/Testx86AssemblyInspectionEngine.Test32bitFramelessSmallStackFrame (1118 of 2046)
PASS: lldb-unit :: Utility/./UtilityTests/StringExtractorTest.DecodeHexU8_InvalidHex2 (1119 of 2046)
UNSUPPORTED: lldb-shell :: SymbolFile/PDB/function-level-linking.test (1120 of 2046)
PASS: lldb-unit :: Utility/./UtilityTests/StreamTest.PutSLEB128 (1121 of 2046)
PASS: lldb-api :: functionalities/jitloader_gdb/TestJITLoaderGDB.py (1122 of 2046)
PASS: lldb-unit :: Symbol/./SymbolTests/SymbolsTest.TerminateLocateExecutableSymbolFileForUnknownExecutableAndUnknownSymbolFile (1123 of 2046)
UNSUPPORTED: lldb-api :: functionalities/darwin_log/filter/regex/activity-chain/TestDarwinLogFilterRegexActivityChain.py (1124 of 2046)
PASS: lldb-shell :: SymbolFile/DWARF/debug-types-basic.test (1125 of 2046)
PASS: lldb-shell :: SymbolFile/DWARF/debug-types-dwarf5.s (1126 of 2046)
PASS: lldb-api :: lang/cpp/namespace/TestNamespaceLookup.py (1127 of 2046)
PASS: lldb-unit :: Process/gdb-remote/./ProcessGdbRemoteTests/GDBRemoteCommunicationClientTest.SendGetTraceConfigPacket (1128 of 2046)
PASS: lldb-unit :: ScriptInterpreter/Python/./ScriptInterpreterPythonTests/PythonDataObjectsTest.TestPythonTupleValues (1129 of 2046)
PASS: lldb-api :: functionalities/thread/concurrent_events/TestConcurrentDelaySignalBreak.py (1130 of 2046)
PASS: lldb-unit :: Utility/./UtilityTests/FileSpecTest.EqualDotsWindows (1131 of 2046)
PASS: lldb-shell :: ScriptInterpreter/Lua/breakpoint_callback.test (1132 of 2046)
PASS: lldb-unit :: Process/gdb-remote/./ProcessGdbRemoteTests/GDBRemoteCommunicationClientTest.SendStopTracePacket (1133 of 2046)
PASS: lldb-api :: lang/c/step-target/TestStepTarget.py (1134 of 2046)
PASS: lldb-unit :: UnwindAssembly/ARM64/./Arm64InstEmulationTests/TestArm64InstEmulation.TestFramelessThreeEpilogueFunction (1135 of 2046)
PASS: lldb-shell :: Settings/TestLineMarkerColor.test (1136 of 2046)
PASS: lldb-api :: tools/lldb-server/commandline/TestStubReverseConnect.py (1137 of 2046)
PASS: lldb-unit :: ObjectFile/Breakpad/./ObjectFileBreakpadTests/LineRecord.parse (1138 of 2046)
PASS: lldb-unit :: Host/./HostTests/FileSystemTest.EnumerateDirectory (1139 of 2046)
PASS: lldb-unit :: Utility/./UtilityTests/AnsiTerminal.Incomplete (1140 of 2046)
PASS: lldb-unit :: UnwindAssembly/x86/./UnwindAssemblyx86Tests/Testx86AssemblyInspectionEngine.TestPopEDI (1141 of 2046)
PASS: lldb-unit :: Utility/./UtilityTests/StringExtractorTest.GetHexU8_Underflow2_NoEof (1142 of 2046)
UNSUPPORTED: lldb-api :: functionalities/thread/create_during_step/TestCreateDuringStep.py (1143 of 2046)
PASS: lldb-unit :: ScriptInterpreter/Python/./ScriptInterpreterPythonTests/PythonDataObjectsTest.TestPythonByteArray (1144 of 2046)
PASS: lldb-unit :: Utility/./UtilityTests/RegisterValueTest.GetSet8 (1145 of 2046)
PASS: lldb-api :: functionalities/var_path/TestVarPath.py (1146 of 2046)
UNSUPPORTED: lldb-shell :: Register/x86-gp-write.test (1147 of 2046)
PASS: lldb-api :: lang/objc/objc-new-syntax/TestObjCNewSyntaxArray.py (1148 of 2046)
PASS: lldb-unit :: Utility/./UtilityTests/StringListTest.InsertStringAtIndexMove (1149 of 2046)
PASS: lldb-unit :: Process/gdb-remote/./ProcessGdbRemoteTests/GDBRemoteCommunicationClientTest.SendSignalsToIgnore (1150 of 2046)
PASS: lldb-unit :: Symbol/./SymbolTests/SymbolsTest.LocateExecutableSymbolFileForUnknownExecutableAndMissingSymbolFile (1151 of 2046)
PASS: lldb-shell :: Register/x86-64-gp-read.test (1152 of 2046)
UNSUPPORTED: lldb-shell :: SymbolFile/PDB/type-quals.test (1153 of 2046)
PASS: lldb-unit :: Utility/./UtilityTests/StringLexerTest.PutBack (1154 of 2046)
PASS: lldb-api :: functionalities/data-formatter/ptr_ref_typedef/TestPtrRef2Typedef.py (1155 of 2046)
PASS: lldb-unit :: ScriptInterpreter/Python/./ScriptInterpreterPythonTests/PythonDataObjectsTest.TestPythonDictionaryToStructuredDictionary (1156 of 2046)
PASS: lldb-unit :: Utility/./UtilityTests/FileSpecTest.FormatFileSpec (1157 of 2046)
UNSUPPORTED: lldb-api :: tools/intel-features/intel-pt/test/TestIntelPTSimpleBinary.py (1158 of 2046)
PASS: lldb-shell :: SymbolFile/NativePDB/globals-bss.cpp (1159 of 2046)
PASS: lldb-unit :: UnwindAssembly/x86/./UnwindAssemblyx86Tests/Testx86AssemblyInspectionEngine.TestSpArithx86_64Augmented (1160 of 2046)
PASS: lldb-shell :: SymbolFile/DWARF/debug_loc_and_loclists.s (1161 of 2046)
PASS: lldb-api :: lang/objc/objc-static-method/TestObjCStaticMethod.py (1162 of 2046)
PASS: lldb-api :: lang/objc/self/TestObjCSelf.py (1163 of 2046)
PASS: lldb-unit :: Process/minidump/./LLDBMinidumpTests/RegisterContextMinidump.ConvertMinidumpContext_x86_32 (1164 of 2046)
PASS: lldb-api :: functionalities/pre_run_dylibs/TestPreRunDylibs.py (1165 of 2046)
PASS: lldb-unit :: Utility/./UtilityTests/StringExtractorTest.GetHexU8_InvalidHex_NoEof (1166 of 2046)
PASS: lldb-api :: functionalities/float-display/TestFloatDisplay.py (1167 of 2046)
PASS: lldb-api :: functionalities/data-formatter/data-formatter-advanced/TestDataFormatterAdv.py (1168 of 2046)
PASS: lldb-api :: macosx/nslog/TestDarwinNSLogOutput.py (1169 of 2046)
PASS: lldb-api :: functionalities/data-formatter/data-formatter-objc/nsindexpath/TestDataFormatterNSIndexPath.py (1170 of 2046)
PASS: lldb-api :: functionalities/thread/concurrent_events/TestConcurrentManyBreakpoints.py (1171 of 2046)
PASS: lldb-api :: functionalities/memory/read/TestMemoryRead.py (1172 of 2046)
PASS: lldb-shell :: Reproducer/TestProcessList.test (1173 of 2046)
PASS: lldb-shell :: BuildScript/modes.test (1174 of 2046)
PASS: lldb-unit :: debugserver/./debugserverTests/RNBSocket.LoopBackListenIPv4 (1175 of 2046)
PASS: lldb-unit :: Utility/./UtilityTests/ConstStringTest.YAML (1176 of 2046)
PASS: lldb-unit :: Utility/./UtilityTests/XcodeSDKTest.MergeTest (1177 of 2046)
PASS: lldb-api :: functionalities/thread/state_after_expression/TestStateAfterExpression.py (1178 of 2046)
PASS: lldb-unit :: Utility/./UtilityTests/StreamTeeTest.GetStreamAtIndexOutOfBounds (1179 of 2046)
PASS: lldb-unit :: Utility/./UtilityTests/ScalarTest.RightShiftOperator (1180 of 2046)
PASS: lldb-unit :: Expression/./ExpressionTests/ClangHostTest.MacOSX (1181 of 2046)
PASS: lldb-unit :: Utility/./UtilityTests/StreamTest.SetIndentLevel (1182 of 2046)
PASS: lldb-api :: functionalities/data-formatter/data-formatter-stl/libstdcpp/unique_ptr/invalid/TestDataFormatterInvalidStdUniquePtr.py (1183 of 2046)
PASS: lldb-shell :: Quit/TestQuitExitCodeImplicit0.test (1184 of 2046)
PASS: lldb-unit :: Utility/./UtilityTests/StreamTest.PutRawBytesToLittleEndian (1185 of 2046)
PASS: lldb-api :: lang/c/step_over_no_deadlock/TestStepOverDoesntBlock.py (1186 of 2046)
PASS: lldb-unit :: Breakpoint/./LLDBBreakpointTests/BreakpointIDTest.StringIsBreakpointName (1187 of 2046)
PASS: lldb-unit :: Utility/./UtilityTests/LogChannelEnabledTest.LogVerboseThread (1188 of 2046)
UNSUPPORTED: lldb-api :: macosx/macabi/TestMacABImacOSFramework.py (1189 of 2046)
PASS: lldb-shell :: SymbolFile/DWARF/find-qualified-variable.cpp (1190 of 2046)
PASS: lldb-api :: lang/objc/objc-ivar-offsets/TestObjCIvarOffsets.py (1191 of 2046)
PASS: lldb-shell :: ObjectFile/ELF/build-id-case.yaml (1192 of 2046)
PASS: lldb-shell :: Commands/command-regex-delete.test (1193 of 2046)
PASS: lldb-api :: python_api/signals/TestSignalsAPI.py (1194 of 2046)
PASS: lldb-unit :: Signals/./SignalsTests/UnixSignalsTest.GetFilteredSignals (1195 of 2046)
PASS: lldb-unit :: Symbol/./SymbolTests/TestTypeSystemClang.TestNotDeletingUserCopyCstrDueToMoveCStr (1196 of 2046)
PASS: lldb-unit :: Utility/./UtilityTests/CompletionRequest.DuplicateFiltering (1197 of 2046)
PASS: lldb-api :: commands/watchpoints/watchpoint_commands/TestWatchpointCommands.py (1198 of 2046)
PASS: lldb-unit :: Utility/./UtilityTests/StreamTeeTest.CopyConstructor (1199 of 2046)
PASS: lldb-shell :: Host/TestCustomShell.test (1200 of 2046)
UNSUPPORTED: lldb-api :: functionalities/darwin_log/filter/regex/activity/TestDarwinLogFilterRegexActivity.py (1201 of 2046)
PASS: lldb-shell :: Breakpoint/debug_rnglist_offset_pair.test (1202 of 2046)
PASS: lldb-unit :: Utility/./UtilityTests/UriParserTest.LongPath (1203 of 2046)
PASS: lldb-unit :: ScriptInterpreter/Python/./ScriptInterpreterPythonTests/PythonDataObjectsTest.TestPythonStringToStructuredString (1204 of 2046)
PASS: lldb-api :: lang/cpp/signed_types/TestSignedTypes.py (1205 of 2046)
PASS: lldb-unit :: Utility/./UtilityTests/BinaryStreamTest.PutSLEB128Zero (1206 of 2046)
PASS: lldb-api :: lang/objcxx/cxx-bridged-po/TestObjCXXBridgedPO.py (1207 of 2046)
PASS: lldb-shell :: Reproducer/TestDSYM.test (1208 of 2046)
PASS: lldb-unit :: Utility/./UtilityTests/RegularExpression.Valid (1209 of 2046)
PASS: lldb-api :: functionalities/tail_call_frames/sbapi_support/TestTailCallFrameSBAPI.py (1210 of 2046)
PASS: lldb-api :: lang/objc/modules-update/TestClangModulesUpdate.py (1211 of 2046)
PASS: lldb-shell :: ObjectFile/ELF/PT_LOAD-overlap-section.yaml (1212 of 2046)
PASS: lldb-unit :: Utility/./UtilityTests/RangeDataVector.FindEntryIndexesThatContain_Overlap (1213 of 2046)
PASS: lldb-unit :: Utility/./UtilityTests/StringExtractorTest.GetNameColonValueContainsColon (1214 of 2046)
PASS: lldb-api :: python_api/findvalue_duplist/TestSBFrameFindValue.py (1215 of 2046)
PASS: lldb-unit :: Utility/./UtilityTests/SerializationRountripTest.SerializeDeserializeCString (1216 of 2046)
PASS: lldb-api :: lang/cpp/auto/TestCPPAuto.py (1217 of 2046)
PASS: lldb-unit :: Core/./LLDBCoreTests/MangledTest.ResultForValidName (1218 of 2046)
PASS: lldb-unit :: Utility/./UtilityTests/StringListTest.AppendStringCString (1219 of 2046)
PASS: lldb-unit :: Utility/./UtilityTests/GeneratorTest.Create (1220 of 2046)
PASS: lldb-unit :: ScriptInterpreter/Python/./ScriptInterpreterPythonTests/PythonDataObjectsTest.TestPythonTupleInitializerList2 (1221 of 2046)
PASS: lldb-unit :: Utility/./UtilityTests/StringLexerTest.GetUnlexed (1222 of 2046)
UNSUPPORTED: lldb-api :: benchmarks/libcxxmap/TestBenchmarkLibcxxMap.py (1223 of 2046)
PASS: lldb-unit :: Utility/./UtilityTests/SerializationRountripTest.SerializeDeserializeCStringArrayNullptr (1224 of 2046)
PASS: lldb-api :: functionalities/data-formatter/cstring-utf8-summary/TestCstringUnicode.py (1225 of 2046)
PASS: lldb-unit :: Core/./LLDBCoreTests/UniqueCStringMap.NoDefaultConstructor (1226 of 2046)
PASS: lldb-shell :: SymbolFile/Breakpad/stack-cfi-arm.yaml (1227 of 2046)
PASS: lldb-unit :: Expression/./ExpressionTests/CppModuleConfigurationTest.AmbiguousLibCpp (1228 of 2046)
PASS: lldb-shell :: Commands/command-source.test (1229 of 2046)
PASS: lldb-unit :: Process/minidump/./LLDBMinidumpTests/MinidumpParserTest.GetMemoryRegionInfo (1230 of 2046)
PASS: lldb-unit :: Utility/./UtilityTests/ScalarTest.ExtractBitfield (1231 of 2046)
PASS: lldb-unit :: Utility/./UtilityTests/StringExtractorTest.GetHexU8_InvalidHex (1232 of 2046)
PASS: lldb-api :: lang/objc/objc-class-method/TestObjCClassMethod.py (1233 of 2046)
PASS: lldb-unit :: Expression/./ExpressionTests/ClangHostTest.ComputeClangResourceDirectory (1234 of 2046)
PASS: lldb-shell :: SymbolFile/DWARF/DW_OP_piece-struct.s (1235 of 2046)
PASS: lldb-api :: functionalities/inferior-crashing/TestInferiorCrashingStep.py (1236 of 2046)
PASS: lldb-api :: functionalities/thread/concurrent_events/TestConcurrentSignalNWatchNBreak.py (1237 of 2046)
PASS: lldb-unit :: Signals/./SignalsTests/UnixSignalsTest.Iteration (1238 of 2046)
PASS: lldb-unit :: Core/./LLDBCoreTests/SourceFileCache.FindSourceFileFound (1239 of 2046)
PASS: lldb-unit :: Utility/./UtilityTests/StringExtractorTest.GetHexBytes_OddPair2 (1240 of 2046)
PASS: lldb-api :: functionalities/thread/crash_during_step/TestCrashDuringStep.py (1241 of 2046)
PASS: lldb-api :: functionalities/asan/TestReportData.py (1242 of 2046)
PASS: lldb-unit :: ScriptInterpreter/Python/./ScriptInterpreterPythonTests/PythonDataObjectsTest.TestPythonBytes (1243 of 2046)
PASS: lldb-api :: python_api/value/empty_class/TestValueAPIEmptyClass.py (1244 of 2046)
PASS: lldb-unit :: UnwindAssembly/x86/./UnwindAssemblyx86Tests/Testx86AssemblyInspectionEngine.TestPopEBX (1245 of 2046)
PASS: lldb-shell :: ScriptInterpreter/None/import_module.test (1246 of 2046)
PASS: lldb-api :: python_api/hello_world/TestHelloWorld.py (1247 of 2046)
PASS: lldb-unit :: Expression/./ExpressionTests/DiagnosticManagerTest.FixedExpression (1248 of 2046)
PASS: lldb-unit :: Symbol/./SymbolTests/TestTypeSystemClang.TemplateArguments (1249 of 2046)
UNSUPPORTED: lldb-api :: functionalities/darwin_log/filter/exact_match/activity-chain/TestDarwinLogFilterMatchActivityChain.py (1250 of 2046)
PASS: lldb-api :: sanity/TestSettingSkipping.py (1251 of 2046)
PASS: lldb-api :: types/TestFloatTypes.py (1252 of 2046)
PASS: lldb-api :: commands/expression/dont_allow_jit/TestAllowJIT.py (1253 of 2046)
PASS: lldb-api :: functionalities/gdb_remote_client/TestRestartBug.py (1254 of 2046)
PASS: lldb-api :: macosx/add-dsym/TestAddDsymMidExecutionCommand.py (1255 of 2046)
PASS: lldb-shell :: Minidump/fb-dump.test (1256 of 2046)
UNSUPPORTED: lldb-api :: functionalities/darwin_log/filter/regex/message/TestDarwinLogFilterRegexMessage.py (1257 of 2046)
PASS: lldb-unit :: Host/./HostTests/SocketAddressTest.GetAddressInfo (1258 of 2046)
PASS: lldb-shell :: Quit/TestQuitExitCode-30.test (1259 of 2046)
PASS: lldb-unit :: ScriptInterpreter/Python/./ScriptInterpreterPythonTests/PythonDataObjectsTest.TestScript (1260 of 2046)
PASS: lldb-api :: commands/expression/dollar-in-variable/TestDollarInVariable.py (1261 of 2046)
PASS: lldb-unit :: Utility/./UtilityTests/ArchSpecTest.TestParseMachCPUDashSubtypeTripleSimple (1262 of 2046)
PASS: lldb-shell :: ObjectFile/MachO/lc_version_min.yaml (1263 of 2046)
PASS: lldb-shell :: Reproducer/Functionalities/TestExpressionEvaluation.test (1264 of 2046)
PASS: lldb-unit :: Expression/./ExpressionTests/CppModuleConfigurationTest.Linux (1265 of 2046)
PASS: lldb-api :: python_api/watchpoint/watchlocation/TestTargetWatchAddress.py (1266 of 2046)
PASS: lldb-unit :: Utility/./UtilityTests/StringExtractorTest.InitEmpty (1267 of 2046)
PASS: lldb-shell :: Reproducer/TestCaptureEnvOverride.test (1268 of 2046)
PASS: lldb-api :: commands/target/create-no-such-arch/TestNoSuchArch.py (1269 of 2046)
PASS: lldb-api :: functionalities/tail_call_frames/unambiguous_sequence/TestUnambiguousTailCalls.py (1270 of 2046)
PASS: lldb-unit :: Utility/./UtilityTests/TimerTest.CategoryTimesStats (1271 of 2046)
PASS: lldb-unit :: Process/gdb-remote/./ProcessGdbRemoteTests/GDBRemoteClientBaseTest.SendContinueAndAsyncPacket (1272 of 2046)
PASS: lldb-api :: lang/cpp/template/TestTemplateArgs.py (1273 of 2046)
PASS: lldb-api :: functionalities/data-formatter/data-formatter-objc/TestDataFormatterObjCNSData.py (1274 of 2046)
PASS: lldb-shell :: ObjectFile/PECOFF/basic-info.yaml (1275 of 2046)
PASS: lldb-api :: lang/objc/foundation/TestObjectDescriptionAPI.py (1276 of 2046)
PASS: lldb-unit :: Utility/./UtilityTests/RecordReplayTest.InstrumentedFooSameThis (1277 of 2046)
PASS: lldb-unit :: Symbol/./SymbolTests/TestTypeSystemClang.TestGetEnumIntegerTypeBasicTypes (1278 of 2046)
PASS: lldb-unit :: Utility/./UtilityTests/StringListTest.LongestCommonPrefixEmpty (1279 of 2046)
PASS: lldb-unit :: Process/minidump/./LLDBMinidumpTests/MinidumpParserTest.GetMemoryRegionInfoFromMemoryList (1280 of 2046)
PASS: lldb-api :: python_api/sbenvironment/TestSBEnvironment.py (1281 of 2046)
PASS: lldb-shell :: SymbolFile/NativePDB/ast-functions.cpp (1282 of 2046)
PASS: lldb-api :: functionalities/tail_call_frames/thread_step_out_message/TestArtificialFrameStepOutMessage.py (1283 of 2046)
PASS: lldb-unit :: ScriptInterpreter/Python/./ScriptInterpreterPythonTests/PythonDataObjectsTest.TestPythonListManipulation (1284 of 2046)
PASS: lldb-unit :: Utility/./UtilityTests/RangeTest.LessThanInvalid (1285 of 2046)
PASS: lldb-api :: commands/log/basic/TestLogging.py (1286 of 2046)
PASS: lldb-unit :: UnwindAssembly/x86/./UnwindAssemblyx86Tests/Testx86AssemblyInspectionEngine.Test64bitFramelessSmallStackFrame (1287 of 2046)
PASS: lldb-shell :: SymbolFile/DWARF/array-sizes.s (1288 of 2046)
PASS: lldb-unit :: Utility/./UtilityTests/Flags.IsClear (1289 of 2046)
PASS: lldb-unit :: Utility/./UtilityTests/StringLexerTest.Peek (1290 of 2046)
PASS: lldb-unit :: Host/./HostTests/FileSystemTest.GetByteSize (1291 of 2046)
PASS: lldb-api :: commands/expression/import-std-module/vector/TestVectorFromStdModule.py (1292 of 2046)
PASS: lldb-api :: lang/c/function_types/TestFunctionTypes.py (1293 of 2046)
PASS: lldb-unit :: Utility/./UtilityTests/FileSpecTest.Yaml (1294 of 2046)
PASS: lldb-unit :: Utility/./UtilityTests/DataExtractorTest.GetMaxU64 (1295 of 2046)
PASS: lldb-unit :: Utility/./UtilityTests/DataExtractorTest.UncommonAddressSize (1296 of 2046)
PASS: lldb-api :: lang/cpp/constructors/TestCppConstructors.py (1297 of 2046)
PASS: lldb-unit :: Utility/./UtilityTests/BinaryStreamTest.PutSLEB128NineBytes (1298 of 2046)
PASS: lldb-api :: macosx/save_crashlog/TestSaveCrashlog.py (1299 of 2046)
PASS: lldb-unit :: Host/./HostTests/FileSystemTest.MakeAbsolute (1300 of 2046)
PASS: lldb-api :: lang/cpp/const_this/TestConstThis.py (1301 of 2046)
PASS: lldb-api :: commands/expression/calculator_mode/TestCalculatorMode.py (1302 of 2046)
PASS: lldb-unit :: Language/Highlighting/./HighlighterTests/HighlighterTest.ClangPPDirectives (1303 of 2046)
PASS: lldb-unit :: SymbolFile/NativePDB/./SymbolFileNativePDBTests/PDBFPOProgramToDWARFExpressionTests.InvalidOpBinary (1304 of 2046)
PASS: lldb-unit :: Utility/./UtilityTests/StreamTest.AddressNoSuffix (1305 of 2046)
PASS: lldb-unit :: Utility/./UtilityTests/ConstStringTest.NullAndEmptyStates (1306 of 2046)
PASS: lldb-api :: functionalities/archives/TestBSDArchives.py (1307 of 2046)
PASS: lldb-api :: functionalities/dead-strip/TestDeadStrip.py (1308 of 2046)
PASS: lldb-unit :: Expression/./ExpressionTests/DWARFExpression.DW_OP_piece (1309 of 2046)
PASS: lldb-unit :: Host/./HostTests/SocketTest.TCPListen0GetPort (1310 of 2046)
PASS: lldb-unit :: ScriptInterpreter/Python/./ScriptInterpreterPythonTests/PythonDataObjectsTest.TestPythonTupleSize (1311 of 2046)
FAIL: lldb-api :: functionalities/exec/TestExec.py (1312 of 2046)
******************** TEST 'lldb-api :: functionalities/exec/TestExec.py' FAILED ********************
Script:
--
/usr/local/Frameworks/Python.framework/Versions/3.7/bin/python3.7 /Users/buildslave/jenkins/workspace/lldb-cmake/llvm-project/lldb/test/API/dotest.py --arch x86_64 -s /Users/buildslave/jenkins/workspace/lldb-cmake/lldb-build/lldb-test-traces -S nm -u CXXFLAGS -u CFLAGS --codesign-identity lldb_codesign --server /Users/buildslave/jenkins/workspace/lldb-cmake/lldb-build/./bin/debugserver --arch x86_64 --build-dir /Users/buildslave/jenkins/workspace/lldb-cmake/lldb-build/lldb-test-build.noindex -s=/Users/buildslave/jenkins/workspace/lldb-cmake/test/logs -t --env TERM=vt100 --env LLVM_LIBS_DIR=/Users/buildslave/jenkins/workspace/lldb-cmake/lldb-build/./lib --build-dir /Users/buildslave/jenkins/workspace/lldb-cmake/lldb-build/lldb-test-build.noindex --lldb-module-cache-dir /Users/buildslave/jenkins/workspace/lldb-cmake/lldb-build/lldb-test-build.noindex/module-cache-lldb/lldb-api --clang-module-cache-dir /Users/buildslave/jenkins/workspace/lldb-cmake/lldb-build/lldb-test-build.noindex/module-cache-clang/lldb-api --executable /Users/buildslave/jenkins/workspace/lldb-cmake/lldb-build/./bin/lldb --compiler /Users/buildslave/jenkins/workspace/lldb-cmake/lldb-build/./bin/clang --dsymutil /Users/buildslave/jenkins/workspace/lldb-cmake/lldb-build/./bin/dsymutil --filecheck /Users/buildslave/jenkins/workspace/lldb-cmake/lldb-build/./bin/FileCheck --lldb-libs-dir /Users/buildslave/jenkins/workspace/lldb-cmake/lldb-build/./lib /Users/buildslave/jenkins/workspace/lldb-cmake/llvm-project/lldb/test/API/functionalities/exec -p TestExec.py
--
Exit Code: 1

Hide Details

Command Output (stdout): -- lldb version 11.0.99 clang revision 5477cf06d654e319ed066ba7f497e278853762be llvm revision 5477cf06d654e319ed066ba7f497e278853762be LLDB library dir: /Users/buildslave/jenkins/workspace/lldb-cmake/lldb-build/bin LLDB import library dir: /Users/buildslave/jenkins/workspace/lldb-cmake/lldb-build/./lib libstdcxx tests will not be run because: Don't know how to build with libstdcxx on macosx Skipping following debug info categories: ['dwo'] thread #2: tid = 0x1fae03a, 0x000000010b34df58 secondprog`main at secondprog.cpp:4:3, queue = 'com.apple.main-thread', stop reason = breakpoint 2.1 thread #2: tid = 0x1faeda8, 0x000000010f14c015, stop reason = EXC_BAD_ACCESS (code=1, address=0x10f1cde40)

Hide Details

-- Command Output (stderr): --

Hide Details

Session logs for test failures/errors/unexpected successes will go into directory '/Users/buildslave/jenkins/workspace/lldb-cmake/test/logs' Change dir to: /Users/buildslave/jenkins/workspace/lldb-cmake/llvm-project/lldb/test/API/functionalities/exec runCmd: settings clear -all output:

Hide Details

runCmd: settings set symbols.enable-external-lookup false output:

Hide Details

runCmd: settings set target.auto-apply-fixits false output:

Hide Details

runCmd: settings set plugin.process.gdb-remote.packet-timeout 60 output:

Hide Details

runCmd: settings set symbols.clang-modules-cache-path "/Users/buildslave/jenkins/workspace/lldb-cmake/lldb-build/lldb-test-build.noindex/module-cache-lldb/lldb-api" output:

Hide Details

runCmd: settings set use-color false output:

Hide Details

runCmd: setting set target.prefer-dynamic-value no-dynamic-values output:

Hide Details

runCmd: settings show target.process.stop-on-exec check of return status not required output: target.process.stop-on-exec (boolean) = true

Hide Details

Hide Details

<bound method SBProcess.Kill of <lldb.SBProcess; proxy of <Swig Object of type 'lldb::SBProcess *' at 0x113cb5c30> >>: success

Hide Details

PASS: LLDB (/Users/buildslave/jenkins/workspace/lldb-cmake/lldb-build/bin/clang-11-x86_64) :: test_hitting_exec (TestExec.ExecTestCase) runCmd: settings clear -all output:

Hide Details

runCmd: settings set symbols.enable-external-lookup false output:

Hide Details

runCmd: settings set target.auto-apply-fixits false output:

Hide Details

runCmd: settings set plugin.process.gdb-remote.packet-timeout 60 output:

Hide Details

runCmd: settings set symbols.clang-modules-cache-path "/Users/buildslave/jenkins/workspace/lldb-cmake/lldb-build/lldb-test-build.noindex/module-cache-lldb/lldb-api" output:

Hide Details

runCmd: settings set use-color false output:

Hide Details

runCmd: setting set target.prefer-dynamic-value no-dynamic-values output:

Hide Details

runCmd: settings show target.process.stop-on-exec check of return status not required output: target.process.stop-on-exec (boolean) = true

Hide Details

Hide Details

Adding tearDown hook: def cleanup(): self.runCmd("settings set target.process.stop-on-exec false", check=False)

Hide Details

Hide Details

runCmd: bt output: * thread #2, stop reason = EXC_BAD_ACCESS (code=1, address=0x10f1cde40) * frame #0: 0x000000010f14c015

Hide Details

Hide Details

FAIL: LLDB (/Users/buildslave/jenkins/workspace/lldb-cmake/lldb-build/bin/clang-11-x86_64) :: test_skipping_exec (TestExec.ExecTestCase) <bound method SBProcess.Kill of <lldb.SBProcess; proxy of <Swig Object of type 'lldb::SBProcess *' at 0x10c392bd0> >>: success

Hide Details

Executing tearDown hook: def cleanup(): self.runCmd("settings set target.process.stop-on-exec false", check=False)

Hide Details

Hide Details

runCmd: settings set target.process.stop-on-exec false check of return status not required output:

Hide Details

Restore dir to: /Users/buildslave/jenkins/workspace/lldb-cmake/lldb-build/tools/lldb/test ====================================================================== FAIL: test_skipping_exec (TestExec.ExecTestCase) ---------------------------------------------------------------------- Traceback (most recent call last): File "/Users/buildslave/jenkins/workspace/lldb-cmake/llvm-project/lldb/packages/Python/lldbsuite/test/decorators.py", line 110, in wrapper func(*args, **kwargs) File "/Users/buildslave/jenkins/workspace/lldb-cmake/llvm-project/lldb/packages/Python/lldbsuite/test/decorators.py", line 110, in wrapper func(*args, **kwargs) File "/Users/buildslave/jenkins/workspace/lldb-cmake/llvm-project/lldb/packages/Python/lldbsuite/test/decorators.py", line 110, in wrapper func(*args, **kwargs) File "/Users/buildslave/jenkins/workspace/lldb-cmake/llvm-project/lldb/packages/Python/lldbsuite/test/decorators.py", line 140, in wrapper func(*args, **kwargs) File "/Users/buildslave/jenkins/workspace/lldb-cmake/llvm-project/lldb/test/API/functionalities/exec/TestExec.py", line 33, in test_skipping_exec self.do_test(True) File "/Users/buildslave/jenkins/workspace/lldb-cmake/llvm-project/lldb/test/API/functionalities/exec/TestExec.py", line 113, in do_test "Stopped at breakpoint in exec'ed process.") AssertionError: False is not True : Stopped at breakpoint in exec'ed process. Config=x86_64-/Users/buildslave/jenkins/workspace/lldb-cmake/lldb-build/bin/clang-11 ---------------------------------------------------------------------- Ran 2 tests in 6.058s

Hide Details

RESULT: FAILED (1 passes, 1 failures, 0 errors, 0 skipped, 0 expected failures, 0 unexpected successes)

Hide Details

--

Hide Details

******************** PASS: lldb-api :: commands/expression/argument_passing_restrictions/TestArgumentPassingRestrictions.py (1313 of 2046) PASS: lldb-unit :: UnwindAssembly/x86/./UnwindAssemblyx86Tests/Testx86AssemblyInspectionEngine.TestPushR13 (1314 of 2046) PASS: lldb-api :: lang/cpp/namespace_definitions/TestNamespaceDefinitions.py (1315 of 2046) PASS: lldb-unit :: Utility/./UtilityTests/VMRange.ContainsAddr (1316 of 2046) PASS: lldb-api :: functionalities/data-formatter/data-formatter-stl/libcxx/unordered/TestDataFormatterUnordered.py (1317 of 2046) PASS: lldb-shell :: SymbolFile/Breakpad/unwind-via-stack-win-no-memory-info.yaml (1318 of 2046) PASS: lldb-unit :: Utility/./UtilityTests/UriParserTest.SchemeHostSeparator (1319 of 2046) PASS: lldb-shell :: SymbolFile/NativePDB/disassembly.cpp (1320 of 2046) PASS: lldb-unit :: Process/gdb-remote/./ProcessGdbRemoteTests/GDBRemoteCommunicationClientTest.GetModulesInfoInvalidResponse (1321 of 2046) PASS: lldb-api :: functionalities/data-formatter/data-formatter-globals/TestDataFormatterGlobals.py (1322 of 2046) PASS: lldb-unit :: Disassembler/./DisassemblerTests/TestArm64Disassembly.TestArmv81Instruction (1323 of 2046) PASS: lldb-api :: lang/objc/ivar-IMP/TestObjCiVarIMP.py (1324 of 2046) UNSUPPORTED: lldb-shell :: SymbolFile/PDB/func-symbols.test (1325 of 2046) PASS: lldb-api :: functionalities/data-formatter/data-formatter-stl/libcxx/function/TestLibCxxFunction.py (1326 of 2046) PASS: lldb-api :: commands/expression/persistent_variables/TestPersistentVariables.py (1327 of 2046) PASS: lldb-unit :: Utility/./UtilityTests/BinaryStreamTest.PutSLEB128EightBytes (1328 of 2046) PASS: lldb-api :: macosx/find-dsym/deep-bundle/TestDeepBundle.py (1329 of 2046) PASS: lldb-api :: lang/objc/orderedset/TestOrderedSet.py (1330 of 2046) PASS: lldb-api :: lang/objc/single-entry-dictionary/TestObjCSingleEntryDictionary.py (1331 of 2046) PASS: lldb-unit :: SymbolFile/NativePDB/./SymbolFileNativePDBTests/PDBFPOProgramToDWARFExpressionTests.DependencyChain (1332 of 2046) PASS: lldb-unit :: Utility/./UtilityTests/ScalarTest.GetValue (1333 of 2046) PASS: lldb-unit :: Utility/./UtilityTests/SerializationRountripTest.SerializeDeserializeCStringArray (1334 of 2046) UNSUPPORTED: lldb-api :: functionalities/breakpoint/breakpoint_in_delayslot/TestAvoidBreakpointInDelaySlot.py (1335 of 2046) PASS: lldb-unit :: Utility/./UtilityTests/StreamTest.AddressPrefix (1336 of 2046) PASS: lldb-shell :: BuildScript/toolchain-clang.test (1337 of 2046) PASS: lldb-api :: functionalities/data-formatter/data-formatter-stl/libcxx/tuple/TestDataFormatterLibcxxTuple.py (1338 of 2046) PASS: lldb-api :: functionalities/show_location/TestShowLocationDwarf5.py (1339 of 2046) PASS: lldb-api :: functionalities/data-formatter/nsdictionarysynth/TestNSDictionarySynthetic.py (1340 of 2046) PASS: lldb-unit :: Utility/./UtilityTests/ConstStringTest.FromMidOfBufferStringRef (1341 of 2046) PASS: lldb-unit :: Utility/./UtilityTests/UriParserTest.BadPort2 (1342 of 2046) PASS: lldb-api :: commands/watchpoints/watchpoint_set_command/TestWatchLocationWithWatchSet.py (1343 of 2046) PASS: lldb-unit :: Utility/./UtilityTests/ScalarTest.Comparison (1344 of 2046) PASS: lldb-api :: functionalities/tail_call_frames/inlining_and_tail_calls/TestInliningAndTailCalls.py (1345 of 2046) PASS: lldb-unit :: Process/gdb-remote/./ProcessGdbRemoteTests/GDBRemoteCommunicationServerTest.SendErrorResponse_UnimplementedError (1346 of 2046) PASS: lldb-unit :: Utility/./UtilityTests/ArgsTest.ReplaceArgumentAtIndexFarOutOfRange (1347 of 2046) PASS: lldb-unit :: Symbol/./SymbolTests/TestTypeSystemClang.TestConvertAccessTypeToAccessSpecifier (1348 of 2046) PASS: lldb-api :: lang/objc/radar-9691614/TestObjCMethodReturningBOOL.py (1349 of 2046) PASS: lldb-api :: python_api/watchpoint/watchlocation/TestSetWatchlocation.py (1350 of 2046) PASS: lldb-unit :: Utility/./UtilityTests/SerializationRountripTest.SerializeDeserializeObjectReference (1351 of 2046) PASS: lldb-unit :: Utility/./UtilityTests/StreamTest.Indent (1352 of 2046) PASS: lldb-api :: functionalities/thread/concurrent_events/TestConcurrentSignalDelayWatch.py (1353 of 2046) PASS: lldb-api :: lang/cpp/modules-import/TestCXXModulesImport.py (1354 of 2046) PASS: lldb-api :: commands/expression/fixits/TestFixIts.py (1355 of 2046) PASS: lldb-api :: functionalities/tsan/global_location/TestTsanGlobalLocation.py (1356 of 2046) PASS: lldb-api :: functionalities/data-formatter/var-in-aggregate-misuse/TestVarInAggregateMisuse.py (1357 of 2046) PASS: lldb-api :: python_api/formatters/TestFormattersSBAPI.py (1358 of 2046) PASS: lldb-shell :: Commands/command-regex-unalias.test (1359 of 2046) PASS: lldb-unit :: Utility/./UtilityTests/UUIDTest.Validity (1360 of 2046) PASS: lldb-unit :: UnwindAssembly/x86/./UnwindAssemblyx86Tests/Testx86AssemblyInspectionEngine.TestReturnDetect (1361 of 2046) PASS: lldb-unit :: Utility/./UtilityTests/StreamTest.AddressSuffix (1362 of 2046) PASS: lldb-api :: lang/cpp/type_lookup/TestCppTypeLookup.py (1363 of 2046) PASS: lldb-api :: lang/mixed/TestMixedLanguages.py (1364 of 2046) PASS: lldb-api :: functionalities/pointer_num_children/TestPointerNumChildren.py (1365 of 2046) PASS: lldb-unit :: ObjectFile/ELF/./ObjectFileELFTests/ObjectFileELFTest.SectionsResolveConsistently (1366 of 2046) PASS: lldb-unit :: ObjectFile/ELF/./ObjectFileELFTests/ObjectFileELFTest.GetSymtab_NoSymEntryPointArmThumbAddressClass (1367 of 2046) PASS: lldb-shell :: Quit/TestQuitExitCodeNonInt.test (1368 of 2046) PASS: lldb-unit :: Utility/./UtilityTests/FileSpecTest.EqualSeparator (1369 of 2046) PASS: lldb-unit :: ScriptInterpreter/Python/./ScriptInterpreterPythonTests/PythonDataObjectsTest.TestObjectAttributes (1370 of 2046) PASS: lldb-api :: functionalities/gdb_remote_client/TestNoGPacketSupported.py (1371 of 2046) UNSUPPORTED: lldb-shell :: Register/x86-ymm-write.test (1372 of 2046) PASS: lldb-unit :: Disassembler/./DisassemblerTests/TestArmv7Disassembly.TestCortexFPDisass (1373 of 2046) PASS: lldb-unit :: Utility/./UtilityTests/ScalarTest.CastOperations (1374 of 2046) PASS: lldb-unit :: Utility/./UtilityTests/StreamTeeTest.SetStreamAtIndexOverwrite (1375 of 2046) PASS: lldb-unit :: Utility/./UtilityTests/StreamTeeTest.Flush (1376 of 2046) PASS: lldb-api :: commands/expression/expr-in-syscall/TestExpressionInSyscall.py (1377 of 2046) PASS: lldb-unit :: ObjectFile/Breakpad/./ObjectFileBreakpadTests/FileRecord.parse (1378 of 2046) PASS: lldb-api :: functionalities/gdb_remote_client/TestPlatformClient.py (1379 of 2046) PASS: lldb-api :: functionalities/postmortem/elf-core/thread_crash/TestLinuxCoreThreads.py (1380 of 2046) PASS: lldb-api :: functionalities/thread/concurrent_events/TestConcurrentDelayWatchBreak.py (1381 of 2046) PASS: lldb-unit :: Utility/./UtilityTests/StringListTest.AppendList (1382 of 2046) PASS: lldb-api :: functionalities/dynamic_value_child_count/TestDynamicValueChildCount.py (1383 of 2046) PASS: lldb-unit :: Utility/./UtilityTests/AnsiTerminal.Twice (1384 of 2046) PASS: lldb-unit :: Utility/./UtilityTests/UriParserTest.BracketedHostname (1385 of 2046) PASS: lldb-api :: functionalities/tail_call_frames/ambiguous_tail_call_seq2/TestAmbiguousTailCallSeq2.py (1386 of 2046) PASS: lldb-unit :: Utility/./UtilityTests/RegularExpression.Invalid (1387 of 2046) PASS: lldb-api :: functionalities/breakpoint/cpp/TestCPPBreakpointLocations.py (1388 of 2046) PASS: lldb-unit :: UnwindAssembly/x86/./UnwindAssemblyx86Tests/Testx86AssemblyInspectionEngine.TestLEAVE (1389 of 2046) PASS: lldb-api :: commands/expression/pr35310/TestExprsBug35310.py (1390 of 2046) UNSUPPORTED: lldb-shell :: SymbolFile/DWARF/split-dwarf-expression-eval-bug.cpp (1391 of 2046) PASS: lldb-unit :: Symbol/./SymbolTests/TestClangASTImporter.RecordLayout (1392 of 2046) PASS: lldb-api :: functionalities/tail_call_frames/thread_step_out_or_return/TestSteppingOutWithArtificialFrames.py (1393 of 2046) PASS: lldb-shell :: ScriptInterpreter/Python/crashlog.test (1394 of 2046) PASS: lldb-shell :: SymbolFile/Breakpad/symtab.test (1395 of 2046) PASS: lldb-api :: functionalities/target_var/TestTargetVar.py (1396 of 2046) PASS: lldb-shell :: Reproducer/TestDriverOptions.test (1397 of 2046) PASS: lldb-unit :: UnwindAssembly/x86/./UnwindAssemblyx86Tests/Testx86AssemblyInspectionEngine.TestStackRealignMSVC_i386 (1398 of 2046) UNSUPPORTED: lldb-api :: benchmarks/continue/TestBenchmarkContinue.py (1399 of 2046) PASS: lldb-api :: commands/expression/top-level/TestTopLevelExprs.py (1400 of 2046) PASS: lldb-api :: commands/command/nested_alias/TestNestedAlias.py (1401 of 2046) PASS: lldb-api :: lang/c/local_variables/TestLocalVariables.py (1402 of 2046) PASS: lldb-unit :: Utility/./UtilityTests/StreamTest.ShiftOperatorStrings (1403 of 2046) PASS: lldb-api :: lang/cpp/scope/TestCppScope.py (1404 of 2046) PASS: lldb-unit :: Utility/./UtilityTests/BinaryStreamTest.PutULEB128TwoBytes (1405 of 2046) PASS: lldb-unit :: Language/Highlighting/./HighlighterTests/HighlighterTest.ClangCursorPosBeforeOtherToken (1406 of 2046) PASS: lldb-api :: python_api/frame/inlines/TestInlinedFrame.py (1407 of 2046) PASS: lldb-unit :: Utility/./UtilityTests/StringListTest.CopyList (1408 of 2046) PASS: lldb-api :: commands/gui/basic/TestGuiBasic.py (1409 of 2046) PASS: lldb-unit :: Utility/./UtilityTests/UriParserTest.Minimal (1410 of 2046) PASS: lldb-api :: python_api/value/linked_list/TestValueAPILinkedList.py (1411 of 2046) PASS: lldb-api :: commands/expression/completion-crash-incomplete-record/TestCompletionCrashIncompleteRecord.py (1412 of 2046) PASS: lldb-api :: tools/lldb-server/inferior-crash/TestGdbRemoteSegFault.py (1413 of 2046) PASS: lldb-api :: tools/lldb-vscode/launch/TestVSCode_launch.py (1414 of 2046) PASS: lldb-shell :: Breakpoint/ppc64-localentry.test (1415 of 2046) UNSUPPORTED: lldb-api :: lang/objc/bitfield_ivars/TestBitfieldIvars.py (1416 of 2046) PASS: lldb-shell :: SymbolFile/NativePDB/global-classes.cpp (1417 of 2046) PASS: lldb-unit :: Utility/./UtilityTests/ProcessInstanceInfo.DumpTable_invalidUID (1418 of 2046) PASS: lldb-unit :: Utility/./UtilityTests/RangeTest.DoesIntersect (1419 of 2046) PASS: lldb-shell :: ObjectFile/Breakpad/sections.test (1420 of 2046) PASS: lldb-api :: functionalities/thread/concurrent_events/TestConcurrentDelayedCrashWithBreakpointWatchpoint.py (1421 of 2046) PASS: lldb-unit :: UnwindAssembly/x86/./UnwindAssemblyx86Tests/Testx86AssemblyInspectionEngine.Test32bitFramelessBigStackFrame (1422 of 2046) PASS: lldb-api :: functionalities/unwind/noreturn/TestNoreturnUnwind.py (1423 of 2046) PASS: lldb-unit :: Symbol/./SymbolTests/TestClangASTImporter.ImportInvalidType (1424 of 2046) PASS: lldb-api :: functionalities/data-formatter/compactvectors/TestCompactVectors.py (1425 of 2046) PASS: lldb-api :: python_api/file_handle/TestFileHandle.py (1426 of 2046) PASS: lldb-api :: functionalities/paths/TestPaths.py (1427 of 2046) PASS: lldb-unit :: Utility/./UtilityTests/StringExtractorTest.GetHexBytes_Partial (1428 of 2046) PASS: lldb-api :: tools/lldb-vscode/stackTrace/TestVSCode_stackTrace.py (1429 of 2046) PASS: lldb-api :: api/log/TestAPILog.py (1430 of 2046) PASS: lldb-api :: commands/expression/test/TestExprs.py (1431 of 2046) PASS: lldb-api :: functionalities/unwind/noreturn/module-end/TestNoReturnModuleEnd.py (1432 of 2046) PASS: lldb-unit :: Symbol/./SymbolTests/LineEntryTest.GetSameLineContiguousAddressRangeOneInline (1433 of 2046) PASS: lldb-api :: functionalities/data-formatter/data-formatter-synth/TestDataFormatterSynth.py (1434 of 2046) PASS: lldb-unit :: Utility/./UtilityTests/ArchSpecTest.TestParseMachCPUDashSubtypeTripleExtra (1435 of 2046) PASS: lldb-api :: functionalities/thread/concurrent_events/TestConcurrentTwoWatchpointsOneBreakpoint.py (1436 of 2046) PASS: lldb-unit :: Utility/./UtilityTests/FileSpecTest.Match (1437 of 2046) PASS: lldb-unit :: Utility/./UtilityTests/RangeTest.LessThan (1438 of 2046) PASS: lldb-api :: commands/expression/import-std-module/list/TestListFromStdModule.py (1439 of 2046) PASS: lldb-unit :: Utility/./UtilityTests/StringLexerTest.AdvanceIf (1440 of 2046) PASS: lldb-unit :: SymbolFile/NativePDB/./SymbolFileNativePDBTests/PDBFPOProgramToDWARFExpressionTests.MultipleIndependentAssignments (1441 of 2046) PASS: lldb-unit :: Host/./HostTests/NativeProcessProtocolTest.SetBreakpoint (1442 of 2046) PASS: lldb-unit :: Utility/./UtilityTests/StringListTest.InsertStringAtIndexOutOfBounds (1443 of 2046) PASS: lldb-shell :: SymbolFile/NativePDB/function-types-calling-conv.cpp (1444 of 2046) PASS: lldb-shell :: SymbolFile/DWARF/parallel-indexing-stress.s (1445 of 2046) PASS: lldb-unit :: ObjectFile/Breakpad/./ObjectFileBreakpadTests/Record.classify (1446 of 2046) PASS: lldb-unit :: Utility/./UtilityTests/ProcessInfoTest.Constructor (1447 of 2046) PASS: lldb-api :: python_api/watchpoint/condition/TestWatchpointConditionAPI.py (1448 of 2046) PASS: lldb-unit :: ScriptInterpreter/Python/./ScriptInterpreterPythonTests/PythonDataObjectsTest.TestPythonTupleToStructuredList (1449 of 2046) PASS: lldb-shell :: Reproducer/TestWorkingDir.test (1450 of 2046) PASS: lldb-unit :: Symbol/./SymbolTests/TestClangASTImporter.CopyTypeTagDecl (1451 of 2046) PASS: lldb-unit :: Expression/./ExpressionTests/CppModuleConfigurationTest.Xcode (1452 of 2046) PASS: lldb-api :: lang/objc/objc-optimized/TestObjcOptimized.py (1453 of 2046) PASS: lldb-unit :: Utility/./UtilityTests/UriParserTest.MinimalPort (1454 of 2046) PASS: lldb-unit :: Expression/./ExpressionTests/DiagnosticManagerTest.GetStringSeverityLabels (1455 of 2046) PASS: lldb-api :: functionalities/tsan/cpp_global_location/TestTsanCPPGlobalLocation.py (1456 of 2046) UNSUPPORTED: lldb-api :: functionalities/darwin_log/format/TestDarwinLogMessageFormat.py (1457 of 2046) PASS: lldb-unit :: Utility/./UtilityTests/UriParserTest.BracketedHostnameWithPortIPv4 (1458 of 2046) PASS: lldb-api :: commands/watchpoints/watchpoint_disable/TestWatchpointDisable.py (1459 of 2046) PASS: lldb-shell :: ScriptInterpreter/None/none.test (1460 of 2046) PASS: lldb-api :: lang/objc/objc-ivar-protocols/TestIvarProtocols.py (1461 of 2046) PASS: lldb-api :: python_api/sbplatform/TestSBPlatform.py (1462 of 2046) PASS: lldb-api :: lang/objc/modules-auto-import/TestModulesAutoImport.py (1463 of 2046) PASS: lldb-unit :: Utility/./UtilityTests/Flags.AllClear (1464 of 2046) PASS: lldb-unit :: Process/gdb-remote/./ProcessGdbRemoteTests/GDBRemoteCommunicationClientTest.SaveRestoreRegistersNoSuffix (1465 of 2046) PASS: lldb-shell :: SymbolFile/DWARF/dwp.s (1466 of 2046) PASS: lldb-api :: functionalities/data-formatter/data-formatter-stl/libcxx/atomic/TestLibCxxAtomic.py (1467 of 2046) PASS: lldb-api :: lang/cpp/frame-var-anon-unions/TestFrameVariableAnonymousUnions.py (1468 of 2046) PASS: lldb-api :: commands/frame/diagnose/bad-reference/TestBadReference.py (1469 of 2046) PASS: lldb-unit :: Utility/./UtilityTests/ScalarTest.ComparisonFloat (1470 of 2046) PASS: lldb-api :: functionalities/thread/concurrent_events/TestConcurrentWatchBreak.py (1471 of 2046) PASS: lldb-unit :: Utility/./UtilityTests/ConstStringTest.UpdateMangledCounterpart (1472 of 2046) PASS: lldb-api :: macosx/universal/TestUniversal.py (1473 of 2046) PASS: lldb-api :: functionalities/unwind/sigtramp/TestSigtrampUnwind.py (1474 of 2046) PASS: lldb-api :: lang/cpp/rvalue-references/TestRvalueReferences.py (1475 of 2046) PASS: lldb-api :: python_api/breakpoint/TestBreakpointAPI.py (1476 of 2046) PASS: lldb-api :: functionalities/data-formatter/ostypeformatting/TestFormattersOsType.py (1477 of 2046) PASS: lldb-unit :: ScriptInterpreter/Lua/./ScriptInterpreterLuaTests/LuaTest.RunInvalid (1478 of 2046) PASS: lldb-api :: functionalities/data-formatter/stringprinter/TestStringPrinter.py (1479 of 2046) PASS: lldb-api :: commands/frame/recognizer/TestFrameRecognizer.py (1480 of 2046) PASS: lldb-api :: functionalities/multidebugger_commands/TestMultipleDebuggersCommands.py (1481 of 2046) PASS: lldb-api :: python_api/value_var_update/TestValueVarUpdate.py (1482 of 2046) PASS: lldb-unit :: Host/./HostTests/SocketTest.UDPGetConnectURI (1483 of 2046) PASS: lldb-unit :: Utility/./UtilityTests/UserIDResolver.GetGroupName (1484 of 2046) PASS: lldb-api :: lang/cpp/char8_t/TestCxxChar8_t.py (1485 of 2046) UNSUPPORTED: lldb-api :: functionalities/darwin_log/filter/exact_match/activity/TestDarwinLogFilterMatchActivity.py (1486 of 2046) PASS: lldb-unit :: ScriptInterpreter/Python/./ScriptInterpreterPythonTests/PythonDataObjectsTest.TestPythonListToStructuredList (1487 of 2046) UNSUPPORTED: lldb-api :: tools/lldb-server/TestGdbRemoteModuleInfo.py (1488 of 2046) PASS: lldb-api :: commands/expression/import-std-module/weak_ptr-dbg-info-content/TestDbgInfoContentWeakPtrFromStdModule.py (1489 of 2046) PASS: lldb-unit :: Utility/./UtilityTests/StructuredDataTest.ParseJSONFromFile (1490 of 2046) PASS: lldb-api :: macosx/order/TestOrderFile.py (1491 of 2046) PASS: lldb-unit :: Utility/./UtilityTests/Flags.Reset (1492 of 2046) PASS: lldb-api :: functionalities/breakpoint/breakpoint_callback_command_source/TestBreakpointCallbackCommandSource.py (1493 of 2046) PASS: lldb-api :: commands/platform/basic/TestPlatformPython.py (1494 of 2046) PASS: lldb-api :: functionalities/postmortem/elf-core/TestLinuxCore.py (1495 of 2046) UNSUPPORTED: lldb-api :: functionalities/data-formatter/data-formatter-stl/libstdcpp/string/TestDataFormatterStdString.py (1496 of 2046) PASS: lldb-shell :: Settings/TestFrameFormatMangling.test (1497 of 2046) PASS: lldb-api :: functionalities/data-formatter/data-formatter-smart-array/TestDataFormatterSmartArray.py (1498 of 2046) PASS: lldb-api :: lang/objc/hidden-ivars/TestHiddenIvars.py (1499 of 2046) PASS: lldb-unit :: Target/./TargetTests/PathMappingListTest.RemapRoot (1500 of 2046) PASS: lldb-shell :: ObjectFile/PECOFF/section-types.yaml (1501 of 2046) PASS: lldb-unit :: Host/./HostTests/File.GetWaitableHandleFileno (1502 of 2046) PASS: lldb-api :: functionalities/thread/concurrent_events/TestConcurrentTwoWatchpointsOneSignal.py (1503 of 2046) PASS: lldb-unit :: Utility/./UtilityTests/OptionsWithRawTest.EmptyInput (1504 of 2046) PASS: lldb-api :: functionalities/data-formatter/vector-types/TestVectorTypesFormatting.py (1505 of 2046) PASS: lldb-unit :: UnwindAssembly/ARM64/./Arm64InstEmulationTests/TestArm64InstEmulation.TestMediumDarwinFunction (1506 of 2046) PASS: lldb-api :: commands/expression/radar_9531204/TestPrintfAfterUp.py (1507 of 2046) PASS: lldb-shell :: SymbolFile/DWARF/childless-compile-unit.s (1508 of 2046) PASS: lldb-api :: functionalities/gdb_remote_client/TestNoWatchpointSupportInfo.py (1509 of 2046) PASS: lldb-api :: functionalities/breakpoint/breakpoint_command/TestBreakpointCommand.py (1510 of 2046) PASS: lldb-unit :: Utility/./UtilityTests/StreamTeeTest.Constructor1Stream (1511 of 2046) PASS: lldb-unit :: Core/./LLDBCoreTests/RichManglingContextTest.IPDRealloc (1512 of 2046) PASS: lldb-unit :: Process/gdb-remote/./ProcessGdbRemoteTests/GDBRemoteClientBaseTest.SendContinueDelegateStructuredDataReceipt (1513 of 2046) PASS: lldb-shell :: Quit/TestQuitExitCode30.test (1514 of 2046) PASS: lldb-unit :: SymbolFile/NativePDB/./SymbolFileNativePDBTests/PDBFPOProgramToDWARFExpressionTests.MissingTargetRegister (1515 of 2046) PASS: lldb-api :: lang/cpp/unique-types/TestUniqueTypes.py (1516 of 2046) PASS: lldb-api :: functionalities/thread/concurrent_events/TestConcurrentWatchBreakDelay.py (1517 of 2046) PASS: lldb-unit :: Host/./HostTests/SocketAddressTest.Set (1518 of 2046) PASS: lldb-api :: lang/objcxx/class-name-clash/TestNameClash.py (1519 of 2046) PASS: lldb-api :: python_api/process/io/TestProcessIO.py (1520 of 2046) PASS: lldb-unit :: Language/Highlighting/./HighlighterTests/HighlighterTest.Colons (1521 of 2046) PASS: lldb-shell :: Settings/TestEchoCommands.test (1522 of 2046) PASS: lldb-unit :: Process/gdb-remote/./ProcessGdbRemoteTests/GDBRemoteClientBaseTest.SendContinueAndWait (1523 of 2046) PASS: lldb-api :: lang/cpp/function_refs/TestFunctionRefs.py (1524 of 2046) PASS: lldb-api :: functionalities/data-formatter/data-formatter-stl/libcxx/vbool/TestDataFormatterLibcxxVBool.py (1525 of 2046) PASS: lldb-api :: python_api/symbol-context/TestSymbolContext.py (1526 of 2046) PASS: lldb-unit :: Utility/./UtilityTests/Flags.AnySet (1527 of 2046) PASS: lldb-unit :: Language/Highlighting/./HighlighterTests/HighlighterTest.ClangCursorOutOfBounds (1528 of 2046) PASS: lldb-unit :: Process/minidump/./LLDBMinidumpTests/MinidumpParserTest.GetMemoryRegionInfoLinuxMaps (1529 of 2046) PASS: lldb-api :: python_api/get-value-32bit-int/TestGetValue32BitInt.py (1530 of 2046) UNSUPPORTED: lldb-shell :: SymbolFile/PDB/pointers.test (1531 of 2046) PASS: lldb-api :: commands/watchpoints/watchpoint_commands/command/TestWatchpointCommandPython.py (1532 of 2046) PASS: lldb-api :: python_api/thread/TestThreadAPI.py (1533 of 2046) PASS: lldb-shell :: ObjectFile/ELF/section-permissions.yaml (1534 of 2046) PASS: lldb-api :: lang/cpp/nested-class-other-compilation-unit/TestNestedClassWithParentInAnotherCU.py (1535 of 2046) PASS: lldb-unit :: Utility/./UtilityTests/Predicate.WaitForValueNotEqualTo (1536 of 2046) PASS: lldb-unit :: Utility/./UtilityTests/StringListTest.LongestCommonPrefixNoPrefix (1537 of 2046) PASS: lldb-shell :: SymbolFile/DWARF/module-ownership.mm (1538 of 2046) PASS: lldb-unit :: Utility/./UtilityTests/StringExtractorTest.GetU32BigEndian (1539 of 2046) PASS: lldb-shell :: ObjectFile/PECOFF/symbol.yaml (1540 of 2046) PASS: lldb-api :: commands/expression/import-std-module/basic/TestImportStdModule.py (1541 of 2046) PASS: lldb-unit :: Utility/./UtilityTests/ArgsTest.GetQuotedCommandString (1542 of 2046) PASS: lldb-unit :: Utility/./UtilityTests/StatusTest.Formatv (1543 of 2046) PASS: lldb-shell :: SymbolFile/Breakpad/stack-cfi-parsing.test (1544 of 2046) PASS: lldb-unit :: Utility/./UtilityTests/RangeTest.Constructor (1545 of 2046) PASS: lldb-unit :: Utility/./UtilityTests/FileSpecTest.CopyByAppendingPathComponent (1546 of 2046) PASS: lldb-api :: api/command-return-object/TestSBCommandReturnObject.py (1547 of 2046) PASS: lldb-shell :: ObjectFile/PECOFF/sections.yaml (1548 of 2046) PASS: lldb-unit :: Utility/./UtilityTests/LogChannelTest.List (1549 of 2046) PASS: lldb-api :: functionalities/memory-region/TestMemoryRegion.py (1550 of 2046) PASS: lldb-api :: lang/c/offsetof/TestOffsetof.py (1551 of 2046) PASS: lldb-unit :: Utility/./UtilityTests/ScalarTest.APIntConstructor (1552 of 2046) PASS: lldb-unit :: Utility/./UtilityTests/RangeTest.ContainsEndInclusive (1553 of 2046) PASS: lldb-api :: functionalities/data-formatter/data-formatter-stl/libcxx/vector/TestDataFormatterLibcxxVector.py (1554 of 2046) PASS: lldb-api :: functionalities/data-formatter/synthcapping/TestSyntheticCapping.py (1555 of 2046) PASS: lldb-unit :: Signals/./SignalsTests/UnixSignalsTest.GetInfo (1556 of 2046) PASS: lldb-api :: commands/frame/var/TestFrameVar.py (1557 of 2046) PASS: lldb-api :: tools/lldb-vscode/attach/TestVSCode_attach.py (1558 of 2046) PASS: lldb-api :: lang/cpp/stl/TestSTL.py (1559 of 2046) UNSUPPORTED: lldb-api :: linux/add-symbols/TestTargetSymbolsAddCommand.py (1560 of 2046) PASS: lldb-api :: commands/command/script/TestCommandScript.py (1561 of 2046) PASS: lldb-unit :: Language/Highlighting/./HighlighterTests/HighlighterTest.ClangSquareBrackets (1562 of 2046) PASS: lldb-unit :: Utility/./UtilityTests/ScalarTest.Division (1563 of 2046) PASS: lldb-api :: commands/expression/codegen-crash-typedefdecl-not-in_declcontext/TestCodegenCrashTypedefDeclNotInDeclContext.py (1564 of 2046) PASS: lldb-shell :: SymbolFile/DWARF/find-variable-dwo.cpp (1565 of 2046) PASS: lldb-api :: functionalities/param_entry_vals/basic_entry_values/TestBasicEntryValues.py (1566 of 2046) PASS: lldb-unit :: Utility/./UtilityTests/DataExtractorTest.GetCStrAtEnd (1567 of 2046) PASS: lldb-unit :: Utility/./UtilityTests/UriParserTest.TypicalPortPathIPv4 (1568 of 2046) PASS: lldb-api :: functionalities/set-data/TestSetData.py (1569 of 2046) PASS: lldb-unit :: UnwindAssembly/x86/./UnwindAssemblyx86Tests/Testx86AssemblyInspectionEngine.TestPopR12 (1570 of 2046) UNSUPPORTED: lldb-shell :: Breakpoint/case-insensitive.test (1571 of 2046) PASS: lldb-unit :: Symbol/./SymbolTests/TestTypeSystemClang.TestFunctionTemplateConstruction (1572 of 2046) PASS: lldb-unit :: Symbol/./SymbolTests/TestTypeSystemClang.TestRecordHasFields (1573 of 2046) PASS: lldb-api :: commands/expression/import-std-module/list-dbg-info-content/TestDbgInfoContentListFromStdModule.py (1574 of 2046) PASS: lldb-api :: functionalities/breakpoint/serialize/TestBreakpointSerialization.py (1575 of 2046) PASS: lldb-unit :: Utility/./UtilityTests/DataExtractorTest.GetCStrEmpty (1576 of 2046) PASS: lldb-shell :: ScriptInterpreter/Python/scripted_breakpoint.test (1577 of 2046) PASS: lldb-unit :: Utility/./UtilityTests/RangeTest.ClearWithStarAddress (1578 of 2046) PASS: lldb-api :: functionalities/data-formatter/refpointer-recursion/TestDataFormatterRefPtrRecursion.py (1579 of 2046) PASS: lldb-api :: functionalities/data-formatter/data-formatter-skip-summary/TestDataFormatterSkipSummary.py (1580 of 2046) PASS: lldb-shell :: ObjectFile/ELF/PT_LOAD-overlap-PT_TLS.yaml (1581 of 2046) PASS: lldb-api :: functionalities/thread/concurrent_events/TestConcurrentSignalDelayBreak.py (1582 of 2046) PASS: lldb-shell :: Breakpoint/debug_addrx.test (1583 of 2046) PASS: lldb-unit :: Utility/./UtilityTests/StringListTest.JoinMultiCharSeparator (1584 of 2046) PASS: lldb-api :: functionalities/type_lookup/TestTypeLookup.py (1585 of 2046) PASS: lldb-unit :: UnwindAssembly/x86/./UnwindAssemblyx86Tests/Testx86AssemblyInspectionEngine.TestSimple32bitFrameFunction (1586 of 2046) PASS: lldb-unit :: Utility/./UtilityTests/RangeTest.Slide (1587 of 2046) PASS: lldb-unit :: UnwindAssembly/x86/./UnwindAssemblyx86Tests/Testx86AssemblyInspectionEngine.Testi386IgnoredRegisters (1588 of 2046) PASS: lldb-unit :: Utility/./UtilityTests/StringListTest.InsertStringAtIndexEnd (1589 of 2046) PASS: lldb-api :: functionalities/multiword-commands/TestMultiWordCommands.py (1590 of 2046) PASS: lldb-unit :: Utility/./UtilityTests/FileSpecTest.RemoveLastPathComponent (1591 of 2046) PASS: lldb-api :: functionalities/data-formatter/setvaluefromcstring/TestSetValueFromCString.py (1592 of 2046) PASS: lldb-unit :: Utility/./UtilityTests/EventTest.DumpEventDataBytes (1593 of 2046) PASS: lldb-unit :: Utility/./UtilityTests/RangeTest.Equal (1594 of 2046) PASS: lldb-api :: commands/expression/import-std-module/queue/TestQueueFromStdModule.py (1595 of 2046) PASS: lldb-api :: commands/expression/import-std-module/vector-dbg-info-content/TestDbgInfoContentVectorFromStdModule.py (1596 of 2046) PASS: lldb-api :: lang/objc/modules/TestObjCModules.py (1597 of 2046) PASS: lldb-api :: commands/frame/diagnose/local-variable/TestLocalVariable.py (1598 of 2046) UNSUPPORTED: lldb-api :: commands/register/register/intel_xtended_registers/mpx_offset_intersection/TestMPXOffsetIntersection.py (1599 of 2046) PASS: lldb-unit :: Language/Highlighting/./HighlighterTests/HighlighterTest.ClangCursorPosInOtherToken (1600 of 2046) PASS: lldb-api :: functionalities/data-formatter/data-formatter-enum-format/TestDataFormatterEnumFormat.py (1601 of 2046) PASS: lldb-api :: functionalities/data-formatter/hexcaps/TestDataFormatterHexCaps.py (1602 of 2046) PASS: lldb-api :: types/TestRecursiveTypes.py (1603 of 2046) PASS: lldb-unit :: Utility/./UtilityTests/ProcessInstanceInfo.Yaml (1604 of 2046) PASS: lldb-unit :: Utility/./UtilityTests/StringListTest.GetMaxStringLengthIncreasingSize (1605 of 2046) PASS: lldb-unit :: Process/minidump/./LLDBMinidumpTests/MinidumpParserTest.GetThreadContext_x86_64 (1606 of 2046) PASS: lldb-unit :: Utility/./UtilityTests/StreamTest.PutRawBytesToMixedEndian (1607 of 2046) PASS: lldb-unit :: Process/gdb-remote/./ProcessGdbRemoteTests/GDBRemoteCommunicationServerTest.SendErrorResponse_StringError (1608 of 2046) PASS: lldb-unit :: Symbol/./SymbolTests/TestTypeSystemClang.TestGetTypeClassNested (1609 of 2046) PASS: lldb-api :: python_api/disassemble-raw-data/TestDisassembleRawData.py (1610 of 2046) PASS: lldb-unit :: Utility/./UtilityTests/NameMatchesTest.StartsWith (1611 of 2046) PASS: lldb-unit :: Process/minidump/./LLDBMinidumpTests/MinidumpParserTest.GetArchitectureWindows (1612 of 2046) PASS: lldb-unit :: Utility/./UtilityTests/RecordReplayTest.InstrumentedBar (1613 of 2046) PASS: lldb-unit :: Utility/./UtilityTests/StringExtractorTest.GetHexBytesAvail_Partial (1614 of 2046) PASS: lldb-unit :: Utility/./UtilityTests/OptionsWithRawTest.ArgsButNoLeadingDash (1615 of 2046) PASS: lldb-shell :: Settings/TestFrameFormatColor.test (1616 of 2046) PASS: lldb-unit :: ScriptInterpreter/Python/./ScriptInterpreterPythonTests/PythonDataObjectsTest.TestPythonDictionaryManipulation (1617 of 2046) PASS: lldb-unit :: Language/Highlighting/./HighlighterTests/HighlighterTest.ClangIdentifiers (1618 of 2046) PASS: lldb-unit :: Utility/./UtilityTests/RegularExpression.CopyAssignment (1619 of 2046) PASS: lldb-api :: commands/expression/import-std-module/forward_list/TestForwardListFromStdModule.py (1620 of 2046) PASS: lldb-shell :: Settings/TestSettingsSet.test (1621 of 2046) PASS: lldb-api :: commands/expression/po_verbosity/TestPoVerbosity.py (1622 of 2046) PASS: lldb-api :: functionalities/breakpoint/breakpoint_ignore_count/TestBreakpointIgnoreCount.py (1623 of 2046) PASS: lldb-api :: functionalities/signal/raise/TestRaise.py (1624 of 2046) PASS: lldb-unit :: ObjectFile/Breakpad/./ObjectFileBreakpadTests/InfoRecord.parse (1625 of 2046) PASS: lldb-unit :: Utility/./UtilityTests/UriParserTest.MinimalPath (1626 of 2046) PASS: lldb-shell :: Breakpoint/case-sensitive.test (1627 of 2046) PASS: lldb-api :: commands/expression/options/TestExprOptions.py (1628 of 2046) PASS: lldb-api :: functionalities/conditional_break/TestConditionalBreak.py (1629 of 2046) PASS: lldb-unit :: Host/./HostTests/NativeProcessProtocolTest.ReadCStringFromMemory_MaxSize (1630 of 2046) PASS: lldb-unit :: Language/Highlighting/./HighlighterTests/HighlighterTest.FallbackHighlighter (1631 of 2046) PASS: lldb-unit :: Utility/./UtilityTests/StringListTest.JoinEmpty (1632 of 2046) PASS: lldb-api :: commands/platform/process/list/TestProcessList.py (1633 of 2046) PASS: lldb-unit :: Utility/./UtilityTests/RangeTest.EqualInvalid (1634 of 2046) PASS: lldb-unit :: Utility/./UtilityTests/ArgsTest.TestSingleArgWithQuotedSpace (1635 of 2046) PASS: lldb-api :: lang/c/strings/TestCStrings.py (1636 of 2046) PASS: lldb-shell :: SymbolFile/NativePDB/s_constant.cpp (1637 of 2046) PASS: lldb-unit :: debugserver/./debugserverTests/JSON.Parse (1638 of 2046) PASS: lldb-unit :: UnwindAssembly/x86/./UnwindAssemblyx86Tests/Testx86AssemblyInspectionEngine.TestPopEBP (1639 of 2046) PASS: lldb-unit :: UnwindAssembly/x86/./UnwindAssemblyx86Tests/Testx86AssemblyInspectionEngine.TestPushR15 (1640 of 2046) UNSUPPORTED: lldb-shell :: Register/x86-64-zmm-read.test (1641 of 2046) PASS: lldb-api :: functionalities/gdb_remote_client/TestWriteMemory.py (1642 of 2046) PASS: lldb-api :: lang/c/enum_types/TestEnumTypes.py (1643 of 2046) PASS: lldb-unit :: Utility/./UtilityTests/Predicate.WaitForValueEqualTo (1644 of 2046) UNSUPPORTED: lldb-api :: functionalities/darwin_log/basic/TestDarwinLogBasic.py (1645 of 2046) PASS: lldb-unit :: Utility/./UtilityTests/StringListTest.LongestCommonPrefixSingleElement (1646 of 2046) PASS: lldb-shell :: Driver/TestTarget.test (1647 of 2046) PASS: lldb-unit :: Utility/./UtilityTests/NameMatchesTest.RegularExpression (1648 of 2046) PASS: lldb-unit :: Utility/./UtilityTests/ArgsTest.DoubleQuotedItem (1649 of 2046) PASS: lldb-api :: macosx/find-app-in-bundle/TestFindAppInBundle.py (1650 of 2046) PASS: lldb-unit :: Process/gdb-remote/./ProcessGdbRemoteTests/GDBRemoteCommunicationClientTest.WriteRegister (1651 of 2046) PASS: lldb-shell :: Driver/TestCommands.test (1652 of 2046) PASS: lldb-shell :: ObjectFile/ELF/netbsd-exec-8.99.30-amd64.yaml (1653 of 2046) PASS: lldb-api :: functionalities/data-formatter/data-formatter-objc/TestDataFormatterObjCCF.py (1654 of 2046) PASS: lldb-unit :: debugserver/./debugserverTests/RNBSocket.LoopBackConnectIPv6 (1655 of 2046) PASS: lldb-shell :: SymbolFile/DWARF/inline-function-address.ll (1656 of 2046) PASS: lldb-api :: commands/watchpoints/hello_watchpoint/TestMyFirstWatchpoint.py (1657 of 2046) PASS: lldb-unit :: Utility/./UtilityTests/XcodeSDKTest.GetCanonicalNameAndConstruct (1658 of 2046) PASS: lldb-api :: functionalities/thread/concurrent_events/TestConcurrentTwoBreakpointsOneSignal.py (1659 of 2046) PASS: lldb-api :: lang/c/array_types/TestArrayTypes.py (1660 of 2046) PASS: lldb-api :: python_api/class_members/TestSBTypeClassMembers.py (1661 of 2046) PASS: lldb-unit :: ScriptInterpreter/Lua/./ScriptInterpreterLuaTests/ScriptInterpreterTest.Plugin (1662 of 2046) PASS: lldb-api :: commands/expression/ir-interpreter-phi-nodes/TestIRInterpreterPHINodes.py (1663 of 2046) PASS: lldb-unit :: Utility/./UtilityTests/XcodeSDKTest.GetSDKTypeForTriple (1664 of 2046) UNSUPPORTED: lldb-api :: functionalities/darwin_log/filter/exact_match/message/TestDarwinLogFilterMatchMessage.py (1665 of 2046) PASS: lldb-unit :: Process/minidump/./LLDBMinidumpTests/MinidumpParserTest.GetThreadContext_x86_32_wow64 (1666 of 2046) PASS: lldb-api :: commands/watchpoints/watchpoint_count/TestWatchpointCount.py (1667 of 2046) PASS: lldb-api :: tools/lldb-server/TestGdbRemoteKill.py (1668 of 2046) PASS: lldb-unit :: Utility/./UtilityTests/StringListTest.Join (1669 of 2046) PASS: lldb-api :: functionalities/data-formatter/data-formatter-cpp/TestDataFormatterCpp.py (1670 of 2046) PASS: lldb-unit :: Instruction/./EmulatorTests/TestAArch64Emulator.TestOverflow (1671 of 2046) PASS: lldb-api :: functionalities/deleted-executable/TestDeletedExecutable.py (1672 of 2046) PASS: lldb-shell :: Process/UnsupportedLanguage.test (1673 of 2046) PASS: lldb-shell :: Unwind/eh-frame-dwarf-unwind.test (1674 of 2046) PASS: lldb-unit :: UnwindAssembly/x86/./UnwindAssemblyx86Tests/Testx86AssemblyInspectionEngine.TestSubESP (1675 of 2046) PASS: lldb-unit :: Utility/./UtilityTests/LogChannelTest.Enable (1676 of 2046) PASS: lldb-shell :: SymbolFile/DWARF/debug-types-address-ranges.s (1677 of 2046) PASS: lldb-unit :: Utility/./UtilityTests/StringExtractorTest.GetHexBytesAvail_OddPair (1678 of 2046) PASS: lldb-unit :: Host/./HostTests/MainLoopTest.UnmonitoredSignal (1679 of 2046) PASS: lldb-api :: functionalities/breakpoint/require_hw_breakpoints/TestRequireHWBreakpoints.py (1680 of 2046) PASS: lldb-unit :: Utility/./UtilityTests/StringListTest.GetMaxStringLengthMixed (1681 of 2046) PASS: lldb-unit :: Utility/./UtilityTests/GeneratorTest.GetOrCreate (1682 of 2046) PASS: lldb-unit :: UnwindAssembly/x86/./UnwindAssemblyx86Tests/Testx86AssemblyInspectionEngine.TestPushImm (1683 of 2046) PASS: lldb-unit :: Utility/./UtilityTests/ArgsTest.TestArgv (1684 of 2046) PASS: lldb-unit :: Utility/./UtilityTests/SubsystemRAIITest.SubsystemWithErrorSuccess (1685 of 2046) PASS: lldb-shell :: SymbolFile/NativePDB/bitfields.cpp (1686 of 2046) PASS: lldb-api :: functionalities/data-formatter/data-formatter-stl/libcxx/forward_list/TestDataFormatterLibcxxForwardList.py (1687 of 2046) PASS: lldb-unit :: Symbol/./SymbolTests/TestTypeSystemClang.TestIsClangType (1688 of 2046) PASS: lldb-api :: commands/breakpoint/set/func-regex/TestBreakpointRegexError.py (1689 of 2046) PASS: lldb-api :: macosx/thread_suspend/TestInternalThreadSuspension.py (1690 of 2046) PASS: lldb-api :: lang/objc/direct-dispatch-step/TestObjCDirectDispatchStepping.py (1691 of 2046) PASS: lldb-unit :: Host/./HostTests/SocketTest.DecodeHostAndPort (1692 of 2046) PASS: lldb-unit :: UnwindAssembly/x86/./UnwindAssemblyx86Tests/Testx86AssemblyInspectionEngine.TestPushRBPWithREX (1693 of 2046) PASS: lldb-api :: functionalities/data-formatter/data-formatter-objc/TestDataFormatterObjCNSError.py (1694 of 2046) PASS: lldb-unit :: Utility/./UtilityTests/BinaryStreamTest.PutULEB128One (1695 of 2046) PASS: lldb-unit :: UnwindAssembly/x86/./UnwindAssemblyx86Tests/Testx86AssemblyInspectionEngine.TestPushEDX (1696 of 2046) PASS: lldb-unit :: Symbol/./SymbolTests/TestTypeSystemClang.TestDeletingImplicitCopyCstrDueToMoveCStr (1697 of 2046) PASS: lldb-api :: lang/cpp/bitfields/TestCppBitfields.py (1698 of 2046) PASS: lldb-api :: lang/cpp/namespace/TestNamespace.py (1699 of 2046) PASS: lldb-unit :: Symbol/./SymbolTests/Type.GetTypeScopeAndBasename (1700 of 2046) PASS: lldb-unit :: Host/./HostTests/NativeProcessProtocolTest.SetBreakpointFailVerify (1701 of 2046) PASS: lldb-api :: functionalities/thread/concurrent_events/TestConcurrentCrashWithSignal.py (1702 of 2046) PASS: lldb-api :: functionalities/postmortem/minidump-new/TestMiniDumpNew.py (1703 of 2046) PASS: lldb-unit :: Platform/./LLDBPlatformTests/PlatformDarwinTest.FindXcodeContentsDirectoryInPath (1704 of 2046) PASS: lldb-api :: functionalities/data-formatter/data-formatter-objc/cmtime/TestDataFormatterCMTime.py (1705 of 2046) PASS: lldb-shell :: SymbolFile/DWARF/debug_rnglists-dwo.s (1706 of 2046) PASS: lldb-unit :: Utility/./UtilityTests/ArgsTest.StringListConstructor (1707 of 2046) PASS: lldb-api :: functionalities/data-formatter/parray/TestPrintArray.py (1708 of 2046) PASS: lldb-api :: functionalities/data-formatter/data-formatter-stl/libcxx/iterator/TestDataFormatterLibccIterator.py (1709 of 2046) PASS: lldb-unit :: ObjectFile/Breakpad/./ObjectFileBreakpadTests/ModuleRecord.parse (1710 of 2046) PASS: lldb-unit :: Utility/./UtilityTests/ArchSpecTest.OperatorBool (1711 of 2046) PASS: lldb-unit :: Utility/./UtilityTests/StreamTest.ChangingByteOrder (1712 of 2046) PASS: lldb-api :: lang/c/const_variables/TestConstVariables.py (1713 of 2046) PASS: lldb-unit :: Utility/./UtilityTests/BroadcasterTest.EventTypeHasListeners (1714 of 2046) PASS: lldb-api :: lang/cpp/wchar_t/TestCxxWCharT.py (1715 of 2046) PASS: lldb-api :: lang/c/stepping/TestThreadStepping.py (1716 of 2046) PASS: lldb-shell :: Commands/CommandScriptImmediateOutput/CommandScriptImmediateOutputConsole.test (1717 of 2046) PASS: lldb-unit :: Utility/./UtilityTests/RangeTest.SetRangeBase (1718 of 2046) PASS: lldb-unit :: Utility/./UtilityTests/StringListTest.ForRange (1719 of 2046) PASS: lldb-shell :: SymbolFile/DWARF/debug_line-relative_path.s (1720 of 2046) PASS: lldb-unit :: Utility/./UtilityTests/StreamTest.PutCString (1721 of 2046) PASS: lldb-api :: commands/expression/no-deadlock/TestExprDoesntBlock.py (1722 of 2046) PASS: lldb-unit :: Utility/./UtilityTests/SerializationRountripTest.SerializeDeserializePodReferences (1723 of 2046) PASS: lldb-unit :: Language/Highlighting/./HighlighterTests/HighlighterTest.ClangCursorPosEndOfLine (1724 of 2046) PASS: lldb-shell :: ObjectFile/PECOFF/dep-modules.yaml (1725 of 2046) PASS: lldb-api :: functionalities/value_md5_crash/TestValueMD5Crash.py (1726 of 2046) PASS: lldb-api :: lang/c/shared_lib_stripped_symbols/TestSharedLibStrippedSymbols.py (1727 of 2046) PASS: lldb-shell :: Driver/TestConvenienceVariables.test (1728 of 2046) PASS: lldb-api :: commands/expression/context-object-objc/TestContextObjectObjc.py (1729 of 2046) PASS: lldb-unit :: ObjectFile/ELF/./ObjectFileELFTests/ObjectFileELFTest.GetModuleSpecifications_EarlySectionHeaders (1730 of 2046) UNSUPPORTED: lldb-api :: functionalities/thread/break_after_join/TestBreakAfterJoin.py (1731 of 2046) PASS: lldb-api :: iohandler/completion/TestIOHandlerCompletion.py (1732 of 2046) PASS: lldb-unit :: Utility/./UtilityTests/Flags.AnyClear (1733 of 2046) PASS: lldb-unit :: Symbol/./SymbolTests/TestClangASTImporter.MetadataPropagationAfterCopying (1734 of 2046) PASS: lldb-unit :: Core/./LLDBCoreTests/MangledTest.EmptyForInvalidName (1735 of 2046) PASS: lldb-api :: python_api/value/TestValueAPI.py (1736 of 2046) PASS: lldb-unit :: Utility/./UtilityTests/StreamTest.PutHex32ByteOrderBig (1737 of 2046) PASS: lldb-shell :: SymbolFile/DWARF/debug-names-compressed.cpp (1738 of 2046) PASS: lldb-unit :: Interpreter/./InterpreterTests/CompletionTest.DirCompletionUsername (1739 of 2046) PASS: lldb-api :: lang/cpp/unsigned_types/TestUnsignedTypes.py (1740 of 2046) UNSUPPORTED: lldb-shell :: BuildScript/toolchain-clang-cl.test (1741 of 2046) PASS: lldb-unit :: Utility/./UtilityTests/StreamTest.AddressRangeEmptyRange (1742 of 2046) PASS: lldb-api :: python_api/objc_type/TestObjCType.py (1743 of 2046) PASS: lldb-unit :: Expression/./ExpressionTests/DiagnosticManagerTest.GetStringMultipleDiags (1744 of 2046) UNSUPPORTED: lldb-api :: python_api/event/TestEvents.py (1745 of 2046) PASS: lldb-unit :: Core/./LLDBCoreTests/CommunicationTest.SynchronizeWhileClosing (1746 of 2046) PASS: lldb-unit :: Utility/./UtilityTests/ScalarTest.Scalar_512 (1747 of 2046) PASS: lldb-unit :: Utility/./UtilityTests/StringListTest.ShiftStdString (1748 of 2046) PASS: lldb-unit :: UnwindAssembly/ARM64/./Arm64InstEmulationTests/TestArm64InstEmulation.TestRegisterSavedTwice (1749 of 2046) PASS: lldb-unit :: Utility/./UtilityTests/StreamTeeTest.GetStreamAtIndexOutOfBoundsEmpty (1750 of 2046) PASS: lldb-api :: types/TestLongTypes.py (1751 of 2046) PASS: lldb-api :: lang/c/inlines/TestRedefinitionsInInlines.py (1752 of 2046) PASS: lldb-unit :: Utility/./UtilityTests/StreamTest.PutChar (1753 of 2046) PASS: lldb-unit :: Process/minidump/./LLDBMinidumpTests/MinidumpParserTest.MinidumpModuleOrder (1754 of 2046) UNSUPPORTED: lldb-shell :: Register/x86-64-ymm16-read.test (1755 of 2046) PASS: lldb-unit :: Process/minidump/./LLDBMinidumpTests/MinidumpParserTest.GetArchitecture (1756 of 2046) PASS: lldb-unit :: Utility/./UtilityTests/OptionsWithRawTest.LeadingSpaceArgs (1757 of 2046) PASS: lldb-unit :: Core/./LLDBCoreTests/MangledTest.NameIndexes_FindFunctionSymbols (1758 of 2046) PASS: lldb-api :: commands/help/TestHelp.py (1759 of 2046) XFAIL: lldb-shell :: Register/x86-64-write.test (1760 of 2046) PASS: lldb-unit :: Expression/./ExpressionTests/CppModuleConfigurationTest.UnrelatedLibrary (1761 of 2046) PASS: lldb-shell :: SymbolFile/DWARF/apple-index-is-used.cpp (1762 of 2046) PASS: lldb-unit :: Utility/./UtilityTests/StringListTest.GetMaxStringLengthEqualSize (1763 of 2046) PASS: lldb-api :: functionalities/data-formatter/data-formatter-categories/TestDataFormatterCategories.py (1764 of 2046) PASS: lldb-shell :: SymbolFile/Breakpad/unwind-via-stack-cfi.test (1765 of 2046) PASS: lldb-api :: lang/cpp/class-template-parameter-pack/TestClassTemplateParameterPack.py (1766 of 2046) PASS: lldb-api :: functionalities/memory/cache/TestMemoryCache.py (1767 of 2046) PASS: lldb-unit :: Utility/./UtilityTests/BinaryStreamTest.PutULEB128EightBytes (1768 of 2046) PASS: lldb-api :: functionalities/breakpoint/address_breakpoints/TestAddressBreakpoints.py (1769 of 2046) PASS: lldb-unit :: Utility/./UtilityTests/ProcessInstanceInfoMatch.Name (1770 of 2046) PASS: lldb-unit :: Utility/./UtilityTests/BinaryStreamTest.PutULEB128SixBytes (1771 of 2046) UNSUPPORTED: lldb-api :: commands/expression/macros/TestMacros.py (1772 of 2046) PASS: lldb-shell :: SymbolFile/DWARF/split-dwarf-inlining.cpp (1773 of 2046) PASS: lldb-shell :: Settings/TestDisableColor.test (1774 of 2046) PASS: lldb-unit :: Utility/./UtilityTests/SerializationRountripTest.SerializeDeserializeCStringNull (1775 of 2046) PASS: lldb-unit :: Utility/./UtilityTests/StringListTest.CopyListEmpty (1776 of 2046) PASS: lldb-api :: functionalities/stats_api/TestStatisticsAPI.py (1777 of 2046) PASS: lldb-api :: python_api/sbdata/TestSBData.py (1778 of 2046) PASS: lldb-shell :: SymbolFile/NativePDB/break-by-line.cpp (1779 of 2046) UNSUPPORTED: lldb-api :: commands/watchpoints/variable_out_of_scope/TestWatchedVarHitWhenInScope.py (1780 of 2046) PASS: lldb-api :: lang/c/blocks/TestBlocks.py (1781 of 2046) PASS: lldb-api :: commands/command/script_alias/TestCommandScriptAlias.py (1782 of 2046) PASS: lldb-unit :: Expression/./ExpressionTests/DiagnosticManagerTest.GetStringPreserveOrder (1783 of 2046) PASS: lldb-unit :: Utility/./UtilityTests/NameMatchesTest.Ignore (1784 of 2046) PASS: lldb-unit :: Target/./TargetTests/PathMappingListTest.AbsoluteTests (1785 of 2046) PASS: lldb-unit :: Expression/./ExpressionTests/DiagnosticManagerTest.GetStringNoDiags (1786 of 2046) PASS: lldb-unit :: Utility/./UtilityTests/StatusTest.ErrorConversion (1787 of 2046) PASS: lldb-unit :: SymbolFile/NativePDB/./SymbolFileNativePDBTests/PDBFPOProgramToDWARFExpressionTests.InvalidOpUnary (1788 of 2046) PASS: lldb-unit :: Utility/./UtilityTests/AnsiTerminal.Empty (1789 of 2046) UNSUPPORTED: lldb-shell :: SymbolFile/NativePDB/ast-functions-msvc.cpp (1790 of 2046) PASS: lldb-shell :: ObjectFile/ELF/section-addresses.yaml (1791 of 2046) PASS: lldb-api :: python_api/symbol-context/two-files/TestSymbolContextTwoFiles.py (1792 of 2046) PASS: lldb-unit :: Utility/./UtilityTests/LogChannelEnabledTest.LogGetLogThread (1793 of 2046) PASS: lldb-unit :: Utility/./UtilityTests/FileSpecTest.PrependPathComponent (1794 of 2046) PASS: lldb-api :: commands/expression/import-std-module/deque-dbg-info-content/TestDbgInfoContentDequeFromStdModule.py (1795 of 2046) PASS: lldb-unit :: SymbolFile/DWARF/./SymbolFileDWARFTests/XcodeSDKModuleTests.TestModuleGetXcodeSDK (1796 of 2046) PASS: lldb-shell :: Commands/command-backtrace.test (1797 of 2046) PASS: lldb-unit :: SymbolFile/NativePDB/./SymbolFileNativePDBTests/PDBFPOProgramToDWARFExpressionTests.SingleAssignmentRegisterRef (1798 of 2046) PASS: lldb-api :: commands/command/history/TestCommandHistory.py (1799 of 2046) PASS: lldb-shell :: SymbolFile/DWARF/debug-line-basic.s (1800 of 2046) PASS: lldb-unit :: Process/gdb-remote/./ProcessGdbRemoteTests/GDBRemoteClientBaseTest.SendContinueAndInterrupt2PacketBug (1801 of 2046) PASS: lldb-unit :: Utility/./UtilityTests/StringListTest.AppendStringMove (1802 of 2046) UNSUPPORTED: lldb-shell :: Unwind/unwind-plan-dwarf-dump.test (1803 of 2046) PASS: lldb-unit :: Utility/./UtilityTests/RangeTest.DoesAdjoinOrIntersect (1804 of 2046) PASS: lldb-unit :: UnwindAssembly/x86/./UnwindAssemblyx86Tests/Testx86AssemblyInspectionEngine.TestPushRBX (1805 of 2046) PASS: lldb-unit :: Utility/./UtilityTests/AnsiTerminal.WhiteSpace (1806 of 2046) PASS: lldb-shell :: SymbolFile/DWARF/debug_loclists-dwo.s (1807 of 2046) PASS: lldb-api :: functionalities/tsan/thread_numbers/TestTsanThreadNumbers.py (1808 of 2046) PASS: lldb-unit :: Utility/./UtilityTests/XcodeSDKTest.SDKSupportsSwift (1809 of 2046) PASS: lldb-api :: python_api/lldbutil/iter/TestLLDBIterator.py (1810 of 2046) PASS: lldb-api :: python_api/lldbutil/process/TestPrintStackTraces.py (1811 of 2046) PASS: lldb-unit :: Utility/./UtilityTests/TimerTest.CategoryTimes2 (1812 of 2046) PASS: lldb-api :: lang/c/stepping/TestStepAndBreakpoints.py (1813 of 2046) UNSUPPORTED: lldb-api :: lang/cpp/function-template-parameter-pack/TestFunctionTemplateParameterPack.py (1814 of 2046) PASS: lldb-unit :: Expression/./ExpressionTests/CppModuleConfigurationTest.UnknownLibCppFile (1815 of 2046) PASS: lldb-unit :: DataFormatter/./LLDBFormatterTests/StringPrinterTests.SwiftUTF8 (1816 of 2046) PASS: lldb-api :: macosx/function-starts/TestFunctionStarts.py (1817 of 2046) UNSUPPORTED: lldb-shell :: SymbolFile/PDB/enums-layout.test (1818 of 2046) PASS: lldb-unit :: Utility/./UtilityTests/StringExtractorTest.GetHexBytesAvail_Underflow (1819 of 2046) PASS: lldb-api :: functionalities/postmortem/minidump-new/TestMiniDumpUUID.py (1820 of 2046) UNSUPPORTED: lldb-shell :: Register/arm-gp-read.test (1821 of 2046) PASS: lldb-api :: functionalities/data-formatter/data-formatter-proper-plurals/TestFormattersOneIsSingular.py (1822 of 2046) PASS: lldb-unit :: Utility/./UtilityTests/AnsiTerminal.AtEnd (1823 of 2046) PASS: lldb-unit :: Language/Highlighting/./HighlighterTests/HighlighterTest.ClangStringLiterals (1824 of 2046) PASS: lldb-api :: commands/expression/import-std-module/stack/TestStackFromStdModule.py (1825 of 2046) UNSUPPORTED: lldb-api :: benchmarks/stepping/TestSteppingSpeed.py (1826 of 2046) PASS: lldb-api :: functionalities/thread/concurrent_events/TestConcurrentSignalWatchBreak.py (1827 of 2046) PASS: lldb-shell :: Minidump/disassemble-no-module.yaml (1828 of 2046) PASS: lldb-api :: commands/expression/issue_11588/Test11588.py (1829 of 2046) PASS: lldb-api :: lang/cpp/limit-debug-info/TestWithLimitDebugInfo.py (1830 of 2046) PASS: lldb-api :: python_api/sbtype_typeclass/TestSBTypeTypeClass.py (1831 of 2046) PASS: lldb-unit :: Utility/./UtilityTests/ArchSpecTest.TestSetTriple (1832 of 2046) PASS: lldb-unit :: API/./APITests/SBCommandInterpreterTest.SingleWordCommand (1833 of 2046) PASS: lldb-api :: commands/expression/function_template_specialization_temp_args/TestFunctionTemplateSpecializationTempArgs.py (1834 of 2046) PASS: lldb-unit :: UnwindAssembly/ARM64/./Arm64InstEmulationTests/TestArm64InstEmulation.TestSimpleDarwinFunction (1835 of 2046) PASS: lldb-shell :: Driver/TestRepl.test (1836 of 2046) PASS: lldb-shell :: Reproducer/TestSynchronous.test (1837 of 2046) PASS: lldb-api :: lang/c/unicode/TestUnicodeSymbols.py (1838 of 2046) PASS: lldb-unit :: Symbol/./SymbolTests/TestTypeSystemClang.TestGetTypeClassTypeOfExpr (1839 of 2046) PASS: lldb-api :: commands/frame/diagnose/virtual-method-call/TestDiagnoseDereferenceVirtualMethodCall.py (1840 of 2046) PASS: lldb-unit :: Utility/./UtilityTests/AnsiTerminal.Unknown (1841 of 2046) PASS: lldb-unit :: Utility/./UtilityTests/ReproducerTest.SetCapture (1842 of 2046) PASS: lldb-unit :: Process/gdb-remote/./ProcessGdbRemoteTests/GDBRemoteCommunicationServerTest.SendErrorResponse_Status (1843 of 2046) PASS: lldb-unit :: SymbolFile/NativePDB/./SymbolFileNativePDBTests/PDBFPOProgramToDWARFExpressionTests.UnresolvedDependentCyclicRegisterAssignmentReference (1844 of 2046) PASS: lldb-unit :: Utility/./UtilityTests/Flags.Clear (1845 of 2046) PASS: lldb-unit :: Editline/./EditlineTests/EditlineTestFixture.EditlineReceivesMultiLineText (1846 of 2046) PASS: lldb-api :: lang/cpp/overloaded-functions/TestOverloadedFunctions.py (1847 of 2046) UNSUPPORTED: lldb-api :: functionalities/darwin_log/filter/regex/subsystem/TestDarwinLogFilterRegexSubsystem.py (1848 of 2046) PASS: lldb-unit :: UnwindAssembly/x86/./UnwindAssemblyx86Tests/Testx86AssemblyInspectionEngine.TestPushEAX (1849 of 2046) PASS: lldb-unit :: Utility/./UtilityTests/ProcessInstanceInfoList.Yaml (1850 of 2046) PASS: lldb-shell :: SymbolFile/NativePDB/tag-types.cpp (1851 of 2046) PASS: lldb-shell :: Reproducer/Functionalities/TestStepping.test (1852 of 2046) PASS: lldb-api :: lang/c/struct_types/TestStructTypes.py (1853 of 2046) PASS: lldb-unit :: Utility/./UtilityTests/FileSpecTest.GetPath (1854 of 2046) PASS: lldb-unit :: Core/./LLDBCoreTests/RichManglingContextTest.FromCxxMethodName (1855 of 2046) PASS: lldb-unit :: Utility/./UtilityTests/OptionsWithRawTest.WhitespaceSuffix (1856 of 2046) PASS: lldb-unit :: Symbol/./SymbolTests/DWARFCallFrameInfoTest.Basic_dwarf3 (1857 of 2046) UNSUPPORTED: lldb-api :: arm/breakpoint-thumb-codesection/TestBreakpointThumbCodesection.py (1858 of 2046) PASS: lldb-unit :: Utility/./UtilityTests/RangeTest.ContainsRangeStartingFromZero (1859 of 2046) PASS: lldb-unit :: Utility/./UtilityTests/SharedCluster.ClusterManager (1860 of 2046) UNSUPPORTED: lldb-api :: linux/thread/create_during_instruction_step/TestCreateDuringInstructionStep.py (1861 of 2046) UNSUPPORTED: lldb-api :: functionalities/thread/multi_break/TestMultipleBreakpoints.py (1862 of 2046) PASS: lldb-unit :: Symbol/./SymbolTests/TestTypeSystemClang.TestGetBasicTypeFromName (1863 of 2046) PASS: lldb-shell :: ScriptInterpreter/Lua/nested_sessions.test (1864 of 2046) UNSUPPORTED: lldb-api :: functionalities/data-formatter/data-formatter-stl/libstdcpp/unique_ptr/TestDataFormatterStdUniquePtr.py (1865 of 2046) PASS: lldb-api :: lang/cpp/chained-calls/TestCppChainedCalls.py (1866 of 2046) PASS: lldb-shell :: Unwind/thread-step-out-ret-addr-check.test (1867 of 2046) PASS: lldb-api :: functionalities/thread/create_after_attach/TestCreateAfterAttach.py (1868 of 2046) PASS: lldb-unit :: Host/./HostTests/FileSystemTest.Resolve (1869 of 2046) UNSUPPORTED: lldb-shell :: Register/aarch64-fp-read.test (1870 of 2046) PASS: lldb-unit :: Utility/./UtilityTests/VMRange.Clear (1871 of 2046) PASS: lldb-shell :: ObjectFile/ELF/duplicate-section.yaml (1872 of 2046) PASS: lldb-unit :: Utility/./UtilityTests/StringListTest.SplitIntoLines (1873 of 2046) PASS: lldb-unit :: Utility/./UtilityTests/RangeTest.NotEqual (1874 of 2046) PASS: lldb-shell :: Commands/command-thread-select.test (1875 of 2046) PASS: lldb-unit :: debugserver/./debugserverTests/RNBSocket.LoopBackConnectIPv4 (1876 of 2046) PASS: lldb-api :: lang/cpp/namespace_conflicts/TestNamespaceConflicts.py (1877 of 2046) PASS: lldb-shell :: ScriptInterpreter/Lua/bindings.test (1878 of 2046) PASS: lldb-shell :: SymbolFile/DWARF/deterministic-build.cpp (1879 of 2046) PASS: lldb-unit :: ObjectFile/Breakpad/./ObjectFileBreakpadTests/StackCFIRecord.parse (1880 of 2046) PASS: lldb-shell :: ObjectFile/ELF/PT_LOAD.yaml (1881 of 2046) PASS: lldb-shell :: ObjectFile/wasm/stripped-debug-sections.yaml (1882 of 2046) PASS: lldb-unit :: Utility/./UtilityTests/StringExtractorTest.DecodeHexU8_Underflow2 (1883 of 2046) PASS: lldb-api :: functionalities/gdb_remote_client/TestArmRegisterDefinition.py (1884 of 2046) PASS: lldb-unit :: Utility/./UtilityTests/LogChannelTest.Disable (1885 of 2046) PASS: lldb-shell :: SymbolFile/DWARF/debug-types-dwo-cross-reference.cpp (1886 of 2046) PASS: lldb-shell :: SymbolFile/DWARF/inline-function-address-shared.test (1887 of 2046) PASS: lldb-api :: functionalities/data-formatter/synthupdate/TestSyntheticFilterRecompute.py (1888 of 2046) PASS: lldb-api :: functionalities/thread/num_threads/TestNumThreads.py (1889 of 2046) PASS: lldb-unit :: ObjectFile/Breakpad/./ObjectFileBreakpadTests/FuncRecord.parse (1890 of 2046) PASS: lldb-shell :: ExecControl/StopHook/stop-hook.test (1891 of 2046) PASS: lldb-api :: lang/objc/ptr_refs/TestPtrRefsObjC.py (1892 of 2046) PASS: lldb-shell :: Quit/TestQuitExitCodeHexA.test (1893 of 2046) PASS: lldb-unit :: Process/minidump/./LLDBMinidumpTests/RegisterContextMinidump.ConvertMinidumpContext_x86_64 (1894 of 2046) PASS: lldb-api :: functionalities/data-formatter/data-formatter-stl/libcxx/optional/TestDataFormatterLibcxxOptional.py (1895 of 2046) PASS: lldb-api :: lang/c/unions/TestUnionMembers.py (1896 of 2046) PASS: lldb-unit :: UnwindAssembly/x86/./UnwindAssemblyx86Tests/Testx86AssemblyInspectionEngine.TestStackRealign32BitDisp_x86_64 (1897 of 2046) PASS: lldb-unit :: UnwindAssembly/PPC64/./PPC64InstEmulationTests/TestPPC64InstEmulation.TestMediumFunction (1898 of 2046) PASS: lldb-unit :: Target/./TargetTests/ModuleCacheTest.GetAndPutUuidExists (1899 of 2046) PASS: lldb-unit :: SymbolFile/DWARF/./SymbolFileDWARFTests/SymbolFileDWARFTests.TestAbbrevOutOfOrder (1900 of 2046) PASS: lldb-unit :: ObjectFile/Breakpad/./ObjectFileBreakpadTests/PublicRecord.parse (1901 of 2046) PASS: lldb-api :: lang/objc/objc-builtin-types/TestObjCBuiltinTypes.py (1902 of 2046) PASS: lldb-unit :: Utility/./UtilityTests/ArgsTest.ReplaceArgumentAtIndexShort (1903 of 2046) PASS: lldb-unit :: Utility/./UtilityTests/VMRange.Comparison (1904 of 2046) PASS: lldb-api :: macosx/dyld-trie-symbols/TestDyldTrieSymbols.py (1905 of 2046) PASS: lldb-shell :: ObjectFile/ELF/section-overlap.yaml (1906 of 2046) PASS: lldb-unit :: Utility/./UtilityTests/RegularExpression.Empty (1907 of 2046) PASS: lldb-unit :: Utility/./UtilityTests/StringExtractorTest.GetHexU8_Extra_NoEof (1908 of 2046) PASS: lldb-api :: lang/objc/conflicting-definition/TestConflictingDefinition.py (1909 of 2046) PASS: lldb-unit :: Utility/./UtilityTests/BinaryStreamTest.PutULEB128Zero (1910 of 2046) PASS: lldb-unit :: Target/./TargetTests/MCBasedABI.MapRegisterName (1911 of 2046) PASS: lldb-api :: functionalities/fat_archives/TestFatArchives.py (1912 of 2046) PASS: lldb-shell :: Expr/TestMultilineExpr.test (1913 of 2046) UNSUPPORTED: lldb-api :: functionalities/data-formatter/data-formatter-stl/libstdcpp/tuple/TestDataFormatterStdTuple.py (1914 of 2046) PASS: lldb-unit :: Utility/./UtilityTests/FileSpecTest.OperatorBool (1915 of 2046) PASS: lldb-unit :: Utility/./UtilityTests/StringExtractorTest.DecodeHexU8_Exact (1916 of 2046) PASS: lldb-unit :: Utility/./UtilityTests/IndexToObjectTest.ObjectForIndex (1917 of 2046) PASS: lldb-api :: commands/expression/two-files/TestObjCTypeQueryFromOtherCompileUnit.py (1918 of 2046) PASS: lldb-api :: lang/cpp/symbols/TestSymbols.py (1919 of 2046) UNSUPPORTED: lldb-api :: functionalities/thread/thread_specific_break_plus_condition/TestThreadSpecificBpPlusCondition.py (1920 of 2046) PASS: lldb-unit :: Utility/./UtilityTests/VMRange.SetEndAddress (1921 of 2046) PASS: lldb-api :: lang/c/global_variables/TestGlobalVariables.py (1922 of 2046) UNSUPPORTED: lldb-api :: benchmarks/libcxxlist/TestBenchmarkLibcxxList.py (1923 of 2046) PASS: lldb-api :: functionalities/data-formatter/data-formatter-objc/nsstring/TestDataFormatterNSString.py (1924 of 2046) PASS: lldb-shell :: ObjectFile/wasm/basic.yaml (1925 of 2046) PASS: lldb-api :: commands/expression/unwind_expression/TestUnwindExpression.py (1926 of 2046) PASS: lldb-unit :: Utility/./UtilityTests/CompletionRequest.ShiftArguments (1927 of 2046) PASS: lldb-api :: functionalities/breakpoint/comp_dir_symlink/TestCompDirSymLink.py (1928 of 2046) PASS: lldb-unit :: Utility/./UtilityTests/RangeTest.ContainsEndInclusiveInvalid (1929 of 2046) PASS: lldb-unit :: Expression/./ExpressionTests/DiagnosticManagerTest.AppendMessageAttachToLastDiag (1930 of 2046) PASS: lldb-shell :: Unwind/trap_frame_sym_ctx.test (1931 of 2046) PASS: lldb-api :: python_api/frame/TestFrames.py (1932 of 2046) PASS: lldb-unit :: tools/lldb-server/tests/./LLDBServerTests/TestBase.DebugserverEnv (1933 of 2046) PASS: lldb-unit :: UnwindAssembly/x86/./UnwindAssemblyx86Tests/Testx86AssemblyInspectionEngine.TestStackRealign8BitDisp_i386 (1934 of 2046) PASS: lldb-unit :: Expression/./ExpressionTests/CppModuleConfigurationTest.LinuxLocalLibCpp (1935 of 2046) PASS: lldb-shell :: Minidump/Windows/Sigsegv/sigsegv.test (1936 of 2046) UNSUPPORTED: lldb-api :: benchmarks/startup/TestStartupDelays.py (1937 of 2046) UNSUPPORTED: lldb-api :: lang/objc/rdar-12408181/TestRdar12408181.py (1938 of 2046) UNSUPPORTED: lldb-api :: functionalities/unwind/standard/TestStandardUnwind.py (1939 of 2046) PASS: lldb-unit :: ObjectFile/PECOFF/./ObjectFilePECOFFTests/PECallFrameInfoTest.Basic_eh (1940 of 2046) PASS: lldb-shell :: SymbolFile/dissassemble-entry-point.s (1941 of 2046) PASS: lldb-unit :: Host/./HostTests/SocketTest.TCPGetConnectURI (1942 of 2046) PASS: lldb-unit :: Host/./HostTests/Host.GetEnvironment (1943 of 2046) PASS: lldb-unit :: Symbol/./SymbolTests/TestClangASTImporter.CompleteFwdDeclWithOtherOrigin (1944 of 2046) PASS: lldb-unit :: Language/CPlusPlus/./LanguageCPlusPlusTests/CPlusPlusLanguage.FindAlternateFunctionManglings (1945 of 2046) PASS: lldb-unit :: UnwindAssembly/x86/./UnwindAssemblyx86Tests/Testx86AssemblyInspectionEngine.TestSimplei386ugmented (1946 of 2046) PASS: lldb-unit :: Symbol/./SymbolTests/DWARFCallFrameInfoTest.Basic_dwarf4 (1947 of 2046) PASS: lldb-api :: types/TestShortType.py (1948 of 2046) PASS: lldb-api :: lang/cpp/global_variables/TestCPPGlobalVariables.py (1949 of 2046) PASS: lldb-api :: commands/frame/diagnose/dereference-function-return/TestDiagnoseDereferenceFunctionReturn.py (1950 of 2046) PASS: lldb-api :: lang/objc/objc-dyn-sbtype/TestObjCDynamicSBType.py (1951 of 2046) UNSUPPORTED: lldb-api :: tools/lldb-server/thread-name/TestGdbRemoteThreadName.py (1952 of 2046) PASS: lldb-api :: commands/expression/namespace_local_var_same_name_cpp_and_c/TestNamespaceLocalVarSameNameCppAndC.py (1953 of 2046) PASS: lldb-api :: functionalities/breakpoint/cpp_exception/TestCPPExceptionBreakpoint.py (1954 of 2046) PASS: lldb-api :: commands/expression/import-std-module/unique_ptr/TestUniquePtrFromStdModule.py (1955 of 2046) PASS: lldb-api :: commands/command/source/TestCommandSource.py (1956 of 2046) PASS: lldb-unit :: Utility/./UtilityTests/StringExtractorTest.GetHexBytesAvail (1957 of 2046) PASS: lldb-unit :: Utility/./UtilityTests/ConstStringTest.CompareStringRef (1958 of 2046) PASS: lldb-unit :: UnwindAssembly/x86/./UnwindAssemblyx86Tests/Testx86AssemblyInspectionEngine.TestPopRBP (1959 of 2046) PASS: lldb-api :: python_api/watchpoint/TestWatchpointIgnoreCount.py (1960 of 2046) PASS: lldb-api :: lang/objc/objc-ivar-stripped/TestObjCIvarStripped.py (1961 of 2046) PASS: lldb-unit :: Utility/./UtilityTests/StreamTest.PutHex32ByteOrderLittle (1962 of 2046) UNSUPPORTED: lldb-shell :: SymbolFile/NativePDB/stack_unwinding01.cpp (1963 of 2046) PASS: lldb-unit :: Utility/./UtilityTests/StreamTest.AddressEmptyPrefix (1964 of 2046) PASS: lldb-shell :: SymbolFile/DWARF/find-inline-method.s (1965 of 2046) PASS: lldb-shell :: SymbolFile/DWARF/debug_loc.s (1966 of 2046) PASS: lldb-api :: commands/frame/diagnose/complicated-expression/TestComplicatedExpression.py (1967 of 2046) PASS: lldb-api :: lang/cpp/llvm-style/TestLLVMStyle.py (1968 of 2046) PASS: lldb-api :: commands/expression/call-function/TestCallStopAndContinue.py (1969 of 2046) UNSUPPORTED: lldb-api :: lang/cpp/static_members/TestCPPStaticMembers.py (1970 of 2046) PASS: lldb-unit :: Utility/./UtilityTests/FileSpecTest.EqualDotsPosix (1971 of 2046) PASS: lldb-api :: lang/cpp/typedef/TestCppTypedef.py (1972 of 2046) PASS: lldb-shell :: ScriptInterpreter/Lua/lua.test (1973 of 2046) PASS: lldb-shell :: ScriptInterpreter/Lua/independent_state.test (1974 of 2046) PASS: lldb-api :: lang/objc/real-definition/TestRealDefinition.py (1975 of 2046) PASS: lldb-api :: lang/cpp/breakpoint_in_member_func_w_non_primitive_params/TestBreakpointInMemberFuncWNonPrimitiveParams.py (1976 of 2046) PASS: lldb-unit :: Process/minidump/./LLDBMinidumpTests/MinidumpParserTest.GetMiscInfoWindows (1977 of 2046) PASS: lldb-unit :: Language/Highlighting/./HighlighterTests/HighlighterTest.ClangPreserveNewLine (1978 of 2046) PASS: lldb-api :: commands/expression/scoped_enums/TestScopedEnumType.py (1979 of 2046) PASS: lldb-unit :: Utility/./UtilityTests/BinaryStreamTest.PutSLEB128TwoBytes (1980 of 2046) PASS: lldb-unit :: Symbol/./SymbolTests/TestClangASTImporter.CanImportInvalidType (1981 of 2046) PASS: lldb-unit :: Utility/./UtilityTests/UriParserTest.SchemeHostSeparator4 (1982 of 2046) PASS: lldb-api :: python_api/sbvalue_persist/TestSBValuePersist.py (1983 of 2046) PASS: lldb-api :: commands/frame/language/TestGuessLanguage.py (1984 of 2046) PASS: lldb-unit :: SymbolFile/NativePDB/./SymbolFileNativePDBTests/PDBFPOProgramToDWARFExpressionTests.UnresolvedRegisterAssignmentReference (1985 of 2046) PASS: lldb-api :: functionalities/breakpoint/breakpoint_locations/TestBreakpointLocations.py (1986 of 2046) PASS: lldb-unit :: Expression/./ExpressionTests/DiagnosticManagerTest.GetStringBasic (1987 of 2046) PASS: lldb-unit :: ScriptInterpreter/Python/./ScriptInterpreterPythonTests/PythonDataObjectsTest.TestPythonDictionaryValueEquality (1988 of 2046) PASS: lldb-unit :: ScriptInterpreter/Python/./ScriptInterpreterPythonTests/PythonDataObjectsTest.TestBorrowedReferences (1989 of 2046) PASS: lldb-shell :: SymbolFile/DWARF/debug-types-signature-loop.s (1990 of 2046) PASS: lldb-unit :: Language/Highlighting/./HighlighterTests/HighlighterTest.ClangOperators (1991 of 2046) PASS: lldb-shell :: ObjectFile/ELF/avr-basic-info.yaml (1992 of 2046) PASS: lldb-shell :: SymbolFile/NativePDB/ast-types.cpp (1993 of 2046) PASS: lldb-api :: lang/objc/objc-struct-argument/TestObjCStructArgument.py (1994 of 2046) PASS: lldb-shell :: ObjectFile/ELF/PT_LOAD-empty.yaml (1995 of 2046) PASS: lldb-unit :: Utility/./UtilityTests/StringListTest.DefaultConstructor (1996 of 2046) PASS: lldb-unit :: SymbolFile/DWARF/./SymbolFileDWARFTests/SymbolFileDWARFTests.ParseArangesNonzeroSegmentSize (1997 of 2046) PASS: lldb-api :: functionalities/data-formatter/data-formatter-objc/TestDataFormatterObjCNSBundle.py (1998 of 2046) PASS: lldb-shell :: SymbolFile/DWARF/clang-ast-from-dwarf-unamed-and-anon-structs.cpp (1999 of 2046) PASS: lldb-api :: functionalities/postmortem/elf-core/gcore/TestGCore.py (2000 of 2046) PASS: lldb-shell :: Quit/TestQuitExitCode0.test (2001 of 2046) PASS: lldb-shell :: Driver/TestSingleQuote.test (2002 of 2046) PASS: lldb-unit :: Core/./LLDBCoreTests/RichManglingContextTest.SwitchProvider (2003 of 2046) PASS: lldb-unit :: Expression/./ExpressionTests/DiagnosticManagerTest.GetStringMultiline (2004 of 2046) PASS: lldb-api :: commands/expression/static-initializers/TestStaticInitializers.py (2005 of 2046) PASS: lldb-api :: commands/expression/import-std-module/vector-of-vectors/TestVectorOfVectorsFromStdModule.py (2006 of 2046) PASS: lldb-api :: functionalities/thread/thread_specific_break/TestThreadSpecificBreakpoint.py (2007 of 2046) PASS: lldb-api :: lang/cpp/thread_local/TestThreadLocal.py (2008 of 2046) PASS: lldb-unit :: Utility/./UtilityTests/DataExtractorTest.GetCStr (2009 of 2046) PASS: lldb-api :: functionalities/inferior-assert/TestInferiorAssert.py (2010 of 2046) UNSUPPORTED: lldb-api :: functionalities/thread/state/TestThreadStates.py (2011 of 2046) PASS: lldb-api :: macosx/find-dsym/bundle-with-dot-in-filename/TestBundleWithDotInFilename.py (2012 of 2046) PASS: lldb-unit :: ScriptInterpreter/Python/./ScriptInterpreterPythonTests/PythonDataObjectsTest.TestResetting (2013 of 2046) PASS: lldb-shell :: SymbolFile/DWARF/static_scope.s (2014 of 2046) PASS: lldb-unit :: Utility/./UtilityTests/Flags.Test (2015 of 2046) PASS: lldb-api :: functionalities/data-formatter/data-formatter-objc/TestDataFormatterObjCKVO.py (2016 of 2046) PASS: lldb-shell :: Process/TestEnvironment.test (2017 of 2046) PASS: lldb-unit :: Process/minidump/./LLDBMinidumpTests/MinidumpParserTest.FindMemoryRangeWithFullMemoryMinidump (2018 of 2046) PASS: lldb-shell :: Breakpoint/debug_rnglist_basic.test (2019 of 2046) PASS: lldb-unit :: Host/./HostTests/MainLoopTest.DetectsEOF (2020 of 2046) PASS: lldb-api :: functionalities/data-formatter/pyobjsynthprovider/TestPyObjSynthProvider.py (2021 of 2046) PASS: lldb-unit :: SymbolFile/NativePDB/./SymbolFileNativePDBTests/PDBFPOProgramToDWARFExpressionTests.InvalidAssignmentMultiple (2022 of 2046) UNSUPPORTED: lldb-api :: benchmarks/frame_variable/TestFrameVariableResponse.py (2023 of 2046) PASS: lldb-api :: lang/objcxx/objcxx-ivar-vector/TestIvarVector.py (2024 of 2046) PASS: lldb-api :: lang/objc/objc-static-method-stripped/TestObjCStaticMethodStripped.py (2025 of 2046) PASS: lldb-api :: functionalities/non-overlapping-index-variable-i/TestIndexVariable.py (2026 of 2046) PASS: lldb-api :: types/TestCharType.py (2027 of 2046) PASS: lldb-api :: commands/expression/multiline-completion/TestMultilineCompletion.py (2028 of 2046) PASS: lldb-api :: functionalities/postmortem/mach-core/TestMachCore.py (2029 of 2046) PASS: lldb-api :: commands/expression/call-function/TestCallStdStringFunction.py (2030 of 2046) PASS: lldb-api :: python_api/lldbutil/frame/TestFrameUtils.py (2031 of 2046) PASS: lldb-api :: functionalities/type_completion/TestTypeCompletion.py (2032 of 2046) PASS: lldb-shell :: Expr/TestIRMemoryMap.test (2033 of 2046) PASS: lldb-api :: lang/objc/objc-super/TestObjCSuper.py (2034 of 2046) PASS: lldb-api :: lang/objcxx/hide-runtime-values/TestObjCXXHideRuntimeValues.py (2035 of 2046) PASS: lldb-api :: lang/objc/objc-new-syntax/TestObjCNewSyntaxLiteral.py (2036 of 2046) PASS: lldb-api :: lang/objc/unicode-string/TestUnicodeString.py (2037 of 2046) PASS: lldb-api :: functionalities/breakpoint/breakpoint_set_restart/TestBreakpointSetRestart.py (2038 of 2046) PASS: lldb-api :: functionalities/thread/step_until/TestStepUntil.py (2039 of 2046) PASS: lldb-api :: functionalities/data-formatter/data-formatter-stl/libcxx/map/TestDataFormatterLibccMap.py (2040 of 2046) PASS: lldb-api :: lang/objc/foundation/TestConstStrings.py (2041 of 2046) PASS: lldb-api :: lang/objc/foundation/TestObjCMethodsNSError.py (2042 of 2046) PASS: lldb-api :: api/multithreaded/TestMultithreaded.py (2043 of 2046) PASS: lldb-api :: lang/objc/foundation/TestObjCMethodsString.py (2044 of 2046) PASS: lldb-api :: tools/lldb-server/TestLldbGdbServer.py (2045 of 2046) PASS: lldb-api :: lang/objc/exceptions/TestObjCExceptions.py (2046 of 2046) Slowest Tests: -------------------------------------------------------------------------- 169.03s: lldb-api :: lang/objc/foundation/TestFoundationDisassembly.py 90.76s: lldb-api :: lang/objc/hidden-ivars/TestHiddenIvars.py 90.69s: lldb-api :: lang/cpp/enum_types/TestCPP11EnumTypes.py 90.13s: lldb-api :: lang/objc/foundation/TestObjCMethods.py 84.11s: lldb-api :: tools/lldb-server/TestLldbGdbServer.py 67.56s: lldb-api :: lang/objc/exceptions/TestObjCExceptions.py 66.75s: lldb-api :: lang/objc/objc-new-syntax/TestObjCNewSyntaxLiteral.py 65.32s: lldb-api :: api/multithreaded/TestMultithreaded.py 61.09s: lldb-api :: types/TestLongTypesExpr.py 57.47s: lldb-api :: lang/cpp/namespace/TestNamespaceLookup.py 56.24s: lldb-api :: lang/objc/real-definition/TestRealDefinition.py 48.36s: lldb-api :: lang/objc/objc-new-syntax/TestObjCNewSyntaxArray.py 47.84s: lldb-api :: lang/objc/objc-new-syntax/TestObjCNewSyntaxDictionary.py 43.88s: lldb-api :: lang/objc/foundation/TestObjCMethodsNSError.py 42.87s: lldb-api :: lang/objc/forward-decl/TestForwardDecl.py 41.12s: lldb-api :: types/TestLongTypes.py 38.37s: lldb-api :: functionalities/recursion/TestValueObjectRecursion.py 35.83s: lldb-api :: commands/settings/TestSettings.py 35.80s: lldb-api :: functionalities/data-formatter/boolreference/TestFormattersBoolRefPtr.py 35.24s: lldb-api :: types/TestCharTypeExpr.py

Hide Details

Tests Times: -------------------------------------------------------------------------- [ Range ] :: [ Percentage ] :: [ Count ] -------------------------------------------------------------------------- [160s,170s) :: [ ] :: [ 1/2046] [150s,160s) :: [ ] :: [ 0/2046] [140s,150s) :: [ ] :: [ 0/2046] [130s,140s) :: [ ] :: [ 0/2046] [120s,130s) :: [ ] :: [ 0/2046] [110s,120s) :: [ ] :: [ 0/2046] [100s,110s) :: [ ] :: [ 0/2046] [ 90s,100s) :: [ ] :: [ 3/2046] [ 80s, 90s) :: [ ] :: [ 1/2046] [ 70s, 80s) :: [ ] :: [ 0/2046] [ 60s, 70s) :: [ ] :: [ 4/2046] [ 50s, 60s) :: [ ] :: [ 2/2046] [ 40s, 50s) :: [ ] :: [ 5/2046] [ 30s, 40s) :: [ ] :: [ 15/2046] [ 20s, 30s) :: [ ] :: [ 50/2046] [ 10s, 20s) :: [*** ] :: [ 163/2046] [ 0s, 10s) :: [*********************************** ] :: [1802/2046] -------------------------------------------------------------------------- ******************** Failing Tests (1): lldb-api :: functionalities/exec/TestExec.py

Hide Details

Hide Details

Testing Time: 346.90s Unsupported Tests : 132 Expected Passes : 1907 Expected Failures : 6 Unexpected Failures: 1 FAILED: tools/lldb/test/CMakeFiles/check-lldb-lit cd /Users/buildslave/jenkins/workspace/lldb-cmake/lldb-build/tools/lldb/test && /usr/local/Frameworks/Python.framework/Versions/3.7/bin/python3.7 /Users/buildslave/jenkins/workspace/lldb-cmake/lldb-build/./bin/llvm-lit -v --time-tests --shuffle --xunit-xml-output=/Users/buildslave/jenkins/workspace/lldb-cmake/test/results.xml -v /Users/buildslave/jenkins/workspace/lldb-cmake/lldb-build/tools/lldb/test ninja: build stopped: subcommand failed. Command failed: Command '['/usr/bin/env', 'TERM=vt100', '/usr/local/bin/ninja', '-v', 'check-lldb']' returned non-zero exit status 1. Command: ['/usr/bin/env', 'TERM=vt100', '/usr/local/bin/ninja', '-v', 'check-lldb'] [Pipeline] } [Pipeline] // timeout [Pipeline] } [Pipeline] // stage [Pipeline] stage [Pipeline] { (Trigger Downstream Jobs) Stage "Trigger Downstream Jobs" skipped due to earlier failure(s) [Pipeline] } [Pipeline] // stage [Pipeline] stage [Pipeline] { (Declarative: Post Actions) [Pipeline] scanForIssues [Clang (LLVM based)] Sleeping for 5 seconds due to JENKINS-32191... [Clang (LLVM based)] Parsing console log (workspace: '/Users/buildslave/jenkins/workspace/lldb-cmake') [Clang (LLVM based)] Successfully parsed console log [Clang (LLVM based)] -> found 0 issues (skipped 0 duplicates) [Clang (LLVM based)] Skipping post processing [Clang (LLVM based)] No filter has been set, publishing all 0 issues [Pipeline] junit Recording test results [Pipeline] emailext org.codehaus.groovy.control.MultipleCompilationErrorsException: startup failed: Script1.groovy: 6: unexpected token: < @ line 6, column 30. def build_czar = Bruno Lopes<blopes@apple.com>"; ^

Hide Details

1 error

Hide Details

at org.codehaus.groovy.control.ErrorCollector.failIfErrors(ErrorCollector.java:310) at org.codehaus.groovy.control.ErrorCollector.addFatalError(ErrorCollector.java:150) at org.codehaus.groovy.control.ErrorCollector.addError(ErrorCollector.java:120) at org.codehaus.groovy.control.ErrorCollector.addError(ErrorCollector.java:132) at org.codehaus.groovy.control.SourceUnit.addError(SourceUnit.java:350) at org.codehaus.groovy.antlr.AntlrParserPlugin.transformCSTIntoAST(AntlrParserPlugin.java:144) at org.codehaus.groovy.antlr.AntlrParserPlugin.parseCST(AntlrParserPlugin.java:110) at org.codehaus.groovy.control.SourceUnit.parse(SourceUnit.java:234) at org.codehaus.groovy.control.CompilationUnit$1.call(CompilationUnit.java:168) at org.codehaus.groovy.control.CompilationUnit.applyToSourceUnits(CompilationUnit.java:943) at org.codehaus.groovy.control.CompilationUnit.doPhaseOperation(CompilationUnit.java:605) at org.codehaus.groovy.control.CompilationUnit.processPhaseOperations(CompilationUnit.java:581) at org.codehaus.groovy.control.CompilationUnit.compile(CompilationUnit.java:558) at groovy.lang.GroovyClassLoader.doParseClass(GroovyClassLoader.java:298) at groovy.lang.GroovyClassLoader.parseClass(GroovyClassLoader.java:268) at groovy.lang.GroovyShell.parseClass(GroovyShell.java:688) at groovy.lang.GroovyShell.parse(GroovyShell.java:700) at groovy.lang.GroovyShell.parse(GroovyShell.java:736) at groovy.lang.GroovyShell.parse(GroovyShell.java:727) at hudson.plugins.emailext.ExtendedEmailPublisher.executeScript(ExtendedEmailPublisher.java:623) at hudson.plugins.emailext.ExtendedEmailPublisher.executePresendScript(ExtendedEmailPublisher.java:573) at hudson.plugins.emailext.ExtendedEmailPublisher.sendMail(ExtendedEmailPublisher.java:456) at hudson.plugins.emailext.EmailExtStep$EmailExtStepExecution.run(EmailExtStep.java:236) at hudson.plugins.emailext.EmailExtStep$EmailExtStepExecution.run(EmailExtStep.java:174) at org.jenkinsci.plugins.workflow.steps.AbstractSynchronousNonBlockingStepExecution$1$1.call(AbstractSynchronousNonBlockingStepExecution.java:47) at hudson.security.ACL.impersonate(ACL.java:290) at org.jenkinsci.plugins.workflow.steps.AbstractSynchronousNonBlockingStepExecution$1.run(AbstractSynchronousNonBlockingStepExecution.java:44) at java.util.concurrent.Executors$RunnableAdapter.call(Executors.java:511) at java.util.concurrent.FutureTask.run(FutureTask.java:266) at java.util.concurrent.ThreadPoolExecutor.runWorker(ThreadPoolExecutor.java:1149) at java.util.concurrent.ThreadPoolExecutor$Worker.run(ThreadPoolExecutor.java:624) at java.lang.Thread.run(Thread.java:748)

Hide Details

Sending email to: mschifer@apple.com vitalybuka@google.com
[Pipeline] } [Pipeline] // stage [Pipeline] } [Pipeline] // withEnv [Pipeline] } [Pipeline] // node [Pipeline] End of Pipeline ERROR: script returned exit code 1 Finished: FAILURE