Started 2 mo 3 days ago
Took 1 hr 8 min

Failed Build clang-d347056-ga6a841e0d7c-t8233-b8233.tar.gz (Apr 2, 2020 2:46:45 PM)

Issues

Found 348 issues:
Fatal Error: error in backend: Found 1 machine code errors.
- function:    L3psycho_anal
- basic block: %bb.430 if.then1806 (0x7fedc3087988)
- instruction: early-clobber %5379:gpr64, early-clobber %5380:gpr64sp = JumpTableDest32 %519:gpr64, %516:gpr64sp, %jump-table.0
- operand 3:   %516:gpr64sp
Expected a GPR64 register, but got a GPR64sp register
fatal error: error in backend: Found 1 machine code errors.
PLEASE submit a bug report to https://bugs.llvm.org/ and include the crash backtrace, preprocessed source, and associated run script.
Stack dump:
Error: clang frontend command failed with exit code 70 (use -v to see invocation)
25 clang         0x0000000105b85d0b clang::driver::Compilation::ExecuteJobs(clang::driver::JobList const&, llvm::SmallVectorImpl<std::__1::pair<int, clang::driver::Command const*> >&) const + 107
26 clang         0x0000000105b99b0b clang::driver::Driver::ExecuteCompilation(clang::driver::Compilation&, llvm::SmallVectorImpl<std::__1::pair<int, clang::driver::Command const*> >&) + 203
27 clang         0x00000001036b99e5 main + 10901
28 libdyld.dylib 0x00007fff4ffd9015 start + 1
29 libdyld.dylib 0x000000000000001d start + 18446603339174146057
clang-11: error: clang frontend command failed with exit code 70 (use -v to see invocation)
clang version 11.0.0 (https://github.com/llvm/llvm-project.git a6a841e0d7c0506182394585903f3dfec32cde2e)
Target: aarch64-apple-darwin17.6.0
Fatal Error: error in backend: Found 1 machine code errors.
- function:    _Z22defineLoopSuiteRunInfoRKNSt3__16vectorI13LoopVariantIDNS_9allocatorIS1_EEEEPbdd
- basic block: %bb.260 if.then88 (0x7fa042ad5688)
- instruction: early-clobber %2752:gpr64, early-clobber %2753:gpr64sp = JumpTableDest32 %267:gpr64, %263:gpr64sp, %jump-table.0
- operand 3:   %263:gpr64sp
Expected a GPR64 register, but got a GPR64sp register
fatal error: error in backend: Found 1 machine code errors.
PLEASE submit a bug report to https://bugs.llvm.org/ and include the crash backtrace, preprocessed source, and associated run script.
Stack dump:
Error: clang frontend command failed with exit code 70 (use -v to see invocation)
25 clang++       0x0000000110619d0b clang::driver::Compilation::ExecuteJobs(clang::driver::JobList const&, llvm::SmallVectorImpl<std::__1::pair<int, clang::driver::Command const*> >&) const + 107
26 clang++       0x000000011062db0b clang::driver::Driver::ExecuteCompilation(clang::driver::Compilation&, llvm::SmallVectorImpl<std::__1::pair<int, clang::driver::Command const*> >&) + 203
27 clang++       0x000000010e14d9e5 main + 10901
28 libdyld.dylib 0x00007fff4ffd9015 start + 1
29 libdyld.dylib 0x000000000000001f start + 18446603339174146059
clang-11: error: clang frontend command failed with exit code 70 (use -v to see invocation)
clang version 11.0.0 (https://github.com/llvm/llvm-project.git a6a841e0d7c0506182394585903f3dfec32cde2e)
Target: aarch64-apple-darwin17.6.0
Fatal Error: error in backend: Found 1 machine code errors.
- function:    _Z22defineLoopSuiteRunInfoRKNSt3__16vectorI13LoopVariantIDNS_9allocatorIS1_EEEEPbdd
- basic block: %bb.260 if.then88 (0x7fc18f310888)
- instruction: early-clobber %2752:gpr64, early-clobber %2753:gpr64sp = JumpTableDest32 %267:gpr64, %263:gpr64sp, %jump-table.0
- operand 3:   %263:gpr64sp
Expected a GPR64 register, but got a GPR64sp register
fatal error: error in backend: Found 1 machine code errors.
PLEASE submit a bug report to https://bugs.llvm.org/ and include the crash backtrace, preprocessed source, and associated run script.
Stack dump:
Error: clang frontend command failed with exit code 70 (use -v to see invocation)
25 clang++       0x0000000112499d0b clang::driver::Compilation::ExecuteJobs(clang::driver::JobList const&, llvm::SmallVectorImpl<std::__1::pair<int, clang::driver::Command const*> >&) const + 107
26 clang++       0x00000001124adb0b clang::driver::Driver::ExecuteCompilation(clang::driver::Compilation&, llvm::SmallVectorImpl<std::__1::pair<int, clang::driver::Command const*> >&) + 203
27 clang++       0x000000010ffcd9e5 main + 10901
28 libdyld.dylib 0x00007fff4ffd9015 start + 1
29 libdyld.dylib 0x000000000000001f start + 18446603339174146059
clang-11: error: clang frontend command failed with exit code 70 (use -v to see invocation)
clang version 11.0.0 (https://github.com/llvm/llvm-project.git a6a841e0d7c0506182394585903f3dfec32cde2e)
Target: aarch64-apple-darwin17.6.0
Fatal Error: error in backend: Found 1 machine code errors.
- function:    _Z22defineLoopSuiteRunInfoRKNSt3__16vectorI13LoopVariantIDNS_9allocatorIS1_EEEEPbdd
- basic block: %bb.260 if.then88 (0x7fbcb7aad888)
- instruction: early-clobber %2752:gpr64, early-clobber %2753:gpr64sp = JumpTableDest32 %267:gpr64, %263:gpr64sp, %jump-table.0
- operand 3:   %263:gpr64sp
Expected a GPR64 register, but got a GPR64sp register
fatal error: error in backend: Found 1 machine code errors.
PLEASE submit a bug report to https://bugs.llvm.org/ and include the crash backtrace, preprocessed source, and associated run script.
Stack dump:
Error: clang frontend command failed with exit code 70 (use -v to see invocation)
25 clang++       0x00000001063bfd0b clang::driver::Compilation::ExecuteJobs(clang::driver::JobList const&, llvm::SmallVectorImpl<std::__1::pair<int, clang::driver::Command const*> >&) const + 107
26 clang++       0x00000001063d3b0b clang::driver::Driver::ExecuteCompilation(clang::driver::Compilation&, llvm::SmallVectorImpl<std::__1::pair<int, clang::driver::Command const*> >&) + 203
27 clang++       0x0000000103ef39e5 main + 10901
28 libdyld.dylib 0x00007fff4ffd9015 start + 1
29 libdyld.dylib 0x000000000000001f start + 18446603339174146059
clang-11: error: clang frontend command failed with exit code 70 (use -v to see invocation)
clang version 11.0.0 (https://github.com/llvm/llvm-project.git a6a841e0d7c0506182394585903f3dfec32cde2e)
Target: aarch64-apple-darwin17.6.0
Fatal Error: error in backend: Found 1 machine code errors.
- function:    _Z22defineLoopSuiteRunInfoRKNSt3__16vectorI13LoopVariantIDNS_9allocatorIS1_EEEEPbdd
- basic block: %bb.260 if.then88 (0x7fd163b48688)
- instruction: early-clobber %2752:gpr64, early-clobber %2753:gpr64sp = JumpTableDest32 %267:gpr64, %263:gpr64sp, %jump-table.0
- operand 3:   %263:gpr64sp
Expected a GPR64 register, but got a GPR64sp register
fatal error: error in backend: Found 1 machine code errors.
PLEASE submit a bug report to https://bugs.llvm.org/ and include the crash backtrace, preprocessed source, and associated run script.
Stack dump:
Error: clang frontend command failed with exit code 70 (use -v to see invocation)
25 clang++       0x00000001123a3d0b clang::driver::Compilation::ExecuteJobs(clang::driver::JobList const&, llvm::SmallVectorImpl<std::__1::pair<int, clang::driver::Command const*> >&) const + 107
26 clang++       0x00000001123b7b0b clang::driver::Driver::ExecuteCompilation(clang::driver::Compilation&, llvm::SmallVectorImpl<std::__1::pair<int, clang::driver::Command const*> >&) + 203
27 clang++       0x000000010fed79e5 main + 10901
28 libdyld.dylib 0x00007fff4ffd9015 start + 1
29 libdyld.dylib 0x000000000000001f start + 18446603339174146059
clang-11: error: clang frontend command failed with exit code 70 (use -v to see invocation)
clang version 11.0.0 (https://github.com/llvm/llvm-project.git a6a841e0d7c0506182394585903f3dfec32cde2e)
Target: aarch64-apple-darwin17.6.0
Fatal Error: error in backend: Found 1 machine code errors.
- function:    _Z22defineLoopSuiteRunInfoRKNSt3__16vectorI13LoopVariantIDNS_9allocatorIS1_EEEEPbdd
- basic block: %bb.260 if.then88 (0x7fde69cc4088)
- instruction: early-clobber %2752:gpr64, early-clobber %2753:gpr64sp = JumpTableDest32 %267:gpr64, %263:gpr64sp, %jump-table.0
- operand 3:   %263:gpr64sp
Expected a GPR64 register, but got a GPR64sp register
fatal error: error in backend: Found 1 machine code errors.
PLEASE submit a bug report to https://bugs.llvm.org/ and include the crash backtrace, preprocessed source, and associated run script.
Stack dump:
Error: clang frontend command failed with exit code 70 (use -v to see invocation)
25 clang++       0x0000000111839d0b clang::driver::Compilation::ExecuteJobs(clang::driver::JobList const&, llvm::SmallVectorImpl<std::__1::pair<int, clang::driver::Command const*> >&) const + 107
26 clang++       0x000000011184db0b clang::driver::Driver::ExecuteCompilation(clang::driver::Compilation&, llvm::SmallVectorImpl<std::__1::pair<int, clang::driver::Command const*> >&) + 203
27 clang++       0x000000010f36d9e5 main + 10901
28 libdyld.dylib 0x00007fff4ffd9015 start + 1
29 libdyld.dylib 0x000000000000001f start + 18446603339174146059
clang-11: error: clang frontend command failed with exit code 70 (use -v to see invocation)
clang version 11.0.0 (https://github.com/llvm/llvm-project.git a6a841e0d7c0506182394585903f3dfec32cde2e)
Target: aarch64-apple-darwin17.6.0
... (limited to first 12 issues)

Build Log

Changes
  1. [ELF] Change some "Alias for " help messages to use double dashed options (details)
  2. Revert "[gn build] Port 03f43b3aca36" (details)
  3. [gn build] Port 24bb2d1e776 (details)
  4. [gn build] Port c00cb76274f (details)
  5. [mlir] StandardToLLVM conversion: remove dead code (details)
  6. Convert for loops to entry-based iteration (details)
  7. [InstCombine] add tests for cmyk benchmark; NFC (details)
  8. [mlir][LLVM] Finer-grained control for C interface emission (details)
  9. [libc++] Try to fix Chromium's build (details)
  10. [libc++abi] NFC: Add link to review in workaround comment (details)
  11. [AMDGPU] Fix crash in SILoadStoreOptimizer (details)
  12. [VectorCombine] transform bitcasted shuffle to narrower elements (details)
  13. [InstCombine] try to reduce shuffle with bitcasted operand (details)
  14. Exit unwinding early when at the top of the stack and additional info won't be found. (details)
  15. Make it possible for lit.site.cfg to contain relative paths, and use it for llvm and clang (details)
  16. AMDGPU: Hack out noinline on functions using LDS globals (details)
  17. [InlineFunction] Update valid return attributes at callsite within callee body (details)
  18. Make fb80b6b2d58c4 actually work. (details)
  19. [intel-pt] Implement a basic test case (details)
  20. Change pass registration generated code to allow users to selectively register passes (details)
  21. Revert "Make it possible for lit.site.cfg to contain relative paths, and use it for llvm and clang" (details)
  22. Reland D75382 "[lld] Initial commit for new Mach-O backend" (details)
  23. [X86] Enable combineExtSetcc for vectors larger than 256 bits when we've disabled 512 bit vectors. (details)
  24. [libc++][test] Partially revert msvc_stdlib_force_include.h _Pragma change (details)
  25. [llvm][TextAPI] adding inlining reexported libraries support (details)
  26. Reland "Make it possible for lit.site.cfg to contain relative paths, and use it for llvm and clang" (details)
  27. [libc++] Refer to the Filesystem static test env as relative paths (details)

Started by upstream project relay-test-suite-verify-machineinstrs build number 7388
originally caused by:

This run spent:

  • 48 min waiting;
  • 1 hr 8 min build duration;
  • 1 hr 8 min total from scheduled to completion.
Revision: 4abf27c36f15a0828fd4794e4a63fc663589c69c
  • refs/remotes/origin/master
Revision: a6a841e0d7c0506182394585903f3dfec32cde2e
  • detached
Revision: 9c9f6f8aaca07b783b4a2db2b68f7878a61bd97a
  • refs/remotes/origin/master
Revision: 44dad74558616adcdf54a289db4466c7ab7d2563
  • refs/remotes/origin/master

Identified problems

Compile Error

This build failed because of a compile error. Below is a list of all errors in the build log:
Indication 1

Ninja target failed

Below is a link to the first failed ninja target.
Indication 2