Started 2 mo 2 days ago
Took 55 min

Failed Build clang-d347070-ge875ba15099-t8240-b8240.tar.gz (Apr 2, 2020 6:18:48 PM)

Issues

Found 348 issues:
Fatal Error: error in backend: Found 1 machine code errors.
- function:    _Z22defineLoopSuiteRunInfoRKNSt3__16vectorI13LoopVariantIDNS_9allocatorIS1_EEEEPbdd
- basic block: %bb.260 if.then88 (0x7fa46e460688)
- instruction: early-clobber %2752:gpr64, early-clobber %2753:gpr64sp = JumpTableDest32 %267:gpr64, %263:gpr64sp, %jump-table.0
- operand 3:   %263:gpr64sp
Expected a GPR64 register, but got a GPR64sp register
fatal error: error in backend: Found 1 machine code errors.
PLEASE submit a bug report to https://bugs.llvm.org/ and include the crash backtrace, preprocessed source, and associated run script.
Stack dump:
Error: clang frontend command failed with exit code 70 (use -v to see invocation)
25 clang++       0x0000000109b6ec8b clang::driver::Compilation::ExecuteJobs(clang::driver::JobList const&, llvm::SmallVectorImpl<std::__1::pair<int, clang::driver::Command const*> >&) const + 107
26 clang++       0x0000000109b82a8b clang::driver::Driver::ExecuteCompilation(clang::driver::Compilation&, llvm::SmallVectorImpl<std::__1::pair<int, clang::driver::Command const*> >&) + 203
27 clang++       0x00000001076a2c55 main + 10901
28 libdyld.dylib 0x00007fff4ffd9015 start + 1
29 libdyld.dylib 0x000000000000001f start + 18446603339174146059
clang-11: error: clang frontend command failed with exit code 70 (use -v to see invocation)
clang version 11.0.0 (https://github.com/llvm/llvm-project.git e875ba1509955dc4b3512d820edecc0da26fa38d)
Target: aarch64-apple-darwin17.6.0
Fatal Error: error in backend: Found 1 machine code errors.
- function:    _Z22defineLoopSuiteRunInfoRKNSt3__16vectorI13LoopVariantIDNS_9allocatorIS1_EEEEPbdd
- basic block: %bb.260 if.then88 (0x7fe109ad7488)
- instruction: early-clobber %2752:gpr64, early-clobber %2753:gpr64sp = JumpTableDest32 %267:gpr64, %263:gpr64sp, %jump-table.0
- operand 3:   %263:gpr64sp
Expected a GPR64 register, but got a GPR64sp register
fatal error: error in backend: Found 1 machine code errors.
PLEASE submit a bug report to https://bugs.llvm.org/ and include the crash backtrace, preprocessed source, and associated run script.
Stack dump:
Error: clang frontend command failed with exit code 70 (use -v to see invocation)
25 clang++       0x0000000105836c8b clang::driver::Compilation::ExecuteJobs(clang::driver::JobList const&, llvm::SmallVectorImpl<std::__1::pair<int, clang::driver::Command const*> >&) const + 107
26 clang++       0x000000010584aa8b clang::driver::Driver::ExecuteCompilation(clang::driver::Compilation&, llvm::SmallVectorImpl<std::__1::pair<int, clang::driver::Command const*> >&) + 203
27 clang++       0x000000010336ac55 main + 10901
28 libdyld.dylib 0x00007fff4ffd9015 start + 1
29 libdyld.dylib 0x000000000000001f start + 18446603339174146059
clang-11: error: clang frontend command failed with exit code 70 (use -v to see invocation)
clang version 11.0.0 (https://github.com/llvm/llvm-project.git e875ba1509955dc4b3512d820edecc0da26fa38d)
Target: aarch64-apple-darwin17.6.0
Fatal Error: error in backend: Found 1 machine code errors.
- function:    _Z22defineLoopSuiteRunInfoRKNSt3__16vectorI13LoopVariantIDNS_9allocatorIS1_EEEEPbdd
- basic block: %bb.260 if.then88 (0x7f99cbd8e288)
- instruction: early-clobber %2752:gpr64, early-clobber %2753:gpr64sp = JumpTableDest32 %267:gpr64, %263:gpr64sp, %jump-table.0
- operand 3:   %263:gpr64sp
Expected a GPR64 register, but got a GPR64sp register
fatal error: error in backend: Found 1 machine code errors.
PLEASE submit a bug report to https://bugs.llvm.org/ and include the crash backtrace, preprocessed source, and associated run script.
Stack dump:
Error: clang frontend command failed with exit code 70 (use -v to see invocation)
25 clang++       0x0000000112050c8b clang::driver::Compilation::ExecuteJobs(clang::driver::JobList const&, llvm::SmallVectorImpl<std::__1::pair<int, clang::driver::Command const*> >&) const + 107
26 clang++       0x0000000112064a8b clang::driver::Driver::ExecuteCompilation(clang::driver::Compilation&, llvm::SmallVectorImpl<std::__1::pair<int, clang::driver::Command const*> >&) + 203
27 clang++       0x000000010fb84c55 main + 10901
28 libdyld.dylib 0x00007fff4ffd9015 start + 1
29 libdyld.dylib 0x000000000000001f start + 18446603339174146059
clang-11: error: clang frontend command failed with exit code 70 (use -v to see invocation)
clang version 11.0.0 (https://github.com/llvm/llvm-project.git e875ba1509955dc4b3512d820edecc0da26fa38d)
Target: aarch64-apple-darwin17.6.0
Fatal Error: error in backend: Found 1 machine code errors.
- function:    _Z22defineLoopSuiteRunInfoRKNSt3__16vectorI13LoopVariantIDNS_9allocatorIS1_EEEEPbdd
- basic block: %bb.260 if.then88 (0x7fe87ea8d088)
- instruction: early-clobber %2752:gpr64, early-clobber %2753:gpr64sp = JumpTableDest32 %267:gpr64, %263:gpr64sp, %jump-table.0
- operand 3:   %263:gpr64sp
Expected a GPR64 register, but got a GPR64sp register
fatal error: error in backend: Found 1 machine code errors.
PLEASE submit a bug report to https://bugs.llvm.org/ and include the crash backtrace, preprocessed source, and associated run script.
Stack dump:
Error: clang frontend command failed with exit code 70 (use -v to see invocation)
25 clang++       0x000000010afa7c8b clang::driver::Compilation::ExecuteJobs(clang::driver::JobList const&, llvm::SmallVectorImpl<std::__1::pair<int, clang::driver::Command const*> >&) const + 107
26 clang++       0x000000010afbba8b clang::driver::Driver::ExecuteCompilation(clang::driver::Compilation&, llvm::SmallVectorImpl<std::__1::pair<int, clang::driver::Command const*> >&) + 203
27 clang++       0x0000000108adbc55 main + 10901
28 libdyld.dylib 0x00007fff4ffd9015 start + 1
29 libdyld.dylib 0x000000000000001f start + 18446603339174146059
clang-11: error: clang frontend command failed with exit code 70 (use -v to see invocation)
clang version 11.0.0 (https://github.com/llvm/llvm-project.git e875ba1509955dc4b3512d820edecc0da26fa38d)
Target: aarch64-apple-darwin17.6.0
Fatal Error: error in backend: Found 1 machine code errors.
- function:    _Z22defineLoopSuiteRunInfoRKNSt3__16vectorI13LoopVariantIDNS_9allocatorIS1_EEEEPbdd
- basic block: %bb.260 if.then88 (0x7fd62920b688)
- instruction: early-clobber %2752:gpr64, early-clobber %2753:gpr64sp = JumpTableDest32 %267:gpr64, %263:gpr64sp, %jump-table.0
- operand 3:   %263:gpr64sp
Expected a GPR64 register, but got a GPR64sp register
fatal error: error in backend: Found 1 machine code errors.
PLEASE submit a bug report to https://bugs.llvm.org/ and include the crash backtrace, preprocessed source, and associated run script.
Stack dump:
Error: clang frontend command failed with exit code 70 (use -v to see invocation)
25 clang++       0x00000001032adc8b clang::driver::Compilation::ExecuteJobs(clang::driver::JobList const&, llvm::SmallVectorImpl<std::__1::pair<int, clang::driver::Command const*> >&) const + 107
26 clang++       0x00000001032c1a8b clang::driver::Driver::ExecuteCompilation(clang::driver::Compilation&, llvm::SmallVectorImpl<std::__1::pair<int, clang::driver::Command const*> >&) + 203
27 clang++       0x0000000100de1c55 main + 10901
28 libdyld.dylib 0x00007fff4ffd9015 start + 1
29 libdyld.dylib 0x000000000000001f start + 18446603339174146059
clang-11: error: clang frontend command failed with exit code 70 (use -v to see invocation)
clang version 11.0.0 (https://github.com/llvm/llvm-project.git e875ba1509955dc4b3512d820edecc0da26fa38d)
Target: aarch64-apple-darwin17.6.0
Fatal Error: error in backend: Found 1 machine code errors.
- function:    _Z22defineLoopSuiteRunInfoRKNSt3__16vectorI13LoopVariantIDNS_9allocatorIS1_EEEEPbdd
- basic block: %bb.260 if.then88 (0x7f93a1af9a88)
- instruction: early-clobber %2752:gpr64, early-clobber %2753:gpr64sp = JumpTableDest32 %267:gpr64, %263:gpr64sp, %jump-table.0
- operand 3:   %263:gpr64sp
Expected a GPR64 register, but got a GPR64sp register
fatal error: error in backend: Found 1 machine code errors.
PLEASE submit a bug report to https://bugs.llvm.org/ and include the crash backtrace, preprocessed source, and associated run script.
Stack dump:
Error: clang frontend command failed with exit code 70 (use -v to see invocation)
25 clang++       0x0000000110268c8b clang::driver::Compilation::ExecuteJobs(clang::driver::JobList const&, llvm::SmallVectorImpl<std::__1::pair<int, clang::driver::Command const*> >&) const + 107
26 clang++       0x000000011027ca8b clang::driver::Driver::ExecuteCompilation(clang::driver::Compilation&, llvm::SmallVectorImpl<std::__1::pair<int, clang::driver::Command const*> >&) + 203
27 clang++       0x000000010dd9cc55 main + 10901
28 libdyld.dylib 0x00007fff4ffd9015 start + 1
29 libdyld.dylib 0x000000000000001f start + 18446603339174146059
clang-11: error: clang frontend command failed with exit code 70 (use -v to see invocation)
clang version 11.0.0 (https://github.com/llvm/llvm-project.git e875ba1509955dc4b3512d820edecc0da26fa38d)
Target: aarch64-apple-darwin17.6.0
... (limited to first 12 issues)

Build Log

Changes
  1. AMDGPU: Fix broken check lines (details)
  2. Re-apply 0071eaaf089, "[ORC] Export __cxa_atexit ...", with fixes. (details)
  3. Try again to get tests passing again on Windows. (details)

Started by upstream project relay-test-suite-verify-machineinstrs build number 7390
originally caused by:

This run spent:

  • 36 min waiting;
  • 55 min build duration;
  • 55 min total from scheduled to completion.
Revision: 4abf27c36f15a0828fd4794e4a63fc663589c69c
  • refs/remotes/origin/master
Revision: e875ba1509955dc4b3512d820edecc0da26fa38d
  • detached
Revision: 9c9f6f8aaca07b783b4a2db2b68f7878a61bd97a
  • refs/remotes/origin/master
Revision: 44dad74558616adcdf54a289db4466c7ab7d2563
  • refs/remotes/origin/master

Identified problems

Compile Error

This build failed because of a compile error. Below is a list of all errors in the build log:
Indication 1

Ninja target failed

Below is a link to the first failed ninja target.
Indication 2