Started 26 days ago
Took 25 min

Failed Build clang-d344207-g4e3b037665f-t7342-b7342.tar.gz (Mar 3, 2020 2:29:59 AM)

Issues

Found 18 issues:
link error
    MultiSource/Applications/JM/lencod/CMakeFiles/lencod.dir/weighted_prediction.c.o
duplicate symbol _frame_pic_1 in:
    MultiSource/Applications/JM/lencod/CMakeFiles/lencod.dir/annexb.c.o
    MultiSource/Applications/JM/lencod/CMakeFiles/lencod.dir/weighted_prediction.c.o
ld: 5223 duplicate symbols for architecture arm64
clang-11: error: linker command failed with exit code 1 (use -v to see invocation)
[5809/8583] /Users/buildslave/jenkins/workspace/test-suite-verify-machineinstrs-aarch64-globalisel-O0-g/test-suite-build/tools/timeit --summary MultiSource/Applications/sgefa/CMakeFiles/sgefa.dir/driver.c.o.time /Users/buildslave/jenkins/workspace/test-suite-verify-machineinstrs-aarch64-globalisel-O0-g/compiler/bin/clang -DNDEBUG  -B /Applications/Xcode.app/Contents/Developer/Toolchains/XcodeDefault.xctoolchain/usr/bin    -Wno-unused-command-line-argument -mllvm -verify-machineinstrs -O0 -g -arch arm64 -isysroot /Applications/Xcode.app/Contents/Developer/Platforms/iPhoneOS.platform/Developer/SDKs/iPhoneOS11.4.sdk   -w -Werror=date-time -DSCALE=40 -MD -MT MultiSource/Applications/sgefa/CMakeFiles/sgefa.dir/driver.c.o -MF MultiSource/Applications/sgefa/CMakeFiles/sgefa.dir/driver.c.o.d -o MultiSource/Applications/sgefa/CMakeFiles/sgefa.dir/driver.c.o   -c /Users/buildslave/jenkins/workspace/test-suite-verify-machineinstrs-aarch64-globalisel-O0-g/test-suite/MultiSource/Applications/sgefa/driver.c
[5810/8583] /Users/buildslave/jenkins/workspace/test-suite-verify-machineinstrs-aarch64-globalisel-O0-g/test-suite-build/tools/timeit --summary MultiSource/Applications/spiff/CMakeFiles/spiff.dir/command.c.o.time /Users/buildslave/jenkins/workspace/test-suite-verify-machineinstrs-aarch64-globalisel-O0-g/compiler/bin/clang -DNDEBUG  -B /Applications/Xcode.app/Contents/Developer/Toolchains/XcodeDefault.xctoolchain/usr/bin    -Wno-unused-command-line-argument -mllvm -verify-machineinstrs -O0 -g -arch arm64 -isysroot /Applications/Xcode.app/Contents/Developer/Platforms/iPhoneOS.platform/Developer/SDKs/iPhoneOS11.4.sdk   -w -Werror=date-time -MD -MT MultiSource/Applications/spiff/CMakeFiles/spiff.dir/command.c.o -MF MultiSource/Applications/spiff/CMakeFiles/spiff.dir/command.c.o.d -o MultiSource/Applications/spiff/CMakeFiles/spiff.dir/command.c.o   -c /Users/buildslave/jenkins/workspace/test-suite-verify-machineinstrs-aarch64-globalisel-O0-g/test-suite/MultiSource/Applications/spiff/command.c
link error
    MultiSource/Applications/JM/ldecod/CMakeFiles/ldecod.dir/vlc.c.o
duplicate symbol _TopFieldForSkip_UV in:
    MultiSource/Applications/JM/ldecod/CMakeFiles/ldecod.dir/annexb.c.o
    MultiSource/Applications/JM/ldecod/CMakeFiles/ldecod.dir/vlc.c.o
ld: 897 duplicate symbols for architecture arm64
clang-11: error: linker command failed with exit code 1 (use -v to see invocation)
[5822/8583] /Users/buildslave/jenkins/workspace/test-suite-verify-machineinstrs-aarch64-globalisel-O0-g/test-suite-build/tools/timeit --summary MultiSource/Applications/spiff/CMakeFiles/spiff.dir/token.c.o.time /Users/buildslave/jenkins/workspace/test-suite-verify-machineinstrs-aarch64-globalisel-O0-g/compiler/bin/clang -DNDEBUG  -B /Applications/Xcode.app/Contents/Developer/Toolchains/XcodeDefault.xctoolchain/usr/bin    -Wno-unused-command-line-argument -mllvm -verify-machineinstrs -O0 -g -arch arm64 -isysroot /Applications/Xcode.app/Contents/Developer/Platforms/iPhoneOS.platform/Developer/SDKs/iPhoneOS11.4.sdk   -w -Werror=date-time -MD -MT MultiSource/Applications/spiff/CMakeFiles/spiff.dir/token.c.o -MF MultiSource/Applications/spiff/CMakeFiles/spiff.dir/token.c.o.d -o MultiSource/Applications/spiff/CMakeFiles/spiff.dir/token.c.o   -c /Users/buildslave/jenkins/workspace/test-suite-verify-machineinstrs-aarch64-globalisel-O0-g/test-suite/MultiSource/Applications/spiff/token.c
[5823/8583] /Users/buildslave/jenkins/workspace/test-suite-verify-machineinstrs-aarch64-globalisel-O0-g/test-suite-build/tools/timeit --summary MultiSource/Applications/spiff/CMakeFiles/spiff.dir/float.c.o.time /Users/buildslave/jenkins/workspace/test-suite-verify-machineinstrs-aarch64-globalisel-O0-g/compiler/bin/clang -DNDEBUG  -B /Applications/Xcode.app/Contents/Developer/Toolchains/XcodeDefault.xctoolchain/usr/bin    -Wno-unused-command-line-argument -mllvm -verify-machineinstrs -O0 -g -arch arm64 -isysroot /Applications/Xcode.app/Contents/Developer/Platforms/iPhoneOS.platform/Developer/SDKs/iPhoneOS11.4.sdk   -w -Werror=date-time -MD -MT MultiSource/Applications/spiff/CMakeFiles/spiff.dir/float.c.o -MF MultiSource/Applications/spiff/CMakeFiles/spiff.dir/float.c.o.d -o MultiSource/Applications/spiff/CMakeFiles/spiff.dir/float.c.o   -c /Users/buildslave/jenkins/workspace/test-suite-verify-machineinstrs-aarch64-globalisel-O0-g/test-suite/MultiSource/Applications/spiff/float.c
link error
    MultiSource/Benchmarks/ASC_Sequoia/IRSmk/CMakeFiles/IRSmk.dir/utility.c.o
duplicate symbol _i_lb in:
    MultiSource/Benchmarks/ASC_Sequoia/IRSmk/CMakeFiles/IRSmk.dir/main.c.o
    MultiSource/Benchmarks/ASC_Sequoia/IRSmk/CMakeFiles/IRSmk.dir/utility.c.o
ld: 22 duplicate symbols for architecture arm64
clang-11: error: linker command failed with exit code 1 (use -v to see invocation)
[6242/8583] /Users/buildslave/jenkins/workspace/test-suite-verify-machineinstrs-aarch64-globalisel-O0-g/test-suite-build/tools/timeit --summary MultiSource/Benchmarks/BitBench/five11/CMakeFiles/five11.dir/five11.c.o.time /Users/buildslave/jenkins/workspace/test-suite-verify-machineinstrs-aarch64-globalisel-O0-g/compiler/bin/clang -DNDEBUG  -B /Applications/Xcode.app/Contents/Developer/Toolchains/XcodeDefault.xctoolchain/usr/bin    -Wno-unused-command-line-argument -mllvm -verify-machineinstrs -O0 -g -arch arm64 -isysroot /Applications/Xcode.app/Contents/Developer/Platforms/iPhoneOS.platform/Developer/SDKs/iPhoneOS11.4.sdk   -w -Werror=date-time -MD -MT MultiSource/Benchmarks/BitBench/five11/CMakeFiles/five11.dir/five11.c.o -MF MultiSource/Benchmarks/BitBench/five11/CMakeFiles/five11.dir/five11.c.o.d -o MultiSource/Benchmarks/BitBench/five11/CMakeFiles/five11.dir/five11.c.o   -c /Users/buildslave/jenkins/workspace/test-suite-verify-machineinstrs-aarch64-globalisel-O0-g/test-suite/MultiSource/Benchmarks/BitBench/five11/five11.c
[6243/8583] /Users/buildslave/jenkins/workspace/test-suite-verify-machineinstrs-aarch64-globalisel-O0-g/test-suite-build/tools/timeit --summary MultiSource/Benchmarks/Fhourstones/CMakeFiles/fhourstones.dir/time.c.o.time /Users/buildslave/jenkins/workspace/test-suite-verify-machineinstrs-aarch64-globalisel-O0-g/compiler/bin/clang -DNDEBUG  -B /Applications/Xcode.app/Contents/Developer/Toolchains/XcodeDefault.xctoolchain/usr/bin    -Wno-unused-command-line-argument -mllvm -verify-machineinstrs -O0 -g -arch arm64 -isysroot /Applications/Xcode.app/Contents/Developer/Platforms/iPhoneOS.platform/Developer/SDKs/iPhoneOS11.4.sdk   -w -Werror=date-time -DUNIX -DTRANSIZE=1050011 -DPROBES=8 -DREPORTPLY=8 -MD -MT MultiSource/Benchmarks/Fhourstones/CMakeFiles/fhourstones.dir/time.c.o -MF MultiSource/Benchmarks/Fhourstones/CMakeFiles/fhourstones.dir/time.c.o.d -o MultiSource/Benchmarks/Fhourstones/CMakeFiles/fhourstones.dir/time.c.o   -c /Users/buildslave/jenkins/workspace/test-suite-verify-machineinstrs-aarch64-globalisel-O0-g/test-suite/MultiSource/Benchmarks/Fhourstones/time.c
link error
    MultiSource/Benchmarks/Olden/bh/CMakeFiles/bh.dir/walksub.c.o
duplicate symbol _xxxrsize in:
    MultiSource/Benchmarks/Olden/bh/CMakeFiles/bh.dir/newbh.c.o
    MultiSource/Benchmarks/Olden/bh/CMakeFiles/bh.dir/walksub.c.o
ld: 4 duplicate symbols for architecture arm64
clang-11: error: linker command failed with exit code 1 (use -v to see invocation)
[6734/8583] : && /Users/buildslave/jenkins/workspace/test-suite-verify-machineinstrs-aarch64-globalisel-O0-g/test-suite-build/tools/timeit --summary MultiSource/Benchmarks/Olden/tsp/tsp.link.time /Users/buildslave/jenkins/workspace/test-suite-verify-machineinstrs-aarch64-globalisel-O0-g/compiler/bin/clang -B /Applications/Xcode.app/Contents/Developer/Toolchains/XcodeDefault.xctoolchain/usr/bin    -Wno-unused-command-line-argument -mllvm -verify-machineinstrs -O0 -g -arch arm64 -isysroot /Applications/Xcode.app/Contents/Developer/Platforms/iPhoneOS.platform/Developer/SDKs/iPhoneOS11.4.sdk -Wl,-search_paths_first -Wl,-headerpad_max_install_names -B /Applications/Xcode.app/Contents/Developer/Toolchains/XcodeDefault.xctoolchain/usr/bin MultiSource/Benchmarks/Olden/tsp/CMakeFiles/tsp.dir/args.c.o MultiSource/Benchmarks/Olden/tsp/CMakeFiles/tsp.dir/build.c.o MultiSource/Benchmarks/Olden/tsp/CMakeFiles/tsp.dir/main.c.o MultiSource/Benchmarks/Olden/tsp/CMakeFiles/tsp.dir/tsp.c.o  -o MultiSource/Benchmarks/Olden/tsp/tsp  -lm && cd /Users/buildslave/jenkins/workspace/test-suite-verify-machineinstrs-aarch64-globalisel-O0-g/test-suite-build/MultiSource/Benchmarks/Olden/tsp && /usr/local/Cellar/cmake/3.13.1/bin/cmake -E create_symlink /Users/buildslave/jenkins/workspace/test-suite-verify-machineinstrs-aarch64-globalisel-O0-g/test-suite/MultiSource/Benchmarks/Olden/tsp/tsp.reference_output /Users/buildslave/jenkins/workspace/test-suite-verify-machineinstrs-aarch64-globalisel-O0-g/test-suite-build/MultiSource/Benchmarks/Olden/tsp/tsp.reference_output
[6735/8583] /Users/buildslave/jenkins/workspace/test-suite-verify-machineinstrs-aarch64-globalisel-O0-g/test-suite-build/tools/timeit --summary MultiSource/Benchmarks/Olden/voronoi/CMakeFiles/voronoi.dir/output.c.o.time /Users/buildslave/jenkins/workspace/test-suite-verify-machineinstrs-aarch64-globalisel-O0-g/compiler/bin/clang -DNDEBUG  -B /Applications/Xcode.app/Contents/Developer/Toolchains/XcodeDefault.xctoolchain/usr/bin    -Wno-unused-command-line-argument -mllvm -verify-machineinstrs -O0 -g -arch arm64 -isysroot /Applications/Xcode.app/Contents/Developer/Platforms/iPhoneOS.platform/Developer/SDKs/iPhoneOS11.4.sdk   -w -Werror=date-time -DTORONTO -MD -MT MultiSource/Benchmarks/Olden/voronoi/CMakeFiles/voronoi.dir/output.c.o -MF MultiSource/Benchmarks/Olden/voronoi/CMakeFiles/voronoi.dir/output.c.o.d -o MultiSource/Benchmarks/Olden/voronoi/CMakeFiles/voronoi.dir/output.c.o   -c /Users/buildslave/jenkins/workspace/test-suite-verify-machineinstrs-aarch64-globalisel-O0-g/test-suite/MultiSource/Benchmarks/Olden/voronoi/output.c
link error
: && /Users/buildslave/jenkins/workspace/test-suite-verify-machineinstrs-aarch64-globalisel-O0-g/test-suite-build/tools/timeit --summary MultiSource/Benchmarks/Prolangs-C/TimberWolfMC/timberwolfmc.link.time /Users/buildslave/jenkins/workspace/test-suite-verify-machineinstrs-aarch64-globalisel-O0-g/compiler/bin/clang -B /Applications/Xcode.app/Contents/Developer/Toolchains/XcodeDefault.xctoolchain/usr/bin    -Wno-unused-command-line-argument -mllvm -verify-machineinstrs -O0 -g -arch arm64 -isysroot /Applications/Xcode.app/Contents/Developer/Platforms/iPhoneOS.platform/Developer/SDKs/iPhoneOS11.4.sdk -Wl,-search_paths_first -Wl,-headerpad_max_install_names -B /Applications/Xcode.app/Contents/Developer/Toolchains/XcodeDefault.xctoolchain/usr/bin MultiSource/Benchmarks/Prolangs-C/TimberWolfMC/CMakeFiles/timberwolfmc.dir/23tree.c.o MultiSource/Benchmarks/Prolangs-C/TimberWolfMC/CMakeFiles/timberwolfmc.dir/addpins.c.o MultiSource/Benchmarks/Prolangs-C/TimberWolfMC/CMakeFiles/timberwolfmc.dir/analyze.c.o MultiSource/Benchmarks/Prolangs-C/TimberWolfMC/CMakeFiles/timberwolfmc.dir/bellman.c.o MultiSource/Benchmarks/Prolangs-C/TimberWolfMC/CMakeFiles/timberwolfmc.dir/buster.c.o MultiSource/Benchmarks/Prolangs-C/TimberWolfMC/CMakeFiles/timberwolfmc.dir/changraph.c.o MultiSource/Benchmarks/Prolangs-C/TimberWolfMC/CMakeFiles/timberwolfmc.dir/checkpen.c.o MultiSource/Benchmarks/Prolangs-C/TimberWolfMC/CMakeFiles/timberwolfmc.dir/config1.c.o MultiSource/Benchmarks/Prolangs-C/TimberWolfMC/CMakeFiles/timberwolfmc.dir/config2.c.o MultiSource/Benchmarks/Prolangs-C/TimberWolfMC/CMakeFiles/timberwolfmc.dir/config3.c.o MultiSource/Benchmarks/Prolangs-C/TimberWolfMC/CMakeFiles/timberwolfmc.dir/density.c.o MultiSource/Benchmarks/Prolangs-C/TimberWolfMC/CMakeFiles/timberwolfmc.dir/doborder.c.o MultiSource/Benchmarks/Prolangs-C/TimberWolfMC/CMakeFiles/timberwolfmc.dir/doublecheck.c.o MultiSource/Benchmarks/Prolangs-C/TimberWolfMC/CMakeFiles/timberwolfmc.dir/finalout.c.o MultiSource/Benchmarks/Prolangs-C/TimberWolfMC/CMakeFiles/timberwolfmc.dir/finalpin.c.o MultiSource/Benchmarks/Prolangs-C/TimberWolfMC/CMakeFiles/timberwolfmc.dir/findcheck.c.o MultiSource/Benchmarks/Prolangs-C/TimberWolfMC/CMakeFiles/timberwolfmc.dir/findcost.c.o MultiSource/Benchmarks/Prolangs-C/TimberWolfMC/CMakeFiles/timberwolfmc.dir/findloc.c.o MultiSource/Benchmarks/Prolangs-C/TimberWolfMC/CMakeFiles/timberwolfmc.dir/findnodes.c.o MultiSource/Benchmarks/Prolangs-C/TimberWolfMC/CMakeFiles/timberwolfmc.dir/findside.c.o MultiSource/Benchmarks/Prolangs-C/TimberWolfMC/CMakeFiles/timberwolfmc.dir/fixpenal.c.o MultiSource/Benchmarks/Prolangs-C/TimberWolfMC/CMakeFiles/timberwolfmc.dir/fulllink.c.o MultiSource/Benchmarks/Prolangs-C/TimberWolfMC/CMakeFiles/timberwolfmc.dir/fuloop.c.o MultiSource/Benchmarks/Prolangs-C/TimberWolfMC/CMakeFiles/timberwolfmc.dir/genorient.c.o MultiSource/Benchmarks/Prolangs-C/TimberWolfMC/CMakeFiles/timberwolfmc.dir/gentwf.c.o MultiSource/Benchmarks/Prolangs-C/TimberWolfMC/CMakeFiles/timberwolfmc.dir/ggenorien.c.o MultiSource/Benchmarks/Prolangs-C/TimberWolfMC/CMakeFiles/timberwolfmc.dir/gglobals.c.o MultiSource/Benchmarks/Prolangs-C/TimberWolfMC/CMakeFiles/timberwolfmc.dir/globals.c.o MultiSource/Benchmarks/Prolangs-C/TimberWolfMC/CMakeFiles/timberwolfmc.dir/gmain.c.o MultiSource/Benchmarks/Prolangs-C/TimberWolfMC/CMakeFiles/timberwolfmc.dir/goverlap.c.o MultiSource/Benchmarks/Prolangs-C/TimberWolfMC/CMakeFiles/timberwolfmc.dir/goverlapf.c.o MultiSource/Benchmarks/Prolangs-C/TimberWolfMC/CMakeFiles/timberwolfmc.dir/goverlapx.c.o MultiSource/Benchmarks/Prolangs-C/TimberWolfMC/CMakeFiles/timberwolfmc.dir/gpass2.c.o MultiSource/Benchmarks/Prolangs-C/TimberWolfMC/CMakeFiles/timberwolfmc.dir/grdcell.c.o MultiSource/Benchmarks/Prolangs-C/TimberWolfMC/CMakeFiles/timberwolfmc.dir/grepair.c.o MultiSource/Benchmarks/Prolangs-C/TimberWolfMC/CMakeFiles/timberwolfmc.dir/hash.c.o MultiSource/Benchmarks/Prolangs-C/TimberWolfMC/CMakeFiles/timberwolfmc.dir/hprobes.c.o MultiSource/Benchmarks/Prolangs-C/TimberWolfMC/CMakeFiles/timberwolfmc.dir/initbb.c.o MultiSource/Benchmarks/Prolangs-C/TimberWolfMC/CMakeFiles/timberwolfmc.dir/loadbins.c.o MultiSource/Benchmarks/Prolangs-C/TimberWolfMC/CMakeFiles/timberwolfmc.dir/loadpg.c.o MultiSource/Benchmarks/Prolangs-C/TimberWolfMC/CMakeFiles/timberwolfmc.dir/main.c.o MultiSource/Benchmarks/Prolangs-C/TimberWolfMC/CMakeFiles/timberwolfmc.dir/makebins.c.o MultiSource/Benchmarks/Prolangs-C/TimberWolfMC/CMakeFiles/timberwolfmc.dir/makelink.c.o MultiSource/Benchmarks/Prolangs-C/TimberWolfMC/CMakeFiles/timberwolfmc.dir/makesite.c.o MultiSource/Benchmarks/Prolangs-C/TimberWolfMC/CMakeFiles/timberwolfmc.dir/move.c.o MultiSource/Benchmarks/Prolangs-C/TimberWolfMC/CMakeFiles/timberwolfmc.dir/mshortest.c.o MultiSource/Benchmarks/Prolangs-C/TimberWolfMC/CMakeFiles/timberwolfmc.dir/mt.c.o MultiSource/Benchmarks/Prolangs-C/TimberWolfMC/CMakeFiles/timberwolfmc.dir/neworient.c.o MultiSource/Benchmarks/Prolangs-C/TimberWolfMC/CMakeFiles/timberwolfmc.dir/outbig.c.o MultiSource/Benchmarks/Prolangs-C/TimberWolfMC/CMakeFiles/timberwolfmc.dir/outgeo.c.o MultiSource/Benchmarks/Prolangs-C/TimberWolfMC/CMakeFiles/timberwolfmc.dir/outpin.c.o MultiSource/Benchmarks/Prolangs-C/TimberWolfMC/CMakeFiles/timberwolfmc.dir/output.c.o MultiSource/Benchmarks/Prolangs-C/TimberWolfMC/CMakeFiles/timberwolfmc.dir/outsmall.c.o MultiSource/Benchmarks/Prolangs-C/TimberWolfMC/CMakeFiles/timberwolfmc.dir/parser.c.o MultiSource/Benchmarks/Prolangs-C/TimberWolfMC/CMakeFiles/timberwolfmc.dir/pass2.c.o MultiSource/Benchmarks/Prolangs-C/TimberWolfMC/CMakeFiles/timberwolfmc.dir/perimeter.c.o MultiSource/Benchmarks/Prolangs-C/TimberWolfMC/CMakeFiles/timberwolfmc.dir/placepads.c.o MultiSource/Benchmarks/Prolangs-C/TimberWolfMC/CMakeFiles/timberwolfmc.dir/placepin.c.o MultiSource/Benchmarks/Prolangs-C/TimberWolfMC/CMakeFiles/timberwolfmc.dir/prboard.c.o MultiSource/Benchmarks/Prolangs-C/TimberWolfMC/CMakeFiles/timberwolfmc.dir/prepair.c.o MultiSource/Benchmarks/Prolangs-C/TimberWolfMC/CMakeFiles/timberwolfmc.dir/prestrict.c.o MultiSource/Benchmarks/Prolangs-C/TimberWolfMC/CMakeFiles/timberwolfmc.dir/printgph.c.o MultiSource/Benchmarks/Prolangs-C/TimberWolfMC/CMakeFiles/timberwolfmc.dir/printnets.c.o MultiSource/Benchmarks/Prolangs-C/TimberWolfMC/CMakeFiles/timberwolfmc.dir/procesnet.c.o MultiSource/Benchmarks/Prolangs-C/TimberWolfMC/CMakeFiles/timberwolfmc.dir/readcells.c.o MultiSource/Benchmarks/Prolangs-C/TimberWolfMC/CMakeFiles/timberwolfmc.dir/readgeo.c.o MultiSource/Benchmarks/Prolangs-C/TimberWolfMC/CMakeFiles/timberwolfmc.dir/readgraph.c.o MultiSource/Benchmarks/Prolangs-C/TimberWolfMC/CMakeFiles/timberwolfmc.dir/readnets.c.o MultiSource/Benchmarks/Prolangs-C/TimberWolfMC/CMakeFiles/timberwolfmc.dir/readpar.c.o MultiSource/Benchmarks/Prolangs-C/TimberWolfMC/CMakeFiles/timberwolfmc.dir/readpnode.c.o MultiSource/Benchmarks/Prolangs-C/TimberWolfMC/CMakeFiles/timberwolfmc.dir/rebin.c.o MultiSource/Benchmarks/Prolangs-C/TimberWolfMC/CMakeFiles/timberwolfmc.dir/reduceg.c.o MultiSource/Benchmarks/Prolangs-C/TimberWolfMC/CMakeFiles/timberwolfmc.dir/rglobals.c.o MultiSource/Benchmarks/Prolangs-C/TimberWolfMC/CMakeFiles/timberwolfmc.dir/rmain.c.o MultiSource/Benchmarks/Prolangs-C/TimberWolfMC/CMakeFiles/timberwolfmc.dir/routenet.c.o MultiSource/Benchmarks/Prolangs-C/TimberWolfMC/CMakeFiles/timberwolfmc.dir/savewolf.c.o MultiSource/Benchmarks/Prolangs-C/TimberWolfMC/CMakeFiles/timberwolfmc.dir/scrapnet.c.o MultiSource/Benchmarks/Prolangs-C/TimberWolfMC/CMakeFiles/timberwolfmc.dir/scrappin.c.o MultiSource/Benchmarks/Prolangs-C/TimberWolfMC/CMakeFiles/timberwolfmc.dir/selectpin.c.o MultiSource/Benchmarks/Prolangs-C/TimberWolfMC/CMakeFiles/timberwolfmc.dir/setpwates.c.o MultiSource/Benchmarks/Prolangs-C/TimberWolfMC/CMakeFiles/timberwolfmc.dir/shortpath.c.o MultiSource/Benchmarks/Prolangs-C/TimberWolfMC/CMakeFiles/timberwolfmc.dir/test2loop.c.o MultiSource/Benchmarks/Prolangs-C/TimberWolfMC/CMakeFiles/timberwolfmc.dir/testloop.c.o MultiSource/Benchmarks/Prolangs-C/TimberWolfMC/CMakeFiles/timberwolfmc.dir/twstats.c.o MultiSource/Benchmarks/Prolangs-C/TimberWolfMC/CMakeFiles/timberwolfmc.dir/uaspect.c.o MultiSource/Benchmarks/Prolangs-C/TimberWolfMC/CMakeFiles/timberwolfmc.dir/ufixnet.c.o MultiSource/Benchmarks/Prolangs-C/TimberWolfMC/CMakeFiles/timberwolfmc.dir/ufixpin.c.o MultiSource/Benchmarks/Prolangs-C/TimberWolfMC/CMakeFiles/timberwolfmc.dir/uloop.c.o MultiSource/Benchmarks/Prolangs-C/TimberWolfMC/CMakeFiles/timberwolfmc.dir/unbust.c.o MultiSource/Benchmarks/Prolangs-C/TimberWolfMC/CMakeFiles/timberwolfmc.dir/upin.c.o MultiSource/Benchmarks/Prolangs-C/TimberWolfMC/CMakeFiles/timberwolfmc.dir/upinswap.c.o MultiSource/Benchmarks/Prolangs-C/TimberWolfMC/CMakeFiles/timberwolfmc.dir/usite0.c.o MultiSource/Benchmarks/Prolangs-C/TimberWolfMC/CMakeFiles/timberwolfmc.dir/usite1.c.o MultiSource/Benchmarks/Prolangs-C/TimberWolfMC/CMakeFiles/timberwolfmc.dir/usite2.c.o MultiSource/Benchmarks/Prolangs-C/TimberWolfMC/CMakeFiles/timberwolfmc.dir/usiteo1.c.o MultiSource/Benchmarks/Prolangs-C/TimberWolfMC/CMakeFiles/timberwolfmc.dir/usiteo2.c.o MultiSource/Benchmarks/Prolangs-C/TimberWolfMC/CMakeFiles/timberwolfmc.dir/usoftnet.c.o MultiSource/Benchmarks/Prolangs-C/TimberWolfMC/CMakeFiles/timberwolfmc.dir/usoftpin.c.o MultiSource/Benchmarks/Prolangs-C/TimberWolfMC/CMakeFiles/timberwolfmc.dir/utemp.c.o MultiSource/Benchmarks/Prolangs-C/TimberWolfMC/CMakeFiles/timberwolfmc.dir/vprobes.c.o MultiSource/Benchmarks/Prolangs-C/TimberWolfMC/CMakeFiles/timberwolfmc.dir/watesides.c.o MultiSource/Benchmarks/Prolangs-C/TimberWolfMC/CMakeFiles/timberwolfmc.dir/wirecosts.c.o MultiSource/Benchmarks/Prolangs-C/TimberWolfMC/CMakeFiles/timberwolfmc.dir/wireest.c.o MultiSource/Benchmarks/Prolangs-C/TimberWolfMC/CMakeFiles/timberwolfmc.dir/wireratio.c.o MultiSource/Benchmarks/Prolangs-C/TimberWolfMC/CMakeFiles/timberwolfmc.dir/woverlap.c.o MultiSource/Benchmarks/Prolangs-C/TimberWolfMC/CMakeFiles/timberwolfmc.dir/woverlapf.c.o MultiSource/Benchmarks/Prolangs-C/TimberWolfMC/CMakeFiles/timberwolfmc.dir/woverlapx.c.o MultiSource/Benchmarks/Prolangs-C/TimberWolfMC/CMakeFiles/timberwolfmc.dir/xgraph.c.o MultiSource/Benchmarks/Prolangs-C/TimberWolfMC/CMakeFiles/timberwolfmc.dir/ygraph.c.o  -o MultiSource/Benchmarks/Prolangs-C/TimberWolfMC/timberwolfmc  -lm && cd /Users/buildslave/jenkins/workspace/test-suite-verify-machineinstrs-aarch64-globalisel-O0-g/test-suite-build/MultiSource/Benchmarks/Prolangs-C/TimberWolfMC && /usr/local/Cellar/cmake/3.13.1/bin/cmake -E create_symlink /Users/buildslave/jenkins/workspace/test-suite-verify-machineinstrs-aarch64-globalisel-O0-g/test-suite/MultiSource/Benchmarks/Prolangs-C/TimberWolfMC/timberwolfmc.reference_output /Users/buildslave/jenkins/workspace/test-suite-verify-machineinstrs-aarch64-globalisel-O0-g/test-suite-build/MultiSource/Benchmarks/Prolangs-C/TimberWolfMC/timberwolfmc.reference_output
duplicate symbol _cktName in:
    MultiSource/Benchmarks/Prolangs-C/TimberWolfMC/CMakeFiles/timberwolfmc.dir/gglobals.c.o
    MultiSource/Benchmarks/Prolangs-C/TimberWolfMC/CMakeFiles/timberwolfmc.dir/globals.c.o
ld: 1 duplicate symbol for architecture arm64
clang-11: error: linker command failed with exit code 1 (use -v to see invocation)
[6917/8583] /Users/buildslave/jenkins/workspace/test-suite-verify-machineinstrs-aarch64-globalisel-O0-g/test-suite-build/tools/timeit --summary MultiSource/Benchmarks/Prolangs-C/assembler/CMakeFiles/assembler.dir/pass1.c.o.time /Users/buildslave/jenkins/workspace/test-suite-verify-machineinstrs-aarch64-globalisel-O0-g/compiler/bin/clang -DNDEBUG  -B /Applications/Xcode.app/Contents/Developer/Toolchains/XcodeDefault.xctoolchain/usr/bin    -Wno-unused-command-line-argument -mllvm -verify-machineinstrs -O0 -g -arch arm64 -isysroot /Applications/Xcode.app/Contents/Developer/Platforms/iPhoneOS.platform/Developer/SDKs/iPhoneOS11.4.sdk   -w -Werror=date-time -MD -MT MultiSource/Benchmarks/Prolangs-C/assembler/CMakeFiles/assembler.dir/pass1.c.o -MF MultiSource/Benchmarks/Prolangs-C/assembler/CMakeFiles/assembler.dir/pass1.c.o.d -o MultiSource/Benchmarks/Prolangs-C/assembler/CMakeFiles/assembler.dir/pass1.c.o   -c /Users/buildslave/jenkins/workspace/test-suite-verify-machineinstrs-aarch64-globalisel-O0-g/test-suite/MultiSource/Benchmarks/Prolangs-C/assembler/pass1.c
[6918/8583] /Users/buildslave/jenkins/workspace/test-suite-verify-machineinstrs-aarch64-globalisel-O0-g/test-suite-build/tools/timeit --summary MultiSource/Benchmarks/Prolangs-C/assembler/CMakeFiles/assembler.dir/stringI.c.o.time /Users/buildslave/jenkins/workspace/test-suite-verify-machineinstrs-aarch64-globalisel-O0-g/compiler/bin/clang -DNDEBUG  -B /Applications/Xcode.app/Contents/Developer/Toolchains/XcodeDefault.xctoolchain/usr/bin    -Wno-unused-command-line-argument -mllvm -verify-machineinstrs -O0 -g -arch arm64 -isysroot /Applications/Xcode.app/Contents/Developer/Platforms/iPhoneOS.platform/Developer/SDKs/iPhoneOS11.4.sdk   -w -Werror=date-time -MD -MT MultiSource/Benchmarks/Prolangs-C/assembler/CMakeFiles/assembler.dir/stringI.c.o -MF MultiSource/Benchmarks/Prolangs-C/assembler/CMakeFiles/assembler.dir/stringI.c.o.d -o MultiSource/Benchmarks/Prolangs-C/assembler/CMakeFiles/assembler.dir/stringI.c.o   -c /Users/buildslave/jenkins/workspace/test-suite-verify-machineinstrs-aarch64-globalisel-O0-g/test-suite/MultiSource/Benchmarks/Prolangs-C/assembler/stringI.c
link error
    MultiSource/Benchmarks/Prolangs-C/compiler/CMakeFiles/compiler.dir/symbol.c.o
duplicate symbol _NumberC in:
    MultiSource/Benchmarks/Prolangs-C/compiler/CMakeFiles/compiler.dir/emitter.c.o
    MultiSource/Benchmarks/Prolangs-C/compiler/CMakeFiles/compiler.dir/symbol.c.o
ld: 156 duplicate symbols for architecture arm64
clang-11: error: linker command failed with exit code 1 (use -v to see invocation)
[6949/8583] : && /Users/buildslave/jenkins/workspace/test-suite-verify-machineinstrs-aarch64-globalisel-O0-g/test-suite-build/tools/timeit --summary MultiSource/Benchmarks/Prolangs-C/loader/loader.link.time /Users/buildslave/jenkins/workspace/test-suite-verify-machineinstrs-aarch64-globalisel-O0-g/compiler/bin/clang -B /Applications/Xcode.app/Contents/Developer/Toolchains/XcodeDefault.xctoolchain/usr/bin    -Wno-unused-command-line-argument -mllvm -verify-machineinstrs -O0 -g -arch arm64 -isysroot /Applications/Xcode.app/Contents/Developer/Platforms/iPhoneOS.platform/Developer/SDKs/iPhoneOS11.4.sdk -Wl,-search_paths_first -Wl,-headerpad_max_install_names -B /Applications/Xcode.app/Contents/Developer/Toolchains/XcodeDefault.xctoolchain/usr/bin MultiSource/Benchmarks/Prolangs-C/loader/CMakeFiles/loader.dir/convert.c.o MultiSource/Benchmarks/Prolangs-C/loader/CMakeFiles/loader.dir/load.c.o MultiSource/Benchmarks/Prolangs-C/loader/CMakeFiles/loader.dir/memory.c.o MultiSource/Benchmarks/Prolangs-C/loader/CMakeFiles/loader.dir/pass1.c.o MultiSource/Benchmarks/Prolangs-C/loader/CMakeFiles/loader.dir/pass2.c.o MultiSource/Benchmarks/Prolangs-C/loader/CMakeFiles/loader.dir/print.c.o MultiSource/Benchmarks/Prolangs-C/loader/CMakeFiles/loader.dir/stringI.c.o MultiSource/Benchmarks/Prolangs-C/loader/CMakeFiles/loader.dir/sym_tab.c.o  -o MultiSource/Benchmarks/Prolangs-C/loader/loader  -lm && cd /Users/buildslave/jenkins/workspace/test-suite-verify-machineinstrs-aarch64-globalisel-O0-g/test-suite-build/MultiSource/Benchmarks/Prolangs-C/loader && /usr/local/Cellar/cmake/3.13.1/bin/cmake -E create_symlink /Users/buildslave/jenkins/workspace/test-suite-verify-machineinstrs-aarch64-globalisel-O0-g/test-suite/MultiSource/Benchmarks/Prolangs-C/loader/loader.reference_output /Users/buildslave/jenkins/workspace/test-suite-verify-machineinstrs-aarch64-globalisel-O0-g/test-suite-build/MultiSource/Benchmarks/Prolangs-C/loader/loader.reference_output
FAILED: MultiSource/Benchmarks/Prolangs-C/loader/loader 
link error
    MultiSource/Benchmarks/Prolangs-C/loader/CMakeFiles/loader.dir/print.c.o
duplicate symbol _MAIN_ROUTINE in:
    MultiSource/Benchmarks/Prolangs-C/loader/CMakeFiles/loader.dir/load.c.o
    MultiSource/Benchmarks/Prolangs-C/loader/CMakeFiles/loader.dir/print.c.o
ld: 8 duplicate symbols for architecture arm64
clang-11: error: linker command failed with exit code 1 (use -v to see invocation)
[6950/8583] /Users/buildslave/jenkins/workspace/test-suite-verify-machineinstrs-aarch64-globalisel-O0-g/test-suite-build/tools/timeit --summary MultiSource/Benchmarks/Prolangs-C/simulator/CMakeFiles/simulator.dir/interupt.c.o.time /Users/buildslave/jenkins/workspace/test-suite-verify-machineinstrs-aarch64-globalisel-O0-g/compiler/bin/clang -DNDEBUG  -B /Applications/Xcode.app/Contents/Developer/Toolchains/XcodeDefault.xctoolchain/usr/bin    -Wno-unused-command-line-argument -mllvm -verify-machineinstrs -O0 -g -arch arm64 -isysroot /Applications/Xcode.app/Contents/Developer/Platforms/iPhoneOS.platform/Developer/SDKs/iPhoneOS11.4.sdk   -w -Werror=date-time -MD -MT MultiSource/Benchmarks/Prolangs-C/simulator/CMakeFiles/simulator.dir/interupt.c.o -MF MultiSource/Benchmarks/Prolangs-C/simulator/CMakeFiles/simulator.dir/interupt.c.o.d -o MultiSource/Benchmarks/Prolangs-C/simulator/CMakeFiles/simulator.dir/interupt.c.o   -c /Users/buildslave/jenkins/workspace/test-suite-verify-machineinstrs-aarch64-globalisel-O0-g/test-suite/MultiSource/Benchmarks/Prolangs-C/simulator/interupt.c
[6951/8583] /Users/buildslave/jenkins/workspace/test-suite-verify-machineinstrs-aarch64-globalisel-O0-g/test-suite-build/tools/timeit --summary MultiSource/Benchmarks/Prolangs-C/simulator/CMakeFiles/simulator.dir/convert.c.o.time /Users/buildslave/jenkins/workspace/test-suite-verify-machineinstrs-aarch64-globalisel-O0-g/compiler/bin/clang -DNDEBUG  -B /Applications/Xcode.app/Contents/Developer/Toolchains/XcodeDefault.xctoolchain/usr/bin    -Wno-unused-command-line-argument -mllvm -verify-machineinstrs -O0 -g -arch arm64 -isysroot /Applications/Xcode.app/Contents/Developer/Platforms/iPhoneOS.platform/Developer/SDKs/iPhoneOS11.4.sdk   -w -Werror=date-time -MD -MT MultiSource/Benchmarks/Prolangs-C/simulator/CMakeFiles/simulator.dir/convert.c.o -MF MultiSource/Benchmarks/Prolangs-C/simulator/CMakeFiles/simulator.dir/convert.c.o.d -o MultiSource/Benchmarks/Prolangs-C/simulator/CMakeFiles/simulator.dir/convert.c.o   -c /Users/buildslave/jenkins/workspace/test-suite-verify-machineinstrs-aarch64-globalisel-O0-g/test-suite/MultiSource/Benchmarks/Prolangs-C/simulator/convert.c
link error
    MultiSource/Benchmarks/Prolangs-C/simulator/CMakeFiles/simulator.dir/sim_debug.c.o
duplicate symbol _TYPE_OUT_MODE in:
    MultiSource/Benchmarks/Prolangs-C/simulator/CMakeFiles/simulator.dir/debugger.c.o
    MultiSource/Benchmarks/Prolangs-C/simulator/CMakeFiles/simulator.dir/sim_debug.c.o
ld: 11 duplicate symbols for architecture arm64
clang-11: error: linker command failed with exit code 1 (use -v to see invocation)
[6968/8583] /Users/buildslave/jenkins/workspace/test-suite-verify-machineinstrs-aarch64-globalisel-O0-g/test-suite-build/tools/timeit --summary MultiSource/Benchmarks/Prolangs-C/unix-tbl/CMakeFiles/unix-tbl.dir/t3.c.o.time /Users/buildslave/jenkins/workspace/test-suite-verify-machineinstrs-aarch64-globalisel-O0-g/compiler/bin/clang -DNDEBUG  -B /Applications/Xcode.app/Contents/Developer/Toolchains/XcodeDefault.xctoolchain/usr/bin    -Wno-unused-command-line-argument -mllvm -verify-machineinstrs -O0 -g -arch arm64 -isysroot /Applications/Xcode.app/Contents/Developer/Platforms/iPhoneOS.platform/Developer/SDKs/iPhoneOS11.4.sdk   -w -Werror=date-time -MD -MT MultiSource/Benchmarks/Prolangs-C/unix-tbl/CMakeFiles/unix-tbl.dir/t3.c.o -MF MultiSource/Benchmarks/Prolangs-C/unix-tbl/CMakeFiles/unix-tbl.dir/t3.c.o.d -o MultiSource/Benchmarks/Prolangs-C/unix-tbl/CMakeFiles/unix-tbl.dir/t3.c.o   -c /Users/buildslave/jenkins/workspace/test-suite-verify-machineinstrs-aarch64-globalisel-O0-g/test-suite/MultiSource/Benchmarks/Prolangs-C/unix-tbl/t3.c
[6969/8583] /Users/buildslave/jenkins/workspace/test-suite-verify-machineinstrs-aarch64-globalisel-O0-g/test-suite-build/tools/timeit --summary MultiSource/Benchmarks/Prolangs-C/cdecl/CMakeFiles/cdecl.dir/cdecl.c.o.time /Users/buildslave/jenkins/workspace/test-suite-verify-machineinstrs-aarch64-globalisel-O0-g/compiler/bin/clang -DNDEBUG  -B /Applications/Xcode.app/Contents/Developer/Toolchains/XcodeDefault.xctoolchain/usr/bin    -Wno-unused-command-line-argument -mllvm -verify-machineinstrs -O0 -g -arch arm64 -isysroot /Applications/Xcode.app/Contents/Developer/Platforms/iPhoneOS.platform/Developer/SDKs/iPhoneOS11.4.sdk   -w -Werror=date-time -std=gnu89 -MD -MT MultiSource/Benchmarks/Prolangs-C/cdecl/CMakeFiles/cdecl.dir/cdecl.c.o -MF MultiSource/Benchmarks/Prolangs-C/cdecl/CMakeFiles/cdecl.dir/cdecl.c.o.d -o MultiSource/Benchmarks/Prolangs-C/cdecl/CMakeFiles/cdecl.dir/cdecl.c.o   -c /Users/buildslave/jenkins/workspace/test-suite-verify-machineinstrs-aarch64-globalisel-O0-g/test-suite/MultiSource/Benchmarks/Prolangs-C/cdecl/cdecl.c
link error
    MultiSource/Benchmarks/DOE-ProxyApps-C/miniAMR/CMakeFiles/miniAMR.dir/util.c.o
duplicate symbol _p2 in:
    MultiSource/Benchmarks/DOE-ProxyApps-C/miniAMR/CMakeFiles/miniAMR.dir/block.c.o
    MultiSource/Benchmarks/DOE-ProxyApps-C/miniAMR/CMakeFiles/miniAMR.dir/util.c.o
ld: 1116 duplicate symbols for architecture arm64
clang-11: error: linker command failed with exit code 1 (use -v to see invocation)
[7290/8583] /Users/buildslave/jenkins/workspace/test-suite-verify-machineinstrs-aarch64-globalisel-O0-g/test-suite-build/tools/timeit --summary MultiSource/Benchmarks/DOE-ProxyApps-C/SimpleMOC/CMakeFiles/SimpleMOC.dir/utils.c.o.time /Users/buildslave/jenkins/workspace/test-suite-verify-machineinstrs-aarch64-globalisel-O0-g/compiler/bin/clang -DNDEBUG  -B /Applications/Xcode.app/Contents/Developer/Toolchains/XcodeDefault.xctoolchain/usr/bin    -Wno-unused-command-line-argument -mllvm -verify-machineinstrs -O0 -g -arch arm64 -isysroot /Applications/Xcode.app/Contents/Developer/Platforms/iPhoneOS.platform/Developer/SDKs/iPhoneOS11.4.sdk   -w -Werror=date-time -std=gnu99 -MD -MT MultiSource/Benchmarks/DOE-ProxyApps-C/SimpleMOC/CMakeFiles/SimpleMOC.dir/utils.c.o -MF MultiSource/Benchmarks/DOE-ProxyApps-C/SimpleMOC/CMakeFiles/SimpleMOC.dir/utils.c.o.d -o MultiSource/Benchmarks/DOE-ProxyApps-C/SimpleMOC/CMakeFiles/SimpleMOC.dir/utils.c.o   -c /Users/buildslave/jenkins/workspace/test-suite-verify-machineinstrs-aarch64-globalisel-O0-g/test-suite/MultiSource/Benchmarks/DOE-ProxyApps-C/SimpleMOC/utils.c
[7291/8583] /Users/buildslave/jenkins/workspace/test-suite-verify-machineinstrs-aarch64-globalisel-O0-g/test-suite-build/tools/timeit --summary MultiSource/Benchmarks/DOE-ProxyApps-C/SimpleMOC/CMakeFiles/SimpleMOC.dir/tracks.c.o.time /Users/buildslave/jenkins/workspace/test-suite-verify-machineinstrs-aarch64-globalisel-O0-g/compiler/bin/clang -DNDEBUG  -B /Applications/Xcode.app/Contents/Developer/Toolchains/XcodeDefault.xctoolchain/usr/bin    -Wno-unused-command-line-argument -mllvm -verify-machineinstrs -O0 -g -arch arm64 -isysroot /Applications/Xcode.app/Contents/Developer/Platforms/iPhoneOS.platform/Developer/SDKs/iPhoneOS11.4.sdk   -w -Werror=date-time -std=gnu99 -MD -MT MultiSource/Benchmarks/DOE-ProxyApps-C/SimpleMOC/CMakeFiles/SimpleMOC.dir/tracks.c.o -MF MultiSource/Benchmarks/DOE-ProxyApps-C/SimpleMOC/CMakeFiles/SimpleMOC.dir/tracks.c.o.d -o MultiSource/Benchmarks/DOE-ProxyApps-C/SimpleMOC/CMakeFiles/SimpleMOC.dir/tracks.c.o   -c /Users/buildslave/jenkins/workspace/test-suite-verify-machineinstrs-aarch64-globalisel-O0-g/test-suite/MultiSource/Benchmarks/DOE-ProxyApps-C/SimpleMOC/tracks.c
Ninja target: lencod
[5804/8583] /Users/buildslave/jenkins/workspace/test-suite-verify-machineinstrs-aarch64-globalisel-O0-g/test-suite-build/tools/timeit --summary MultiSource/Applications/sgefa/CMakeFiles/sgefa.dir/sgesl.c.o.time /Users/buildslave/jenkins/workspace/test-suite-verify-machineinstrs-aarch64-globalisel-O0-g/compiler/bin/clang -DNDEBUG  -B /Applications/Xcode.app/Contents/Developer/Toolchains/XcodeDefault.xctoolchain/usr/bin    -Wno-unused-command-line-argument -mllvm -verify-machineinstrs -O0 -g -arch arm64 -isysroot /Applications/Xcode.app/Contents/Developer/Platforms/iPhoneOS.platform/Developer/SDKs/iPhoneOS11.4.sdk   -w -Werror=date-time -DSCALE=40 -MD -MT MultiSource/Applications/sgefa/CMakeFiles/sgefa.dir/sgesl.c.o -MF MultiSource/Applications/sgefa/CMakeFiles/sgefa.dir/sgesl.c.o.d -o MultiSource/Applications/sgefa/CMakeFiles/sgefa.dir/sgesl.c.o   -c /Users/buildslave/jenkins/workspace/test-suite-verify-machineinstrs-aarch64-globalisel-O0-g/test-suite/MultiSource/Applications/sgefa/sgesl.c
[5805/8583] /Users/buildslave/jenkins/workspace/test-suite-verify-machineinstrs-aarch64-globalisel-O0-g/test-suite-build/tools/timeit --summary MultiSource/Applications/JM/lencod/CMakeFiles/lencod.dir/rdopt.c.o.time /Users/buildslave/jenkins/workspace/test-suite-verify-machineinstrs-aarch64-globalisel-O0-g/compiler/bin/clang -DNDEBUG  -B /Applications/Xcode.app/Contents/Developer/Toolchains/XcodeDefault.xctoolchain/usr/bin    -Wno-unused-command-line-argument -mllvm -verify-machineinstrs -O0 -g -arch arm64 -isysroot /Applications/Xcode.app/Contents/Developer/Platforms/iPhoneOS.platform/Developer/SDKs/iPhoneOS11.4.sdk   -w -Werror=date-time -D__USE_LARGEFILE64 -D_FILE_OFFSET_BITS=64 -MD -MT MultiSource/Applications/JM/lencod/CMakeFiles/lencod.dir/rdopt.c.o -MF MultiSource/Applications/JM/lencod/CMakeFiles/lencod.dir/rdopt.c.o.d -o MultiSource/Applications/JM/lencod/CMakeFiles/lencod.dir/rdopt.c.o   -c /Users/buildslave/jenkins/workspace/test-suite-verify-machineinstrs-aarch64-globalisel-O0-g/test-suite/MultiSource/Applications/JM/lencod/rdopt.c
[5806/8583] /Users/buildslave/jenkins/workspace/test-suite-verify-machineinstrs-aarch64-globalisel-O0-g/test-suite-build/tools/timeit --summary MultiSource/Applications/d/CMakeFiles/make_dparser.dir/gram.c.o.time /Users/buildslave/jenkins/workspace/test-suite-verify-machineinstrs-aarch64-globalisel-O0-g/compiler/bin/clang -DNDEBUG  -B /Applications/Xcode.app/Contents/Developer/Toolchains/XcodeDefault.xctoolchain/usr/bin    -Wno-unused-command-line-argument -mllvm -verify-machineinstrs -O0 -g -arch arm64 -isysroot /Applications/Xcode.app/Contents/Developer/Platforms/iPhoneOS.platform/Developer/SDKs/iPhoneOS11.4.sdk   -w -Werror=date-time -DD_BUILD_VERSION=5725 -MD -MT MultiSource/Applications/d/CMakeFiles/make_dparser.dir/gram.c.o -MF MultiSource/Applications/d/CMakeFiles/make_dparser.dir/gram.c.o.d -o MultiSource/Applications/d/CMakeFiles/make_dparser.dir/gram.c.o   -c /Users/buildslave/jenkins/workspace/test-suite-verify-machineinstrs-aarch64-globalisel-O0-g/test-suite/MultiSource/Applications/d/gram.c
[5807/8583] : && /Users/buildslave/jenkins/workspace/test-suite-verify-machineinstrs-aarch64-globalisel-O0-g/test-suite-build/tools/timeit --summary MultiSource/Applications/SIBsim4/SIBsim4.link.time /Users/buildslave/jenkins/workspace/test-suite-verify-machineinstrs-aarch64-globalisel-O0-g/compiler/bin/clang -B /Applications/Xcode.app/Contents/Developer/Toolchains/XcodeDefault.xctoolchain/usr/bin    -Wno-unused-command-line-argument -mllvm -verify-machineinstrs -O0 -g -arch arm64 -isysroot /Applications/Xcode.app/Contents/Developer/Platforms/iPhoneOS.platform/Developer/SDKs/iPhoneOS11.4.sdk -Wl,-search_paths_first -Wl,-headerpad_max_install_names -B /Applications/Xcode.app/Contents/Developer/Toolchains/XcodeDefault.xctoolchain/usr/bin MultiSource/Applications/SIBsim4/CMakeFiles/SIBsim4.dir/align.c.o MultiSource/Applications/SIBsim4/CMakeFiles/SIBsim4.dir/misc.c.o MultiSource/Applications/SIBsim4/CMakeFiles/SIBsim4.dir/sim4.init.c.o MultiSource/Applications/SIBsim4/CMakeFiles/SIBsim4.dir/sim4b1.c.o  -o MultiSource/Applications/SIBsim4/SIBsim4   && cd /Users/buildslave/jenkins/workspace/test-suite-verify-machineinstrs-aarch64-globalisel-O0-g/test-suite-build/MultiSource/Applications/SIBsim4 && /usr/local/Cellar/cmake/3.13.1/bin/cmake -E create_symlink /Users/buildslave/jenkins/workspace/test-suite-verify-machineinstrs-aarch64-globalisel-O0-g/test-suite/MultiSource/Applications/SIBsim4/SIBsim4.reference_output /Users/buildslave/jenkins/workspace/test-suite-verify-machineinstrs-aarch64-globalisel-O0-g/test-suite-build/MultiSource/Applications/SIBsim4/SIBsim4.reference_output && cd /Users/buildslave/jenkins/workspace/test-suite-verify-machineinstrs-aarch64-globalisel-O0-g/test-suite-build/MultiSource/Applications/SIBsim4 && /usr/local/Cellar/cmake/3.13.1/bin/cmake -E create_symlink /Users/buildslave/jenkins/workspace/test-suite-verify-machineinstrs-aarch64-globalisel-O0-g/test-suite/MultiSource/Applications/SIBsim4/x.fa /Users/buildslave/jenkins/workspace/test-suite-verify-machineinstrs-aarch64-globalisel-O0-g/test-suite-build/MultiSource/Applications/SIBsim4/x.fa && cd /Users/buildslave/jenkins/workspace/test-suite-verify-machineinstrs-aarch64-globalisel-O0-g/test-suite-build/MultiSource/Applications/SIBsim4 && /usr/local/Cellar/cmake/3.13.1/bin/cmake -E create_symlink /Users/buildslave/jenkins/workspace/test-suite-verify-machineinstrs-aarch64-globalisel-O0-g/test-suite/MultiSource/Applications/SIBsim4/y.fa /Users/buildslave/jenkins/workspace/test-suite-verify-machineinstrs-aarch64-globalisel-O0-g/test-suite-build/MultiSource/Applications/SIBsim4/y.fa
[5808/8583] : && /Users/buildslave/jenkins/workspace/test-suite-verify-machineinstrs-aarch64-globalisel-O0-g/test-suite-build/tools/timeit --summary MultiSource/Applications/JM/lencod/lencod.link.time /Users/buildslave/jenkins/workspace/test-suite-verify-machineinstrs-aarch64-globalisel-O0-g/compiler/bin/clang -B /Applications/Xcode.app/Contents/Developer/Toolchains/XcodeDefault.xctoolchain/usr/bin    -Wno-unused-command-line-argument -mllvm -verify-machineinstrs -O0 -g -arch arm64 -isysroot /Applications/Xcode.app/Contents/Developer/Platforms/iPhoneOS.platform/Developer/SDKs/iPhoneOS11.4.sdk -Wl,-search_paths_first -Wl,-headerpad_max_install_names -B /Applications/Xcode.app/Contents/Developer/Toolchains/XcodeDefault.xctoolchain/usr/bin MultiSource/Applications/JM/lencod/CMakeFiles/lencod.dir/annexb.c.o MultiSource/Applications/JM/lencod/CMakeFiles/lencod.dir/biariencode.c.o MultiSource/Applications/JM/lencod/CMakeFiles/lencod.dir/block.c.o MultiSource/Applications/JM/lencod/CMakeFiles/lencod.dir/cabac.c.o MultiSource/Applications/JM/lencod/CMakeFiles/lencod.dir/configfile.c.o MultiSource/Applications/JM/lencod/CMakeFiles/lencod.dir/context_ini.c.o MultiSource/Applications/JM/lencod/CMakeFiles/lencod.dir/decoder.c.o MultiSource/Applications/JM/lencod/CMakeFiles/lencod.dir/explicit_gop.c.o MultiSource/Applications/JM/lencod/CMakeFiles/lencod.dir/filehandle.c.o MultiSource/Applications/JM/lencod/CMakeFiles/lencod.dir/fmo.c.o MultiSource/Applications/JM/lencod/CMakeFiles/lencod.dir/header.c.o MultiSource/Applications/JM/lencod/CMakeFiles/lencod.dir/image.c.o MultiSource/Applications/JM/lencod/CMakeFiles/lencod.dir/img_chroma.c.o MultiSource/Applications/JM/lencod/CMakeFiles/lencod.dir/img_luma.c.o MultiSource/Applications/JM/lencod/CMakeFiles/lencod.dir/intrarefresh.c.o MultiSource/Applications/JM/lencod/CMakeFiles/lencod.dir/leaky_bucket.c.o MultiSource/Applications/JM/lencod/CMakeFiles/lencod.dir/lencod.c.o MultiSource/Applications/JM/lencod/CMakeFiles/lencod.dir/loopFilter.c.o MultiSource/Applications/JM/lencod/CMakeFiles/lencod.dir/macroblock.c.o MultiSource/Applications/JM/lencod/CMakeFiles/lencod.dir/mb_access.c.o MultiSource/Applications/JM/lencod/CMakeFiles/lencod.dir/mbuffer.c.o MultiSource/Applications/JM/lencod/CMakeFiles/lencod.dir/md_high.c.o MultiSource/Applications/JM/lencod/CMakeFiles/lencod.dir/md_highfast.c.o MultiSource/Applications/JM/lencod/CMakeFiles/lencod.dir/md_highloss.c.o MultiSource/Applications/JM/lencod/CMakeFiles/lencod.dir/md_low.c.o MultiSource/Applications/JM/lencod/CMakeFiles/lencod.dir/me_distortion.c.o MultiSource/Applications/JM/lencod/CMakeFiles/lencod.dir/me_epzs.c.o MultiSource/Applications/JM/lencod/CMakeFiles/lencod.dir/me_fullfast.c.o MultiSource/Applications/JM/lencod/CMakeFiles/lencod.dir/me_fullsearch.c.o MultiSource/Applications/JM/lencod/CMakeFiles/lencod.dir/me_umhex.c.o MultiSource/Applications/JM/lencod/CMakeFiles/lencod.dir/me_umhexsmp.c.o MultiSource/Applications/JM/lencod/CMakeFiles/lencod.dir/memalloc.c.o MultiSource/Applications/JM/lencod/CMakeFiles/lencod.dir/mode_decision.c.o MultiSource/Applications/JM/lencod/CMakeFiles/lencod.dir/mv-search.c.o MultiSource/Applications/JM/lencod/CMakeFiles/lencod.dir/nal.c.o MultiSource/Applications/JM/lencod/CMakeFiles/lencod.dir/nalu.c.o MultiSource/Applications/JM/lencod/CMakeFiles/lencod.dir/nalucommon.c.o MultiSource/Applications/JM/lencod/CMakeFiles/lencod.dir/output.c.o MultiSource/Applications/JM/lencod/CMakeFiles/lencod.dir/parset.c.o MultiSource/Applications/JM/lencod/CMakeFiles/lencod.dir/parsetcommon.c.o MultiSource/Applications/JM/lencod/CMakeFiles/lencod.dir/q_matrix.c.o MultiSource/Applications/JM/lencod/CMakeFiles/lencod.dir/q_offsets.c.o MultiSource/Applications/JM/lencod/CMakeFiles/lencod.dir/ratectl.c.o MultiSource/Applications/JM/lencod/CMakeFiles/lencod.dir/rc_quadratic.c.o MultiSource/Applications/JM/lencod/CMakeFiles/lencod.dir/rdopt.c.o MultiSource/Applications/JM/lencod/CMakeFiles/lencod.dir/rdopt_coding_state.c.o MultiSource/Applications/JM/lencod/CMakeFiles/lencod.dir/rdpicdecision.c.o MultiSource/Applications/JM/lencod/CMakeFiles/lencod.dir/refbuf.c.o MultiSource/Applications/JM/lencod/CMakeFiles/lencod.dir/rtp.c.o MultiSource/Applications/JM/lencod/CMakeFiles/lencod.dir/sei.c.o MultiSource/Applications/JM/lencod/CMakeFiles/lencod.dir/slice.c.o MultiSource/Applications/JM/lencod/CMakeFiles/lencod.dir/symbol.c.o MultiSource/Applications/JM/lencod/CMakeFiles/lencod.dir/transform8x8.c.o MultiSource/Applications/JM/lencod/CMakeFiles/lencod.dir/vlc.c.o MultiSource/Applications/JM/lencod/CMakeFiles/lencod.dir/weighted_prediction.c.o  -o MultiSource/Applications/JM/lencod/lencod  -lm && cd /Users/buildslave/jenkins/workspace/test-suite-verify-machineinstrs-aarch64-globalisel-O0-g/test-suite-build/MultiSource/Applications/JM/lencod && /usr/local/Cellar/cmake/3.13.1/bin/cmake -E create_symlink /Users/buildslave/jenkins/workspace/test-suite-verify-machineinstrs-aarch64-globalisel-O0-g/test-suite/MultiSource/Applications/JM/lencod/lencod.reference_output /Users/buildslave/jenkins/workspace/test-suite-verify-machineinstrs-aarch64-globalisel-O0-g/test-suite-build/MultiSource/Applications/JM/lencod/lencod.reference_output && cd /Users/buildslave/jenkins/workspace/test-suite-verify-machineinstrs-aarch64-globalisel-O0-g/test-suite-build/MultiSource/Applications/JM/lencod && /usr/local/Cellar/cmake/3.13.1/bin/cmake -E make_directory data && cd /Users/buildslave/jenkins/workspace/test-suite-verify-machineinstrs-aarch64-globalisel-O0-g/test-suite-build/MultiSource/Applications/JM/lencod && /usr/local/Cellar/cmake/3.13.1/bin/cmake -E create_symlink /Users/buildslave/jenkins/workspace/test-suite-verify-machineinstrs-aarch64-globalisel-O0-g/test-suite/MultiSource/Applications/JM/lencod/data/encoder.cfg /Users/buildslave/jenkins/workspace/test-suite-verify-machineinstrs-aarch64-globalisel-O0-g/test-suite-build/MultiSource/Applications/JM/lencod/data/encoder.cfg && cd /Users/buildslave/jenkins/workspace/test-suite-verify-machineinstrs-aarch64-globalisel-O0-g/test-suite-build/MultiSource/Applications/JM/lencod && /usr/local/Cellar/cmake/3.13.1/bin/cmake -E make_directory data && cd /Users/buildslave/jenkins/workspace/test-suite-verify-machineinstrs-aarch64-globalisel-O0-g/test-suite-build/MultiSource/Applications/JM/lencod && /usr/local/Cellar/cmake/3.13.1/bin/cmake -E create_symlink /Users/buildslave/jenkins/workspace/test-suite-verify-machineinstrs-aarch64-globalisel-O0-g/test-suite/MultiSource/Applications/JM/lencod/data/foreman_part_qcif_444.yuv /Users/buildslave/jenkins/workspace/test-suite-verify-machineinstrs-aarch64-globalisel-O0-g/test-suite-build/MultiSource/Applications/JM/lencod/data/foreman_part_qcif_444.yuv && cd /Users/buildslave/jenkins/workspace/test-suite-verify-machineinstrs-aarch64-globalisel-O0-g/test-suite-build/MultiSource/Applications/JM/lencod && /usr/local/Cellar/cmake/3.13.1/bin/cmake -E make_directory data && cd /Users/buildslave/jenkins/workspace/test-suite-verify-machineinstrs-aarch64-globalisel-O0-g/test-suite-build/MultiSource/Applications/JM/lencod && /usr/local/Cellar/cmake/3.13.1/bin/cmake -E create_symlink /Users/buildslave/jenkins/workspace/test-suite-verify-machineinstrs-aarch64-globalisel-O0-g/test-suite/MultiSource/Applications/JM/lencod/data/leakybucketrate.cfg /Users/buildslave/jenkins/workspace/test-suite-verify-machineinstrs-aarch64-globalisel-O0-g/test-suite-build/MultiSource/Applications/JM/lencod/data/leakybucketrate.cfg && cd /Users/buildslave/jenkins/workspace/test-suite-verify-machineinstrs-aarch64-globalisel-O0-g/test-suite-build/MultiSource/Applications/JM/lencod && /usr/local/Cellar/cmake/3.13.1/bin/cmake -E make_directory data && cd /Users/buildslave/jenkins/workspace/test-suite-verify-machineinstrs-aarch64-globalisel-O0-g/test-suite-build/MultiSource/Applications/JM/lencod && /usr/local/Cellar/cmake/3.13.1/bin/cmake -E create_symlink /Users/buildslave/jenkins/workspace/test-suite-verify-machineinstrs-aarch64-globalisel-O0-g/test-suite/MultiSource/Applications/JM/lencod/data/q_matrix.cfg /Users/buildslave/jenkins/workspace/test-suite-verify-machineinstrs-aarch64-globalisel-O0-g/test-suite-build/MultiSource/Applications/JM/lencod/data/q_matrix.cfg
FAILED: MultiSource/Applications/JM/lencod/lencod 
: && /Users/buildslave/jenkins/workspace/test-suite-verify-machineinstrs-aarch64-globalisel-O0-g/test-suite-build/tools/timeit --summary MultiSource/Applications/JM/lencod/lencod.link.time /Users/buildslave/jenkins/workspace/test-suite-verify-machineinstrs-aarch64-globalisel-O0-g/compiler/bin/clang -B /Applications/Xcode.app/Contents/Developer/Toolchains/XcodeDefault.xctoolchain/usr/bin    -Wno-unused-command-line-argument -mllvm -verify-machineinstrs -O0 -g -arch arm64 -isysroot /Applications/Xcode.app/Contents/Developer/Platforms/iPhoneOS.platform/Developer/SDKs/iPhoneOS11.4.sdk -Wl,-search_paths_first -Wl,-headerpad_max_install_names -B /Applications/Xcode.app/Contents/Developer/Toolchains/XcodeDefault.xctoolchain/usr/bin MultiSource/Applications/JM/lencod/CMakeFiles/lencod.dir/annexb.c.o MultiSource/Applications/JM/lencod/CMakeFiles/lencod.dir/biariencode.c.o MultiSource/Applications/JM/lencod/CMakeFiles/lencod.dir/block.c.o MultiSource/Applications/JM/lencod/CMakeFiles/lencod.dir/cabac.c.o MultiSource/Applications/JM/lencod/CMakeFiles/lencod.dir/configfile.c.o MultiSource/Applications/JM/lencod/CMakeFiles/lencod.dir/context_ini.c.o MultiSource/Applications/JM/lencod/CMakeFiles/lencod.dir/decoder.c.o MultiSource/Applications/JM/lencod/CMakeFiles/lencod.dir/explicit_gop.c.o MultiSource/Applications/JM/lencod/CMakeFiles/lencod.dir/filehandle.c.o MultiSource/Applications/JM/lencod/CMakeFiles/lencod.dir/fmo.c.o MultiSource/Applications/JM/lencod/CMakeFiles/lencod.dir/header.c.o MultiSource/Applications/JM/lencod/CMakeFiles/lencod.dir/image.c.o MultiSource/Applications/JM/lencod/CMakeFiles/lencod.dir/img_chroma.c.o MultiSource/Applications/JM/lencod/CMakeFiles/lencod.dir/img_luma.c.o MultiSource/Applications/JM/lencod/CMakeFiles/lencod.dir/intrarefresh.c.o MultiSource/Applications/JM/lencod/CMakeFiles/lencod.dir/leaky_bucket.c.o MultiSource/Applications/JM/lencod/CMakeFiles/lencod.dir/lencod.c.o MultiSource/Applications/JM/lencod/CMakeFiles/lencod.dir/loopFilter.c.o MultiSource/Applications/JM/lencod/CMakeFiles/lencod.dir/macroblock.c.o MultiSource/Applications/JM/lencod/CMakeFiles/lencod.dir/mb_access.c.o MultiSource/Applications/JM/lencod/CMakeFiles/lencod.dir/mbuffer.c.o MultiSource/Applications/JM/lencod/CMakeFiles/lencod.dir/md_high.c.o MultiSource/Applications/JM/lencod/CMakeFiles/lencod.dir/md_highfast.c.o MultiSource/Applications/JM/lencod/CMakeFiles/lencod.dir/md_highloss.c.o MultiSource/Applications/JM/lencod/CMakeFiles/lencod.dir/md_low.c.o MultiSource/Applications/JM/lencod/CMakeFiles/lencod.dir/me_distortion.c.o MultiSource/Applications/JM/lencod/CMakeFiles/lencod.dir/me_epzs.c.o MultiSource/Applications/JM/lencod/CMakeFiles/lencod.dir/me_fullfast.c.o MultiSource/Applications/JM/lencod/CMakeFiles/lencod.dir/me_fullsearch.c.o MultiSource/Applications/JM/lencod/CMakeFiles/lencod.dir/me_umhex.c.o MultiSource/Applications/JM/lencod/CMakeFiles/lencod.dir/me_umhexsmp.c.o MultiSource/Applications/JM/lencod/CMakeFiles/lencod.dir/memalloc.c.o MultiSource/Applications/JM/lencod/CMakeFiles/lencod.dir/mode_decision.c.o MultiSource/Applications/JM/lencod/CMakeFiles/lencod.dir/mv-search.c.o MultiSource/Applications/JM/lencod/CMakeFiles/lencod.dir/nal.c.o MultiSource/Applications/JM/lencod/CMakeFiles/lencod.dir/nalu.c.o MultiSource/Applications/JM/lencod/CMakeFiles/lencod.dir/nalucommon.c.o MultiSource/Applications/JM/lencod/CMakeFiles/lencod.dir/output.c.o MultiSource/Applications/JM/lencod/CMakeFiles/lencod.dir/parset.c.o MultiSource/Applications/JM/lencod/CMakeFiles/lencod.dir/parsetcommon.c.o MultiSource/Applications/JM/lencod/CMakeFiles/lencod.dir/q_matrix.c.o MultiSource/Applications/JM/lencod/CMakeFiles/lencod.dir/q_offsets.c.o MultiSource/Applications/JM/lencod/CMakeFiles/lencod.dir/ratectl.c.o MultiSource/Applications/JM/lencod/CMakeFiles/lencod.dir/rc_quadratic.c.o MultiSource/Applications/JM/lencod/CMakeFiles/lencod.dir/rdopt.c.o MultiSource/Applications/JM/lencod/CMakeFiles/lencod.dir/rdopt_coding_state.c.o MultiSource/Applications/JM/lencod/CMakeFiles/lencod.dir/rdpicdecision.c.o MultiSource/Applications/JM/lencod/CMakeFiles/lencod.dir/refbuf.c.o MultiSource/Applications/JM/lencod/CMakeFiles/lencod.dir/rtp.c.o MultiSource/Applications/JM/lencod/CMakeFiles/lencod.dir/sei.c.o MultiSource/Applications/JM/lencod/CMakeFiles/lencod.dir/slice.c.o MultiSource/Applications/JM/lencod/CMakeFiles/lencod.dir/symbol.c.o MultiSource/Applications/JM/lencod/CMakeFiles/lencod.dir/transform8x8.c.o MultiSource/Applications/JM/lencod/CMakeFiles/lencod.dir/vlc.c.o MultiSource/Applications/JM/lencod/CMakeFiles/lencod.dir/weighted_prediction.c.o  -o MultiSource/Applications/JM/lencod/lencod  -lm && cd /Users/buildslave/jenkins/workspace/test-suite-verify-machineinstrs-aarch64-globalisel-O0-g/test-suite-build/MultiSource/Applications/JM/lencod && /usr/local/Cellar/cmake/3.13.1/bin/cmake -E create_symlink /Users/buildslave/jenkins/workspace/test-suite-verify-machineinstrs-aarch64-globalisel-O0-g/test-suite/MultiSource/Applications/JM/lencod/lencod.reference_output /Users/buildslave/jenkins/workspace/test-suite-verify-machineinstrs-aarch64-globalisel-O0-g/test-suite-build/MultiSource/Applications/JM/lencod/lencod.reference_output && cd /Users/buildslave/jenkins/workspace/test-suite-verify-machineinstrs-aarch64-globalisel-O0-g/test-suite-build/MultiSource/Applications/JM/lencod && /usr/local/Cellar/cmake/3.13.1/bin/cmake -E make_directory data && cd /Users/buildslave/jenkins/workspace/test-suite-verify-machineinstrs-aarch64-globalisel-O0-g/test-suite-build/MultiSource/Applications/JM/lencod && /usr/local/Cellar/cmake/3.13.1/bin/cmake -E create_symlink /Users/buildslave/jenkins/workspace/test-suite-verify-machineinstrs-aarch64-globalisel-O0-g/test-suite/MultiSource/Applications/JM/lencod/data/encoder.cfg /Users/buildslave/jenkins/workspace/test-suite-verify-machineinstrs-aarch64-globalisel-O0-g/test-suite-build/MultiSource/Applications/JM/lencod/data/encoder.cfg && cd /Users/buildslave/jenkins/workspace/test-suite-verify-machineinstrs-aarch64-globalisel-O0-g/test-suite-build/MultiSource/Applications/JM/lencod && /usr/local/Cellar/cmake/3.13.1/bin/cmake -E make_directory data && cd /Users/buildslave/jenkins/workspace/test-suite-verify-machineinstrs-aarch64-globalisel-O0-g/test-suite-build/MultiSource/Applications/JM/lencod && /usr/local/Cellar/cmake/3.13.1/bin/cmake -E create_symlink /Users/buildslave/jenkins/workspace/test-suite-verify-machineinstrs-aarch64-globalisel-O0-g/test-suite/MultiSource/Applications/JM/lencod/data/foreman_part_qcif_444.yuv /Users/buildslave/jenkins/workspace/test-suite-verify-machineinstrs-aarch64-globalisel-O0-g/test-suite-build/MultiSource/Applications/JM/lencod/data/foreman_part_qcif_444.yuv && cd /Users/buildslave/jenkins/workspace/test-suite-verify-machineinstrs-aarch64-globalisel-O0-g/test-suite-build/MultiSource/Applications/JM/lencod && /usr/local/Cellar/cmake/3.13.1/bin/cmake -E make_directory data && cd /Users/buildslave/jenkins/workspace/test-suite-verify-machineinstrs-aarch64-globalisel-O0-g/test-suite-build/MultiSource/Applications/JM/lencod && /usr/local/Cellar/cmake/3.13.1/bin/cmake -E create_symlink /Users/buildslave/jenkins/workspace/test-suite-verify-machineinstrs-aarch64-globalisel-O0-g/test-suite/MultiSource/Applications/JM/lencod/data/leakybucketrate.cfg /Users/buildslave/jenkins/workspace/test-suite-verify-machineinstrs-aarch64-globalisel-O0-g/test-suite-build/MultiSource/Applications/JM/lencod/data/leakybucketrate.cfg && cd /Users/buildslave/jenkins/workspace/test-suite-verify-machineinstrs-aarch64-globalisel-O0-g/test-suite-build/MultiSource/Applications/JM/lencod && /usr/local/Cellar/cmake/3.13.1/bin/cmake -E make_directory data && cd /Users/buildslave/jenkins/workspace/test-suite-verify-machineinstrs-aarch64-globalisel-O0-g/test-suite-build/MultiSource/Applications/JM/lencod && /usr/local/Cellar/cmake/3.13.1/bin/cmake -E create_symlink /Users/buildslave/jenkins/workspace/test-suite-verify-machineinstrs-aarch64-globalisel-O0-g/test-suite/MultiSource/Applications/JM/lencod/data/q_matrix.cfg /Users/buildslave/jenkins/workspace/test-suite-verify-machineinstrs-aarch64-globalisel-O0-g/test-suite-build/MultiSource/Applications/JM/lencod/data/q_matrix.cfg
duplicate symbol _img_pad_size_uv_y in:
Ninja target: ldecod
[5817/8583] /Users/buildslave/jenkins/workspace/test-suite-verify-machineinstrs-aarch64-globalisel-O0-g/test-suite-build/tools/timeit --summary MultiSource/Applications/spiff/CMakeFiles/spiff.dir/line.c.o.time /Users/buildslave/jenkins/workspace/test-suite-verify-machineinstrs-aarch64-globalisel-O0-g/compiler/bin/clang -DNDEBUG  -B /Applications/Xcode.app/Contents/Developer/Toolchains/XcodeDefault.xctoolchain/usr/bin    -Wno-unused-command-line-argument -mllvm -verify-machineinstrs -O0 -g -arch arm64 -isysroot /Applications/Xcode.app/Contents/Developer/Platforms/iPhoneOS.platform/Developer/SDKs/iPhoneOS11.4.sdk   -w -Werror=date-time -MD -MT MultiSource/Applications/spiff/CMakeFiles/spiff.dir/line.c.o -MF MultiSource/Applications/spiff/CMakeFiles/spiff.dir/line.c.o.d -o MultiSource/Applications/spiff/CMakeFiles/spiff.dir/line.c.o   -c /Users/buildslave/jenkins/workspace/test-suite-verify-machineinstrs-aarch64-globalisel-O0-g/test-suite/MultiSource/Applications/spiff/line.c
[5818/8583] /Users/buildslave/jenkins/workspace/test-suite-verify-machineinstrs-aarch64-globalisel-O0-g/test-suite-build/tools/timeit --summary MultiSource/Applications/d/CMakeFiles/make_dparser.dir/parse.c.o.time /Users/buildslave/jenkins/workspace/test-suite-verify-machineinstrs-aarch64-globalisel-O0-g/compiler/bin/clang -DNDEBUG  -B /Applications/Xcode.app/Contents/Developer/Toolchains/XcodeDefault.xctoolchain/usr/bin    -Wno-unused-command-line-argument -mllvm -verify-machineinstrs -O0 -g -arch arm64 -isysroot /Applications/Xcode.app/Contents/Developer/Platforms/iPhoneOS.platform/Developer/SDKs/iPhoneOS11.4.sdk   -w -Werror=date-time -DD_BUILD_VERSION=5725 -MD -MT MultiSource/Applications/d/CMakeFiles/make_dparser.dir/parse.c.o -MF MultiSource/Applications/d/CMakeFiles/make_dparser.dir/parse.c.o.d -o MultiSource/Applications/d/CMakeFiles/make_dparser.dir/parse.c.o   -c /Users/buildslave/jenkins/workspace/test-suite-verify-machineinstrs-aarch64-globalisel-O0-g/test-suite/MultiSource/Applications/d/parse.c
[5819/8583] /Users/buildslave/jenkins/workspace/test-suite-verify-machineinstrs-aarch64-globalisel-O0-g/test-suite-build/tools/timeit --summary MultiSource/Applications/spiff/CMakeFiles/spiff.dir/miller.c.o.time /Users/buildslave/jenkins/workspace/test-suite-verify-machineinstrs-aarch64-globalisel-O0-g/compiler/bin/clang -DNDEBUG  -B /Applications/Xcode.app/Contents/Developer/Toolchains/XcodeDefault.xctoolchain/usr/bin    -Wno-unused-command-line-argument -mllvm -verify-machineinstrs -O0 -g -arch arm64 -isysroot /Applications/Xcode.app/Contents/Developer/Platforms/iPhoneOS.platform/Developer/SDKs/iPhoneOS11.4.sdk   -w -Werror=date-time -MD -MT MultiSource/Applications/spiff/CMakeFiles/spiff.dir/miller.c.o -MF MultiSource/Applications/spiff/CMakeFiles/spiff.dir/miller.c.o.d -o MultiSource/Applications/spiff/CMakeFiles/spiff.dir/miller.c.o   -c /Users/buildslave/jenkins/workspace/test-suite-verify-machineinstrs-aarch64-globalisel-O0-g/test-suite/MultiSource/Applications/spiff/miller.c
[5820/8583] /Users/buildslave/jenkins/workspace/test-suite-verify-machineinstrs-aarch64-globalisel-O0-g/test-suite-build/tools/timeit --summary MultiSource/Applications/JM/ldecod/CMakeFiles/ldecod.dir/macroblock.c.o.time /Users/buildslave/jenkins/workspace/test-suite-verify-machineinstrs-aarch64-globalisel-O0-g/compiler/bin/clang -DNDEBUG  -B /Applications/Xcode.app/Contents/Developer/Toolchains/XcodeDefault.xctoolchain/usr/bin    -Wno-unused-command-line-argument -mllvm -verify-machineinstrs -O0 -g -arch arm64 -isysroot /Applications/Xcode.app/Contents/Developer/Platforms/iPhoneOS.platform/Developer/SDKs/iPhoneOS11.4.sdk   -w -Werror=date-time -D__USE_LARGEFILE64 -D_FILE_OFFSET_BITS=64 -MD -MT MultiSource/Applications/JM/ldecod/CMakeFiles/ldecod.dir/macroblock.c.o -MF MultiSource/Applications/JM/ldecod/CMakeFiles/ldecod.dir/macroblock.c.o.d -o MultiSource/Applications/JM/ldecod/CMakeFiles/ldecod.dir/macroblock.c.o   -c /Users/buildslave/jenkins/workspace/test-suite-verify-machineinstrs-aarch64-globalisel-O0-g/test-suite/MultiSource/Applications/JM/ldecod/macroblock.c
[5821/8583] : && /Users/buildslave/jenkins/workspace/test-suite-verify-machineinstrs-aarch64-globalisel-O0-g/test-suite-build/tools/timeit --summary MultiSource/Applications/JM/ldecod/ldecod.link.time /Users/buildslave/jenkins/workspace/test-suite-verify-machineinstrs-aarch64-globalisel-O0-g/compiler/bin/clang -B /Applications/Xcode.app/Contents/Developer/Toolchains/XcodeDefault.xctoolchain/usr/bin    -Wno-unused-command-line-argument -mllvm -verify-machineinstrs -O0 -g -arch arm64 -isysroot /Applications/Xcode.app/Contents/Developer/Platforms/iPhoneOS.platform/Developer/SDKs/iPhoneOS11.4.sdk -Wl,-search_paths_first -Wl,-headerpad_max_install_names -B /Applications/Xcode.app/Contents/Developer/Toolchains/XcodeDefault.xctoolchain/usr/bin MultiSource/Applications/JM/ldecod/CMakeFiles/ldecod.dir/annexb.c.o MultiSource/Applications/JM/ldecod/CMakeFiles/ldecod.dir/biaridecod.c.o MultiSource/Applications/JM/ldecod/CMakeFiles/ldecod.dir/block.c.o MultiSource/Applications/JM/ldecod/CMakeFiles/ldecod.dir/cabac.c.o MultiSource/Applications/JM/ldecod/CMakeFiles/ldecod.dir/context_ini.c.o MultiSource/Applications/JM/ldecod/CMakeFiles/ldecod.dir/erc_api.c.o MultiSource/Applications/JM/ldecod/CMakeFiles/ldecod.dir/erc_do_i.c.o MultiSource/Applications/JM/ldecod/CMakeFiles/ldecod.dir/erc_do_p.c.o MultiSource/Applications/JM/ldecod/CMakeFiles/ldecod.dir/errorconcealment.c.o MultiSource/Applications/JM/ldecod/CMakeFiles/ldecod.dir/filehandle.c.o MultiSource/Applications/JM/ldecod/CMakeFiles/ldecod.dir/fmo.c.o MultiSource/Applications/JM/ldecod/CMakeFiles/ldecod.dir/header.c.o MultiSource/Applications/JM/ldecod/CMakeFiles/ldecod.dir/image.c.o MultiSource/Applications/JM/ldecod/CMakeFiles/ldecod.dir/ldecod.c.o MultiSource/Applications/JM/ldecod/CMakeFiles/ldecod.dir/leaky_bucket.c.o MultiSource/Applications/JM/ldecod/CMakeFiles/ldecod.dir/loopFilter.c.o MultiSource/Applications/JM/ldecod/CMakeFiles/ldecod.dir/macroblock.c.o MultiSource/Applications/JM/ldecod/CMakeFiles/ldecod.dir/mb_access.c.o MultiSource/Applications/JM/ldecod/CMakeFiles/ldecod.dir/mbuffer.c.o MultiSource/Applications/JM/ldecod/CMakeFiles/ldecod.dir/memalloc.c.o MultiSource/Applications/JM/ldecod/CMakeFiles/ldecod.dir/nal.c.o MultiSource/Applications/JM/ldecod/CMakeFiles/ldecod.dir/nal_part.c.o MultiSource/Applications/JM/ldecod/CMakeFiles/ldecod.dir/nalu.c.o MultiSource/Applications/JM/ldecod/CMakeFiles/ldecod.dir/nalucommon.c.o MultiSource/Applications/JM/ldecod/CMakeFiles/ldecod.dir/output.c.o MultiSource/Applications/JM/ldecod/CMakeFiles/ldecod.dir/parset.c.o MultiSource/Applications/JM/ldecod/CMakeFiles/ldecod.dir/parsetcommon.c.o MultiSource/Applications/JM/ldecod/CMakeFiles/ldecod.dir/rtp.c.o MultiSource/Applications/JM/ldecod/CMakeFiles/ldecod.dir/sei.c.o MultiSource/Applications/JM/ldecod/CMakeFiles/ldecod.dir/transform8x8.c.o MultiSource/Applications/JM/ldecod/CMakeFiles/ldecod.dir/vlc.c.o  -o MultiSource/Applications/JM/ldecod/ldecod  -lm && cd /Users/buildslave/jenkins/workspace/test-suite-verify-machineinstrs-aarch64-globalisel-O0-g/test-suite-build/MultiSource/Applications/JM/ldecod && /usr/local/Cellar/cmake/3.13.1/bin/cmake -E create_symlink /Users/buildslave/jenkins/workspace/test-suite-verify-machineinstrs-aarch64-globalisel-O0-g/test-suite/MultiSource/Applications/JM/ldecod/ldecod.reference_output /Users/buildslave/jenkins/workspace/test-suite-verify-machineinstrs-aarch64-globalisel-O0-g/test-suite-build/MultiSource/Applications/JM/ldecod/ldecod.reference_output && cd /Users/buildslave/jenkins/workspace/test-suite-verify-machineinstrs-aarch64-globalisel-O0-g/test-suite-build/MultiSource/Applications/JM/ldecod && /usr/local/Cellar/cmake/3.13.1/bin/cmake -E make_directory data && cd /Users/buildslave/jenkins/workspace/test-suite-verify-machineinstrs-aarch64-globalisel-O0-g/test-suite-build/MultiSource/Applications/JM/ldecod && /usr/local/Cellar/cmake/3.13.1/bin/cmake -E create_symlink /Users/buildslave/jenkins/workspace/test-suite-verify-machineinstrs-aarch64-globalisel-O0-g/test-suite/MultiSource/Applications/JM/ldecod/data/test.264 /Users/buildslave/jenkins/workspace/test-suite-verify-machineinstrs-aarch64-globalisel-O0-g/test-suite-build/MultiSource/Applications/JM/ldecod/data/test.264 && cd /Users/buildslave/jenkins/workspace/test-suite-verify-machineinstrs-aarch64-globalisel-O0-g/test-suite-build/MultiSource/Applications/JM/ldecod && /usr/local/Cellar/cmake/3.13.1/bin/cmake -E make_directory data && cd /Users/buildslave/jenkins/workspace/test-suite-verify-machineinstrs-aarch64-globalisel-O0-g/test-suite-build/MultiSource/Applications/JM/ldecod && /usr/local/Cellar/cmake/3.13.1/bin/cmake -E create_symlink /Users/buildslave/jenkins/workspace/test-suite-verify-machineinstrs-aarch64-globalisel-O0-g/test-suite/MultiSource/Applications/JM/ldecod/data/test_rec.yuv /Users/buildslave/jenkins/workspace/test-suite-verify-machineinstrs-aarch64-globalisel-O0-g/test-suite-build/MultiSource/Applications/JM/ldecod/data/test_rec.yuv
FAILED: MultiSource/Applications/JM/ldecod/ldecod 
: && /Users/buildslave/jenkins/workspace/test-suite-verify-machineinstrs-aarch64-globalisel-O0-g/test-suite-build/tools/timeit --summary MultiSource/Applications/JM/ldecod/ldecod.link.time /Users/buildslave/jenkins/workspace/test-suite-verify-machineinstrs-aarch64-globalisel-O0-g/compiler/bin/clang -B /Applications/Xcode.app/Contents/Developer/Toolchains/XcodeDefault.xctoolchain/usr/bin    -Wno-unused-command-line-argument -mllvm -verify-machineinstrs -O0 -g -arch arm64 -isysroot /Applications/Xcode.app/Contents/Developer/Platforms/iPhoneOS.platform/Developer/SDKs/iPhoneOS11.4.sdk -Wl,-search_paths_first -Wl,-headerpad_max_install_names -B /Applications/Xcode.app/Contents/Developer/Toolchains/XcodeDefault.xctoolchain/usr/bin MultiSource/Applications/JM/ldecod/CMakeFiles/ldecod.dir/annexb.c.o MultiSource/Applications/JM/ldecod/CMakeFiles/ldecod.dir/biaridecod.c.o MultiSource/Applications/JM/ldecod/CMakeFiles/ldecod.dir/block.c.o MultiSource/Applications/JM/ldecod/CMakeFiles/ldecod.dir/cabac.c.o MultiSource/Applications/JM/ldecod/CMakeFiles/ldecod.dir/context_ini.c.o MultiSource/Applications/JM/ldecod/CMakeFiles/ldecod.dir/erc_api.c.o MultiSource/Applications/JM/ldecod/CMakeFiles/ldecod.dir/erc_do_i.c.o MultiSource/Applications/JM/ldecod/CMakeFiles/ldecod.dir/erc_do_p.c.o MultiSource/Applications/JM/ldecod/CMakeFiles/ldecod.dir/errorconcealment.c.o MultiSource/Applications/JM/ldecod/CMakeFiles/ldecod.dir/filehandle.c.o MultiSource/Applications/JM/ldecod/CMakeFiles/ldecod.dir/fmo.c.o MultiSource/Applications/JM/ldecod/CMakeFiles/ldecod.dir/header.c.o MultiSource/Applications/JM/ldecod/CMakeFiles/ldecod.dir/image.c.o MultiSource/Applications/JM/ldecod/CMakeFiles/ldecod.dir/ldecod.c.o MultiSource/Applications/JM/ldecod/CMakeFiles/ldecod.dir/leaky_bucket.c.o MultiSource/Applications/JM/ldecod/CMakeFiles/ldecod.dir/loopFilter.c.o MultiSource/Applications/JM/ldecod/CMakeFiles/ldecod.dir/macroblock.c.o MultiSource/Applications/JM/ldecod/CMakeFiles/ldecod.dir/mb_access.c.o MultiSource/Applications/JM/ldecod/CMakeFiles/ldecod.dir/mbuffer.c.o MultiSource/Applications/JM/ldecod/CMakeFiles/ldecod.dir/memalloc.c.o MultiSource/Applications/JM/ldecod/CMakeFiles/ldecod.dir/nal.c.o MultiSource/Applications/JM/ldecod/CMakeFiles/ldecod.dir/nal_part.c.o MultiSource/Applications/JM/ldecod/CMakeFiles/ldecod.dir/nalu.c.o MultiSource/Applications/JM/ldecod/CMakeFiles/ldecod.dir/nalucommon.c.o MultiSource/Applications/JM/ldecod/CMakeFiles/ldecod.dir/output.c.o MultiSource/Applications/JM/ldecod/CMakeFiles/ldecod.dir/parset.c.o MultiSource/Applications/JM/ldecod/CMakeFiles/ldecod.dir/parsetcommon.c.o MultiSource/Applications/JM/ldecod/CMakeFiles/ldecod.dir/rtp.c.o MultiSource/Applications/JM/ldecod/CMakeFiles/ldecod.dir/sei.c.o MultiSource/Applications/JM/ldecod/CMakeFiles/ldecod.dir/transform8x8.c.o MultiSource/Applications/JM/ldecod/CMakeFiles/ldecod.dir/vlc.c.o  -o MultiSource/Applications/JM/ldecod/ldecod  -lm && cd /Users/buildslave/jenkins/workspace/test-suite-verify-machineinstrs-aarch64-globalisel-O0-g/test-suite-build/MultiSource/Applications/JM/ldecod && /usr/local/Cellar/cmake/3.13.1/bin/cmake -E create_symlink /Users/buildslave/jenkins/workspace/test-suite-verify-machineinstrs-aarch64-globalisel-O0-g/test-suite/MultiSource/Applications/JM/ldecod/ldecod.reference_output /Users/buildslave/jenkins/workspace/test-suite-verify-machineinstrs-aarch64-globalisel-O0-g/test-suite-build/MultiSource/Applications/JM/ldecod/ldecod.reference_output && cd /Users/buildslave/jenkins/workspace/test-suite-verify-machineinstrs-aarch64-globalisel-O0-g/test-suite-build/MultiSource/Applications/JM/ldecod && /usr/local/Cellar/cmake/3.13.1/bin/cmake -E make_directory data && cd /Users/buildslave/jenkins/workspace/test-suite-verify-machineinstrs-aarch64-globalisel-O0-g/test-suite-build/MultiSource/Applications/JM/ldecod && /usr/local/Cellar/cmake/3.13.1/bin/cmake -E create_symlink /Users/buildslave/jenkins/workspace/test-suite-verify-machineinstrs-aarch64-globalisel-O0-g/test-suite/MultiSource/Applications/JM/ldecod/data/test.264 /Users/buildslave/jenkins/workspace/test-suite-verify-machineinstrs-aarch64-globalisel-O0-g/test-suite-build/MultiSource/Applications/JM/ldecod/data/test.264 && cd /Users/buildslave/jenkins/workspace/test-suite-verify-machineinstrs-aarch64-globalisel-O0-g/test-suite-build/MultiSource/Applications/JM/ldecod && /usr/local/Cellar/cmake/3.13.1/bin/cmake -E make_directory data && cd /Users/buildslave/jenkins/workspace/test-suite-verify-machineinstrs-aarch64-globalisel-O0-g/test-suite-build/MultiSource/Applications/JM/ldecod && /usr/local/Cellar/cmake/3.13.1/bin/cmake -E create_symlink /Users/buildslave/jenkins/workspace/test-suite-verify-machineinstrs-aarch64-globalisel-O0-g/test-suite/MultiSource/Applications/JM/ldecod/data/test_rec.yuv /Users/buildslave/jenkins/workspace/test-suite-verify-machineinstrs-aarch64-globalisel-O0-g/test-suite-build/MultiSource/Applications/JM/ldecod/data/test_rec.yuv
duplicate symbol _qmatrix in:
Ninja target: IRSmk
[6237/8583] /Users/buildslave/jenkins/workspace/test-suite-verify-machineinstrs-aarch64-globalisel-O0-g/test-suite-build/tools/timeit --summary MultiSource/Benchmarks/BitBench/drop3/CMakeFiles/drop3.dir/drop3.c.o.time /Users/buildslave/jenkins/workspace/test-suite-verify-machineinstrs-aarch64-globalisel-O0-g/compiler/bin/clang -DNDEBUG  -B /Applications/Xcode.app/Contents/Developer/Toolchains/XcodeDefault.xctoolchain/usr/bin    -Wno-unused-command-line-argument -mllvm -verify-machineinstrs -O0 -g -arch arm64 -isysroot /Applications/Xcode.app/Contents/Developer/Platforms/iPhoneOS.platform/Developer/SDKs/iPhoneOS11.4.sdk   -w -Werror=date-time -MD -MT MultiSource/Benchmarks/BitBench/drop3/CMakeFiles/drop3.dir/drop3.c.o -MF MultiSource/Benchmarks/BitBench/drop3/CMakeFiles/drop3.dir/drop3.c.o.d -o MultiSource/Benchmarks/BitBench/drop3/CMakeFiles/drop3.dir/drop3.c.o   -c /Users/buildslave/jenkins/workspace/test-suite-verify-machineinstrs-aarch64-globalisel-O0-g/test-suite/MultiSource/Benchmarks/BitBench/drop3/drop3.c
[6238/8583] /Users/buildslave/jenkins/workspace/test-suite-verify-machineinstrs-aarch64-globalisel-O0-g/test-suite-build/tools/timeit --summary MultiSource/Benchmarks/BitBench/uudecode/CMakeFiles/uudecode.dir/uudecode.c.o.time /Users/buildslave/jenkins/workspace/test-suite-verify-machineinstrs-aarch64-globalisel-O0-g/compiler/bin/clang -DNDEBUG  -B /Applications/Xcode.app/Contents/Developer/Toolchains/XcodeDefault.xctoolchain/usr/bin    -Wno-unused-command-line-argument -mllvm -verify-machineinstrs -O0 -g -arch arm64 -isysroot /Applications/Xcode.app/Contents/Developer/Platforms/iPhoneOS.platform/Developer/SDKs/iPhoneOS11.4.sdk   -w -Werror=date-time -MD -MT MultiSource/Benchmarks/BitBench/uudecode/CMakeFiles/uudecode.dir/uudecode.c.o -MF MultiSource/Benchmarks/BitBench/uudecode/CMakeFiles/uudecode.dir/uudecode.c.o.d -o MultiSource/Benchmarks/BitBench/uudecode/CMakeFiles/uudecode.dir/uudecode.c.o   -c /Users/buildslave/jenkins/workspace/test-suite-verify-machineinstrs-aarch64-globalisel-O0-g/test-suite/MultiSource/Benchmarks/BitBench/uudecode/uudecode.c
[6239/8583] /Users/buildslave/jenkins/workspace/test-suite-verify-machineinstrs-aarch64-globalisel-O0-g/test-suite-build/tools/timeit --summary MultiSource/Benchmarks/BitBench/uuencode/CMakeFiles/uuencode.dir/uuencode.c.o.time /Users/buildslave/jenkins/workspace/test-suite-verify-machineinstrs-aarch64-globalisel-O0-g/compiler/bin/clang -DNDEBUG  -B /Applications/Xcode.app/Contents/Developer/Toolchains/XcodeDefault.xctoolchain/usr/bin    -Wno-unused-command-line-argument -mllvm -verify-machineinstrs -O0 -g -arch arm64 -isysroot /Applications/Xcode.app/Contents/Developer/Platforms/iPhoneOS.platform/Developer/SDKs/iPhoneOS11.4.sdk   -w -Werror=date-time -MD -MT MultiSource/Benchmarks/BitBench/uuencode/CMakeFiles/uuencode.dir/uuencode.c.o -MF MultiSource/Benchmarks/BitBench/uuencode/CMakeFiles/uuencode.dir/uuencode.c.o.d -o MultiSource/Benchmarks/BitBench/uuencode/CMakeFiles/uuencode.dir/uuencode.c.o   -c /Users/buildslave/jenkins/workspace/test-suite-verify-machineinstrs-aarch64-globalisel-O0-g/test-suite/MultiSource/Benchmarks/BitBench/uuencode/uuencode.c
[6240/8583] /Users/buildslave/jenkins/workspace/test-suite-verify-machineinstrs-aarch64-globalisel-O0-g/test-suite-build/tools/timeit --summary MultiSource/Benchmarks/Fhourstones/CMakeFiles/fhourstones.dir/play.c.o.time /Users/buildslave/jenkins/workspace/test-suite-verify-machineinstrs-aarch64-globalisel-O0-g/compiler/bin/clang -DNDEBUG  -B /Applications/Xcode.app/Contents/Developer/Toolchains/XcodeDefault.xctoolchain/usr/bin    -Wno-unused-command-line-argument -mllvm -verify-machineinstrs -O0 -g -arch arm64 -isysroot /Applications/Xcode.app/Contents/Developer/Platforms/iPhoneOS.platform/Developer/SDKs/iPhoneOS11.4.sdk   -w -Werror=date-time -DUNIX -DTRANSIZE=1050011 -DPROBES=8 -DREPORTPLY=8 -MD -MT MultiSource/Benchmarks/Fhourstones/CMakeFiles/fhourstones.dir/play.c.o -MF MultiSource/Benchmarks/Fhourstones/CMakeFiles/fhourstones.dir/play.c.o.d -o MultiSource/Benchmarks/Fhourstones/CMakeFiles/fhourstones.dir/play.c.o   -c /Users/buildslave/jenkins/workspace/test-suite-verify-machineinstrs-aarch64-globalisel-O0-g/test-suite/MultiSource/Benchmarks/Fhourstones/play.c
[6241/8583] : && /Users/buildslave/jenkins/workspace/test-suite-verify-machineinstrs-aarch64-globalisel-O0-g/test-suite-build/tools/timeit --summary MultiSource/Benchmarks/ASC_Sequoia/IRSmk/IRSmk.link.time /Users/buildslave/jenkins/workspace/test-suite-verify-machineinstrs-aarch64-globalisel-O0-g/compiler/bin/clang -B /Applications/Xcode.app/Contents/Developer/Toolchains/XcodeDefault.xctoolchain/usr/bin    -Wno-unused-command-line-argument -mllvm -verify-machineinstrs -O0 -g -arch arm64 -isysroot /Applications/Xcode.app/Contents/Developer/Platforms/iPhoneOS.platform/Developer/SDKs/iPhoneOS11.4.sdk -Wl,-search_paths_first -Wl,-headerpad_max_install_names -B /Applications/Xcode.app/Contents/Developer/Toolchains/XcodeDefault.xctoolchain/usr/bin MultiSource/Benchmarks/ASC_Sequoia/IRSmk/CMakeFiles/IRSmk.dir/main.c.o MultiSource/Benchmarks/ASC_Sequoia/IRSmk/CMakeFiles/IRSmk.dir/rmatmult3.c.o MultiSource/Benchmarks/ASC_Sequoia/IRSmk/CMakeFiles/IRSmk.dir/utility.c.o  -o MultiSource/Benchmarks/ASC_Sequoia/IRSmk/IRSmk  -lm && cd /Users/buildslave/jenkins/workspace/test-suite-verify-machineinstrs-aarch64-globalisel-O0-g/test-suite-build/MultiSource/Benchmarks/ASC_Sequoia/IRSmk && /usr/local/Cellar/cmake/3.13.1/bin/cmake -E create_symlink /Users/buildslave/jenkins/workspace/test-suite-verify-machineinstrs-aarch64-globalisel-O0-g/test-suite/MultiSource/Benchmarks/ASC_Sequoia/IRSmk/IRSmk.reference_output /Users/buildslave/jenkins/workspace/test-suite-verify-machineinstrs-aarch64-globalisel-O0-g/test-suite-build/MultiSource/Benchmarks/ASC_Sequoia/IRSmk/IRSmk.reference_output && cd /Users/buildslave/jenkins/workspace/test-suite-verify-machineinstrs-aarch64-globalisel-O0-g/test-suite-build/MultiSource/Benchmarks/ASC_Sequoia/IRSmk && /usr/local/Cellar/cmake/3.13.1/bin/cmake -E create_symlink /Users/buildslave/jenkins/workspace/test-suite-verify-machineinstrs-aarch64-globalisel-O0-g/test-suite/MultiSource/Benchmarks/ASC_Sequoia/IRSmk/irsmk_input /Users/buildslave/jenkins/workspace/test-suite-verify-machineinstrs-aarch64-globalisel-O0-g/test-suite-build/MultiSource/Benchmarks/ASC_Sequoia/IRSmk/irsmk_input
FAILED: MultiSource/Benchmarks/ASC_Sequoia/IRSmk/IRSmk 
: && /Users/buildslave/jenkins/workspace/test-suite-verify-machineinstrs-aarch64-globalisel-O0-g/test-suite-build/tools/timeit --summary MultiSource/Benchmarks/ASC_Sequoia/IRSmk/IRSmk.link.time /Users/buildslave/jenkins/workspace/test-suite-verify-machineinstrs-aarch64-globalisel-O0-g/compiler/bin/clang -B /Applications/Xcode.app/Contents/Developer/Toolchains/XcodeDefault.xctoolchain/usr/bin    -Wno-unused-command-line-argument -mllvm -verify-machineinstrs -O0 -g -arch arm64 -isysroot /Applications/Xcode.app/Contents/Developer/Platforms/iPhoneOS.platform/Developer/SDKs/iPhoneOS11.4.sdk -Wl,-search_paths_first -Wl,-headerpad_max_install_names -B /Applications/Xcode.app/Contents/Developer/Toolchains/XcodeDefault.xctoolchain/usr/bin MultiSource/Benchmarks/ASC_Sequoia/IRSmk/CMakeFiles/IRSmk.dir/main.c.o MultiSource/Benchmarks/ASC_Sequoia/IRSmk/CMakeFiles/IRSmk.dir/rmatmult3.c.o MultiSource/Benchmarks/ASC_Sequoia/IRSmk/CMakeFiles/IRSmk.dir/utility.c.o  -o MultiSource/Benchmarks/ASC_Sequoia/IRSmk/IRSmk  -lm && cd /Users/buildslave/jenkins/workspace/test-suite-verify-machineinstrs-aarch64-globalisel-O0-g/test-suite-build/MultiSource/Benchmarks/ASC_Sequoia/IRSmk && /usr/local/Cellar/cmake/3.13.1/bin/cmake -E create_symlink /Users/buildslave/jenkins/workspace/test-suite-verify-machineinstrs-aarch64-globalisel-O0-g/test-suite/MultiSource/Benchmarks/ASC_Sequoia/IRSmk/IRSmk.reference_output /Users/buildslave/jenkins/workspace/test-suite-verify-machineinstrs-aarch64-globalisel-O0-g/test-suite-build/MultiSource/Benchmarks/ASC_Sequoia/IRSmk/IRSmk.reference_output && cd /Users/buildslave/jenkins/workspace/test-suite-verify-machineinstrs-aarch64-globalisel-O0-g/test-suite-build/MultiSource/Benchmarks/ASC_Sequoia/IRSmk && /usr/local/Cellar/cmake/3.13.1/bin/cmake -E create_symlink /Users/buildslave/jenkins/workspace/test-suite-verify-machineinstrs-aarch64-globalisel-O0-g/test-suite/MultiSource/Benchmarks/ASC_Sequoia/IRSmk/irsmk_input /Users/buildslave/jenkins/workspace/test-suite-verify-machineinstrs-aarch64-globalisel-O0-g/test-suite-build/MultiSource/Benchmarks/ASC_Sequoia/IRSmk/irsmk_input
duplicate symbol _kmax in:
... (limited to first 12 issues)

Build Log

Changes
  1. [obj2yaml] - Split sections dumping to a new ELFDumper<ELFT>::dumpSections() method. (details)
  2. [NFC][InstCombine] Add test with non-CSE'd casts of load (details)
  3. [obj2yaml] - Dump allocatable SHT_STRTAB, SHT_SYMTAB and SHT_DYNSYM sections. (details)
  4. [Driver] Default to -fno-common for all targets (details)
  5. Revert "[mlir][ods] Add query for derived attribute" (details)
  6. [AVR] Fix incorrect register state for LDRdPtr (details)

Started by upstream project relay-test-suite-verify-machineinstrs build number 7244
originally caused by:

This run spent:

  • 6 min 47 sec waiting;
  • 25 min build duration;
  • 25 min total from scheduled to completion.
Revision: 62983613a0def0859fdcc823e385202f7f6101b5
  • refs/remotes/origin/master
Revision: 4e3b037665fd596b1a7ea0774d6e2b30266dc65c
  • detached
Revision: e630ecf2f321b7a37e915a51088983bb109f0d6a
  • refs/remotes/origin/master
Revision: 0305e56e7bf5cf4be75b1a557fa72b37fe063572
  • refs/remotes/origin/master

Identified problems

Ninja target failed

Below is a link to the first failed ninja target.
Indication 1

Compile Error

This build failed because of a compile error. Below is a list of all errors in the build log:
Indication 2

Link error

A link command has failed:
Indication 3